{
 "oeselftest_opensuseleap-16.0_qemux86-64_20260415182329": {
  "configuration": {
   "HOST_DISTRO": "opensuseleap-16.0",
   "HOST_NAME": "opensuse160-vk-2",
   "LAYERS": {
    "meta": {
     "branch": "mathieu/master-next",
     "commit": "d257824ed37b4ba77fb400a908b915d488da3843",
     "commit_count": 66860,
     "commit_time": 1776248269
    },
    "meta-poky": {
     "branch": "contrib/mathieu/master-next",
     "commit": "faf71d3c54d407e574a01019a505bf235edd0a0d",
     "commit_count": 1785,
     "commit_time": 1776147774
    },
    "meta-selftest": {
     "branch": "mathieu/master-next",
     "commit": "d257824ed37b4ba77fb400a908b915d488da3843",
     "commit_count": 66860,
     "commit_time": 1776248269
    },
    "meta-yocto-bsp": {
     "branch": "contrib/mathieu/master-next",
     "commit": "faf71d3c54d407e574a01019a505bf235edd0a0d",
     "commit_count": 1785,
     "commit_time": 1776147774
    }
   },
   "MACHINE": "qemux86-64",
   "OESELFTEST_METADATA": {
    "exclude_tags": null,
    "run_all_tests": true,
    "run_tests": null,
    "select_tags": [
     "yocto-mirrors"
    ],
    "skips": null
   },
   "STARTTIME": "20260415182329",
   "TEST_TYPE": "oeselftest"
  },
  "result": {
   "buildoptions.SourceMirroring.test_yocto_source_mirror": {
    "duration": 230.67579340934753,
    "oetags": [
     "yocto-mirrors"
    ],
    "status": "PASSED"
   },
   "sstatetests.SStateMirrors.test_cdn_mirror_qemuarm64": {
    "duration": 433.54352474212646,
    "log": "testtools.testresult.real._StringException: Traceback (most recent call last):\n  File \"/srv/pokybuild/yocto-worker/a-full/build/layers/openembedded-core/meta/lib/oeqa/selftest/cases/sstatetests.py\", line 984, in test_cdn_mirror_qemuarm64\n    self.run_test(\"qemuarm64\", \"core-image-minimal core-image-full-cmdline core-image-sato-sdk\", exceptions)\n    ~~~~~~~~~~~~~^^^^^^^^^^^^^^^^^^^^^^^^^^^^^^^^^^^^^^^^^^^^^^^^^^^^^^^^^^^^^^^^^^^^^^^^^^^^^^^^^^^^^^^^^^^\n  File \"/srv/pokybuild/yocto-worker/a-full/build/layers/openembedded-core/meta/lib/oeqa/selftest/cases/sstatetests.py\", line 974, in run_test\n    self.check_bb_output(result.output, targets, exceptions, check_cdn)\n    ~~~~~~~~~~~~~~~~~~~~^^^^^^^^^^^^^^^^^^^^^^^^^^^^^^^^^^^^^^^^^^^^^^^\n  File \"/srv/pokybuild/yocto-worker/a-full/build/layers/openembedded-core/meta/lib/oeqa/selftest/cases/sstatetests.py\", line 954, in check_bb_output\n    self.assertEqual(len(failed_urls), 0, \"Missing objects in the cache:\\n{}\\nFetcher diagnostics:\\n{}\".format(\"\\n\".join(failed_urls), \"\\n\".join(failed_urls_extrainfo)))\n    ~~~~~~~~~~~~~~~~^^^^^^^^^^^^^^^^^^^^^^^^^^^^^^^^^^^^^^^^^^^^^^^^^^^^^^^^^^^^^^^^^^^^^^^^^^^^^^^^^^^^^^^^^^^^^^^^^^^^^^^^^^^^^^^^^^^^^^^^^^^^^^^^^^^^^^^^^^^^^^^^^^^^^\n  File \"/usr/lib64/python3.13/unittest/case.py\", line 907, in assertEqual\n    assertion_func(first, second, msg=msg)\n    ~~~~~~~~~~~~~~^^^^^^^^^^^^^^^^^^^^^^^^\n  File \"/usr/lib64/python3.13/unittest/case.py\", line 900, in _baseAssertEqual\n    raise self.failureException(msg)\nAssertionError: 7 != 0 : Missing objects in the cache:\nfile://26/bc/sstate:rust:cortexa57-poky-linux:1.94.1:r0:cortexa57:14:26bc1aa533028917fcf6e9317f205d089beff84cd0c1de7e1d7ed65c1d3a2db5_package_qa.tar.zst\nfile://0c/ec/sstate:rust:cortexa57-poky-linux:1.94.1:r0:cortexa57:14:0cec054c007647ba909d117d208d2918c3a094821638cc344ac5b03fd9bec91e_package_write_rpm.tar.zst\nfile://f5/46/sstate:rust:cortexa57-poky-linux:1.94.1:r0:cortexa57:14:f546eb72de781422d482a6bbd1fa294629dabfc8647aaf23d8888fd9a9fe2483_create_spdx.tar.zst\nfile://cc/a4/sstate:rust:cortexa57-poky-linux:1.94.1:r0:cortexa57:14:cca47f75dbbc3e6a0b75e515aea17fbe7c1e6d16204088cdd75520ba95ab3a38_packagedata.tar.zst\nfile://54/43/sstate:rust:cortexa57-poky-linux:1.94.1:r0:cortexa57:14:5443363862575eb23c232299347ec786539efc11b3649df2bfb00807ddf9a6a7_create_package_spdx.tar.zst\nfile://0c/a5/sstate:rust:cortexa57-poky-linux:1.94.1:r0:cortexa57:14:0ca56ea030a77badc14fdb0582a45bddcefd1357038e5fff9a4c8057c20eadb3_populate_sysroot.tar.zst\nfile://4c/0c/sstate:rust:cortexa57-poky-linux:1.94.1:r0:cortexa57:14:4c0c2139487fd29c2e912f0ee8146a2ee03bf1f062e8993806f77a17d05f1da1_package.tar.zst\nFetcher diagnostics:\nDEBUG: checkstatus() urlopen failed for http://sstate.yoctoproject.org/all/26/bc/sstate%3Arust%3Acortexa57-poky-linux%3A1.94.1%3Ar0%3Acortexa57%3A14%3A26bc1aa533028917fcf6e9317f205d089beff84cd0c1de7e1d7ed65c1d3a2db5_package_qa.tar.zst: HTTP Error 404: Not Found\nDEBUG: checkstatus() urlopen failed for http://sstate.yoctoproject.org/all/0c/ec/sstate%3Arust%3Acortexa57-poky-linux%3A1.94.1%3Ar0%3Acortexa57%3A14%3A0cec054c007647ba909d117d208d2918c3a094821638cc344ac5b03fd9bec91e_package_write_rpm.tar.zst: HTTP Error 404: Not Found\nDEBUG: checkstatus() urlopen failed for http://sstate.yoctoproject.org/all/f5/46/sstate%3Arust%3Acortexa57-poky-linux%3A1.94.1%3Ar0%3Acortexa57%3A14%3Af546eb72de781422d482a6bbd1fa294629dabfc8647aaf23d8888fd9a9fe2483_create_spdx.tar.zst: HTTP Error 404: Not Found\nDEBUG: checkstatus() urlopen failed for http://sstate.yoctoproject.org/all/cc/a4/sstate%3Arust%3Acortexa57-poky-linux%3A1.94.1%3Ar0%3Acortexa57%3A14%3Acca47f75dbbc3e6a0b75e515aea17fbe7c1e6d16204088cdd75520ba95ab3a38_packagedata.tar.zst: HTTP Error 404: Not Found\nDEBUG: checkstatus() urlopen failed for http://sstate.yoctoproject.org/all/54/43/sstate%3Arust%3Acortexa57-poky-linux%3A1.94.1%3Ar0%3Acortexa57%3A14%3A5443363862575eb23c232299347ec786539efc11b3649df2bfb00807ddf9a6a7_create_package_spdx.tar.zst: HTTP Error 404: Not Found\nDEBUG: checkstatus() urlopen failed for http://sstate.yoctoproject.org/all/0c/a5/sstate%3Arust%3Acortexa57-poky-linux%3A1.94.1%3Ar0%3Acortexa57%3A14%3A0ca56ea030a77badc14fdb0582a45bddcefd1357038e5fff9a4c8057c20eadb3_populate_sysroot.tar.zst: HTTP Error 404: Not Found\nDEBUG: checkstatus() urlopen failed for http://sstate.yoctoproject.org/all/4c/0c/sstate%3Arust%3Acortexa57-poky-linux%3A1.94.1%3Ar0%3Acortexa57%3A14%3A4c0c2139487fd29c2e912f0ee8146a2ee03bf1f062e8993806f77a17d05f1da1_package.tar.zst: HTTP Error 404: Not Found\n\n\nStderr:\n2026-04-15 18:23:32,013 - oe-selftest - INFO - Adding: \"include selftest.inc\" in /srv/pokybuild/yocto-worker/a-full/build/build-st-1603814/conf/local.conf\n2026-04-15 18:23:32,013 - oe-selftest - INFO - Adding: \"include bblayers.inc\" in bblayers.conf\n",
    "oetags": [
     "yocto-mirrors"
    ],
    "status": "FAILED"
   },
   "sstatetests.SStateMirrors.test_cdn_mirror_qemux86_64": {
    "duration": 380.5786130428314,
    "log": "testtools.testresult.real._StringException: Traceback (most recent call last):\n  File \"/srv/pokybuild/yocto-worker/a-full/build/layers/openembedded-core/meta/lib/oeqa/selftest/cases/sstatetests.py\", line 979, in test_cdn_mirror_qemux86_64\n    self.run_test(\"qemux86-64\", \"core-image-minimal core-image-full-cmdline core-image-sato-sdk\", exceptions)\n    ~~~~~~~~~~~~~^^^^^^^^^^^^^^^^^^^^^^^^^^^^^^^^^^^^^^^^^^^^^^^^^^^^^^^^^^^^^^^^^^^^^^^^^^^^^^^^^^^^^^^^^^^^\n  File \"/srv/pokybuild/yocto-worker/a-full/build/layers/openembedded-core/meta/lib/oeqa/selftest/cases/sstatetests.py\", line 974, in run_test\n    self.check_bb_output(result.output, targets, exceptions, check_cdn)\n    ~~~~~~~~~~~~~~~~~~~~^^^^^^^^^^^^^^^^^^^^^^^^^^^^^^^^^^^^^^^^^^^^^^^\n  File \"/srv/pokybuild/yocto-worker/a-full/build/layers/openembedded-core/meta/lib/oeqa/selftest/cases/sstatetests.py\", line 954, in check_bb_output\n    self.assertEqual(len(failed_urls), 0, \"Missing objects in the cache:\\n{}\\nFetcher diagnostics:\\n{}\".format(\"\\n\".join(failed_urls), \"\\n\".join(failed_urls_extrainfo)))\n    ~~~~~~~~~~~~~~~~^^^^^^^^^^^^^^^^^^^^^^^^^^^^^^^^^^^^^^^^^^^^^^^^^^^^^^^^^^^^^^^^^^^^^^^^^^^^^^^^^^^^^^^^^^^^^^^^^^^^^^^^^^^^^^^^^^^^^^^^^^^^^^^^^^^^^^^^^^^^^^^^^^^^^\n  File \"/usr/lib64/python3.13/unittest/case.py\", line 907, in assertEqual\n    assertion_func(first, second, msg=msg)\n    ~~~~~~~~~~~~~~^^^^^^^^^^^^^^^^^^^^^^^^\n  File \"/usr/lib64/python3.13/unittest/case.py\", line 900, in _baseAssertEqual\n    raise self.failureException(msg)\nAssertionError: 13 != 0 : Missing objects in the cache:\nfile://ea/94/sstate:mesa-demos:x86-64-v3-poky-linux:9.0.0:r0:x86-64-v3:14:ea9492d1328bee25d1a2776b71c1b62cf71a5d41a730104c7404f55639382881_package_qa.tar.zst\nfile://7a/78/sstate:packagegroup-core-tools-testapps:qemux86_64-poky-linux:1.0:r0:qemux86_64:14:7a780a2c728ef7096af0cb87d48806b4d5a6b1cf94f9d270fda9575a5ff8d229_package_write_rpm.tar.zst\nfile://56/38/sstate:mesa-demos:x86-64-v3-poky-linux:9.0.0:r0:x86-64-v3:14:563808f783f507c49e4330f83d48bda0ce5e4ef7e6de278e4d015f72190a2fda_create_spdx.tar.zst\nfile://22/40/sstate:packagegroup-core-tools-testapps:qemux86_64-poky-linux:1.0:r0:qemux86_64:14:22409ee3affc14c66d58fe749245d58a5b703b7b221139ff56e53c939db29886_package_write_ipk.tar.zst\nfile://a6/87/sstate:packagegroup-core-tools-testapps:qemux86_64-poky-linux:1.0:r0:qemux86_64:14:a687b9208e18f67f77d7ca167d6ec24eb7d86b2da1ac41ac174d4e6e27df228b_create_package_spdx.tar.zst\nfile://fb/fe/sstate:packagegroup-core-tools-testapps:qemux86_64-poky-linux:1.0:r0:qemux86_64:14:fbfe5507e64882c39e6c583ad58e20a649e6c36044e30eb9f341822bf17b17a4_package_qa.tar.zst\nfile://e6/00/sstate:mesa-demos:x86-64-v3-poky-linux:9.0.0:r0:x86-64-v3:14:e600cad85743c9b37ffdfd8c53a462c1a05434593b3d123131a4b0ff806fdda2_populate_sysroot.tar.zst\nfile://6d/bc/sstate:mesa-demos:x86-64-v3-poky-linux:9.0.0:r0:x86-64-v3:14:6dbca1dc6ba112efb0aab5a40752745f4010a6434e2e2a67ea6ac9ec45a377b3_package.tar.zst\nfile://73/63/sstate:mesa-demos:x86-64-v3-poky-linux:9.0.0:r0:x86-64-v3:14:7363cf1ec5dfe88099d1b86e67071cf11439ae26cc1797e0a00b14d0e4ee25c3_package_write_rpm.tar.zst\nfile://f5/bb/sstate:packagegroup-core-tools-testapps:qemux86_64-poky-linux:1.0:r0:qemux86_64:14:f5bbe56fc5962e7c722587660d5cb65e490b5567002c341e0c84c406a351fee4_package_write_deb.tar.zst\nfile://9f/12/sstate:mesa-demos:x86-64-v3-poky-linux:9.0.0:r0:x86-64-v3:14:9f124ed4beb1ee49c02c4ebdf5542ed809e04d8944e44b4b2f7364bfc82ec252_packagedata.tar.zst\nfile://5e/3f/sstate:rust:x86-64-v3-poky-linux:1.94.1:r0:x86-64-v3:14:5e3ff72c607b416242f9e528181a00080a67fdb8df854982cc2c51fa84238622_create_package_spdx.tar.zst\nfile://e3/1d/sstate:mesa-demos:x86-64-v3-poky-linux:9.0.0:r0:x86-64-v3:14:e31d4810c0fb95960ea48b8b6b8c6ebbbb48ea34ecfba2c2d59317a030538839_create_package_spdx.tar.zst\nFetcher diagnostics:\nDEBUG: checkstatus() urlopen failed for http://sstate.yoctoproject.org/all/ea/94/sstate%3Amesa-demos%3Ax86-64-v3-poky-linux%3A9.0.0%3Ar0%3Ax86-64-v3%3A14%3Aea9492d1328bee25d1a2776b71c1b62cf71a5d41a730104c7404f55639382881_package_qa.tar.zst: HTTP Error 404: Not Found\nDEBUG: checkstatus() urlopen failed for http://sstate.yoctoproject.org/all/7a/78/sstate%3Apackagegroup-core-tools-testapps%3Aqemux86_64-poky-linux%3A1.0%3Ar0%3Aqemux86_64%3A14%3A7a780a2c728ef7096af0cb87d48806b4d5a6b1cf94f9d270fda9575a5ff8d229_package_write_rpm.tar.zst: HTTP Error 404: Not Found\nDEBUG: checkstatus() urlopen failed for http://sstate.yoctoproject.org/all/56/38/sstate%3Amesa-demos%3Ax86-64-v3-poky-linux%3A9.0.0%3Ar0%3Ax86-64-v3%3A14%3A563808f783f507c49e4330f83d48bda0ce5e4ef7e6de278e4d015f72190a2fda_create_spdx.tar.zst: HTTP Error 404: Not Found\nDEBUG: checkstatus() urlopen failed for http://sstate.yoctoproject.org/all/22/40/sstate%3Apackagegroup-core-tools-testapps%3Aqemux86_64-poky-linux%3A1.0%3Ar0%3Aqemux86_64%3A14%3A22409ee3affc14c66d58fe749245d58a5b703b7b221139ff56e53c939db29886_package_write_ipk.tar.zst: HTTP Error 404: Not Found\nDEBUG: checkstatus() urlopen failed for http://sstate.yoctoproject.org/all/a6/87/sstate%3Apackagegroup-core-tools-testapps%3Aqemux86_64-poky-linux%3A1.0%3Ar0%3Aqemux86_64%3A14%3Aa687b9208e18f67f77d7ca167d6ec24eb7d86b2da1ac41ac174d4e6e27df228b_create_package_spdx.tar.zst: HTTP Error 404: Not Found\nDEBUG: checkstatus() urlopen failed for http://sstate.yoctoproject.org/all/fb/fe/sstate%3Apackagegroup-core-tools-testapps%3Aqemux86_64-poky-linux%3A1.0%3Ar0%3Aqemux86_64%3A14%3Afbfe5507e64882c39e6c583ad58e20a649e6c36044e30eb9f341822bf17b17a4_package_qa.tar.zst: HTTP Error 404: Not Found\nDEBUG: checkstatus() urlopen failed for http://sstate.yoctoproject.org/all/e6/00/sstate%3Amesa-demos%3Ax86-64-v3-poky-linux%3A9.0.0%3Ar0%3Ax86-64-v3%3A14%3Ae600cad85743c9b37ffdfd8c53a462c1a05434593b3d123131a4b0ff806fdda2_populate_sysroot.tar.zst: HTTP Error 404: Not Found\nDEBUG: checkstatus() urlopen failed for http://sstate.yoctoproject.org/all/6d/bc/sstate%3Amesa-demos%3Ax86-64-v3-poky-linux%3A9.0.0%3Ar0%3Ax86-64-v3%3A14%3A6dbca1dc6ba112efb0aab5a40752745f4010a6434e2e2a67ea6ac9ec45a377b3_package.tar.zst: HTTP Error 404: Not Found\nDEBUG: checkstatus() urlopen failed for http://sstate.yoctoproject.org/all/73/63/sstate%3Amesa-demos%3Ax86-64-v3-poky-linux%3A9.0.0%3Ar0%3Ax86-64-v3%3A14%3A7363cf1ec5dfe88099d1b86e67071cf11439ae26cc1797e0a00b14d0e4ee25c3_package_write_rpm.tar.zst: HTTP Error 404: Not Found\nDEBUG: checkstatus() urlopen failed for http://sstate.yoctoproject.org/all/f5/bb/sstate%3Apackagegroup-core-tools-testapps%3Aqemux86_64-poky-linux%3A1.0%3Ar0%3Aqemux86_64%3A14%3Af5bbe56fc5962e7c722587660d5cb65e490b5567002c341e0c84c406a351fee4_package_write_deb.tar.zst: HTTP Error 404: Not Found\nDEBUG: checkstatus() urlopen failed for http://sstate.yoctoproject.org/all/9f/12/sstate%3Amesa-demos%3Ax86-64-v3-poky-linux%3A9.0.0%3Ar0%3Ax86-64-v3%3A14%3A9f124ed4beb1ee49c02c4ebdf5542ed809e04d8944e44b4b2f7364bfc82ec252_packagedata.tar.zst: HTTP Error 404: Not Found\nDEBUG: checkstatus() urlopen failed for http://sstate.yoctoproject.org/all/5e/3f/sstate%3Arust%3Ax86-64-v3-poky-linux%3A1.94.1%3Ar0%3Ax86-64-v3%3A14%3A5e3ff72c607b416242f9e528181a00080a67fdb8df854982cc2c51fa84238622_create_package_spdx.tar.zst: HTTP Error 404: Not Found\nDEBUG: checkstatus() urlopen failed for http://sstate.yoctoproject.org/all/e3/1d/sstate%3Amesa-demos%3Ax86-64-v3-poky-linux%3A9.0.0%3Ar0%3Ax86-64-v3%3A14%3Ae31d4810c0fb95960ea48b8b6b8c6ebbbb48ea34ecfba2c2d59317a030538839_create_package_spdx.tar.zst: HTTP Error 404: Not Found\n\n\nStderr:\n2026-04-15 18:23:32,013 - oe-selftest - INFO - Adding: \"include selftest.inc\" in /srv/pokybuild/yocto-worker/a-full/build/build-st-1603814/conf/local.conf\n2026-04-15 18:23:32,013 - oe-selftest - INFO - Adding: \"include bblayers.inc\" in bblayers.conf\n",
    "oetags": [
     "yocto-mirrors"
    ],
    "status": "FAILED"
   },
   "sstatetests.SStateMirrors.test_local_cache_qemuarm64": {
    "duration": 125.16184306144714,
    "log": "testtools.testresult.real._StringException: Traceback (most recent call last):\n  File \"/srv/pokybuild/yocto-worker/a-full/build/layers/openembedded-core/meta/lib/oeqa/selftest/cases/sstatetests.py\", line 992, in test_local_cache_qemuarm64\n    self.run_test(\"qemuarm64\", \"core-image-minimal core-image-full-cmdline core-image-sato-sdk\", exceptions, check_cdn = False)\n    ~~~~~~~~~~~~~^^^^^^^^^^^^^^^^^^^^^^^^^^^^^^^^^^^^^^^^^^^^^^^^^^^^^^^^^^^^^^^^^^^^^^^^^^^^^^^^^^^^^^^^^^^^^^^^^^^^^^^^^^^^^^\n  File \"/srv/pokybuild/yocto-worker/a-full/build/layers/openembedded-core/meta/lib/oeqa/selftest/cases/sstatetests.py\", line 974, in run_test\n    self.check_bb_output(result.output, targets, exceptions, check_cdn)\n    ~~~~~~~~~~~~~~~~~~~~^^^^^^^^^^^^^^^^^^^^^^^^^^^^^^^^^^^^^^^^^^^^^^^\n  File \"/srv/pokybuild/yocto-worker/a-full/build/layers/openembedded-core/meta/lib/oeqa/selftest/cases/sstatetests.py\", line 954, in check_bb_output\n    self.assertEqual(len(failed_urls), 0, \"Missing objects in the cache:\\n{}\\nFetcher diagnostics:\\n{}\".format(\"\\n\".join(failed_urls), \"\\n\".join(failed_urls_extrainfo)))\n    ~~~~~~~~~~~~~~~~^^^^^^^^^^^^^^^^^^^^^^^^^^^^^^^^^^^^^^^^^^^^^^^^^^^^^^^^^^^^^^^^^^^^^^^^^^^^^^^^^^^^^^^^^^^^^^^^^^^^^^^^^^^^^^^^^^^^^^^^^^^^^^^^^^^^^^^^^^^^^^^^^^^^^\n  File \"/usr/lib64/python3.13/unittest/case.py\", line 907, in assertEqual\n    assertion_func(first, second, msg=msg)\n    ~~~~~~~~~~~~~~^^^^^^^^^^^^^^^^^^^^^^^^\n  File \"/usr/lib64/python3.13/unittest/case.py\", line 900, in _baseAssertEqual\n    raise self.failureException(msg)\nAssertionError: 7 != 0 : Missing objects in the cache:\n/srv/autobuilder/valkyrie.yocto.io/pub/sstate/26/bc/sstate:rust:cortexa57-poky-linux:1.94.1:r0:cortexa57:14:26bc1aa533028917fcf6e9317f205d089beff84cd0c1de7e1d7ed65c1d3a2db5_package_qa.tar.zst\n/srv/autobuilder/valkyrie.yocto.io/pub/sstate/0c/ec/sstate:rust:cortexa57-poky-linux:1.94.1:r0:cortexa57:14:0cec054c007647ba909d117d208d2918c3a094821638cc344ac5b03fd9bec91e_package_write_rpm.tar.zst\n/srv/autobuilder/valkyrie.yocto.io/pub/sstate/f5/46/sstate:rust:cortexa57-poky-linux:1.94.1:r0:cortexa57:14:f546eb72de781422d482a6bbd1fa294629dabfc8647aaf23d8888fd9a9fe2483_create_spdx.tar.zst\n/srv/autobuilder/valkyrie.yocto.io/pub/sstate/cc/a4/sstate:rust:cortexa57-poky-linux:1.94.1:r0:cortexa57:14:cca47f75dbbc3e6a0b75e515aea17fbe7c1e6d16204088cdd75520ba95ab3a38_packagedata.tar.zst\n/srv/autobuilder/valkyrie.yocto.io/pub/sstate/54/43/sstate:rust:cortexa57-poky-linux:1.94.1:r0:cortexa57:14:5443363862575eb23c232299347ec786539efc11b3649df2bfb00807ddf9a6a7_create_package_spdx.tar.zst\n/srv/autobuilder/valkyrie.yocto.io/pub/sstate/0c/a5/sstate:rust:cortexa57-poky-linux:1.94.1:r0:cortexa57:14:0ca56ea030a77badc14fdb0582a45bddcefd1357038e5fff9a4c8057c20eadb3_populate_sysroot.tar.zst\n/srv/autobuilder/valkyrie.yocto.io/pub/sstate/4c/0c/sstate:rust:cortexa57-poky-linux:1.94.1:r0:cortexa57:14:4c0c2139487fd29c2e912f0ee8146a2ee03bf1f062e8993806f77a17d05f1da1_package.tar.zst\nFetcher diagnostics:\n\n\nStderr:\n2026-04-15 18:23:32,013 - oe-selftest - INFO - Adding: \"include selftest.inc\" in /srv/pokybuild/yocto-worker/a-full/build/build-st-1603814/conf/local.conf\n2026-04-15 18:23:32,013 - oe-selftest - INFO - Adding: \"include bblayers.inc\" in bblayers.conf\n",
    "oetags": [
     "yocto-mirrors"
    ],
    "status": "FAILED"
   },
   "sstatetests.SStateMirrors.test_local_cache_qemux86_64": {
    "duration": 115.58332753181458,
    "log": "testtools.testresult.real._StringException: Traceback (most recent call last):\n  File \"/srv/pokybuild/yocto-worker/a-full/build/layers/openembedded-core/meta/lib/oeqa/selftest/cases/sstatetests.py\", line 988, in test_local_cache_qemux86_64\n    self.run_test(\"qemux86-64\", \"core-image-minimal core-image-full-cmdline core-image-sato-sdk\", exceptions, check_cdn = False)\n    ~~~~~~~~~~~~~^^^^^^^^^^^^^^^^^^^^^^^^^^^^^^^^^^^^^^^^^^^^^^^^^^^^^^^^^^^^^^^^^^^^^^^^^^^^^^^^^^^^^^^^^^^^^^^^^^^^^^^^^^^^^^^\n  File \"/srv/pokybuild/yocto-worker/a-full/build/layers/openembedded-core/meta/lib/oeqa/selftest/cases/sstatetests.py\", line 974, in run_test\n    self.check_bb_output(result.output, targets, exceptions, check_cdn)\n    ~~~~~~~~~~~~~~~~~~~~^^^^^^^^^^^^^^^^^^^^^^^^^^^^^^^^^^^^^^^^^^^^^^^\n  File \"/srv/pokybuild/yocto-worker/a-full/build/layers/openembedded-core/meta/lib/oeqa/selftest/cases/sstatetests.py\", line 954, in check_bb_output\n    self.assertEqual(len(failed_urls), 0, \"Missing objects in the cache:\\n{}\\nFetcher diagnostics:\\n{}\".format(\"\\n\".join(failed_urls), \"\\n\".join(failed_urls_extrainfo)))\n    ~~~~~~~~~~~~~~~~^^^^^^^^^^^^^^^^^^^^^^^^^^^^^^^^^^^^^^^^^^^^^^^^^^^^^^^^^^^^^^^^^^^^^^^^^^^^^^^^^^^^^^^^^^^^^^^^^^^^^^^^^^^^^^^^^^^^^^^^^^^^^^^^^^^^^^^^^^^^^^^^^^^^^\n  File \"/usr/lib64/python3.13/unittest/case.py\", line 907, in assertEqual\n    assertion_func(first, second, msg=msg)\n    ~~~~~~~~~~~~~~^^^^^^^^^^^^^^^^^^^^^^^^\n  File \"/usr/lib64/python3.13/unittest/case.py\", line 900, in _baseAssertEqual\n    raise self.failureException(msg)\nAssertionError: 13 != 0 : Missing objects in the cache:\n/srv/autobuilder/valkyrie.yocto.io/pub/sstate/ea/94/sstate:mesa-demos:x86-64-v3-poky-linux:9.0.0:r0:x86-64-v3:14:ea9492d1328bee25d1a2776b71c1b62cf71a5d41a730104c7404f55639382881_package_qa.tar.zst\n/srv/autobuilder/valkyrie.yocto.io/pub/sstate/7a/78/sstate:packagegroup-core-tools-testapps:qemux86_64-poky-linux:1.0:r0:qemux86_64:14:7a780a2c728ef7096af0cb87d48806b4d5a6b1cf94f9d270fda9575a5ff8d229_package_write_rpm.tar.zst\n/srv/autobuilder/valkyrie.yocto.io/pub/sstate/56/38/sstate:mesa-demos:x86-64-v3-poky-linux:9.0.0:r0:x86-64-v3:14:563808f783f507c49e4330f83d48bda0ce5e4ef7e6de278e4d015f72190a2fda_create_spdx.tar.zst\n/srv/autobuilder/valkyrie.yocto.io/pub/sstate/22/40/sstate:packagegroup-core-tools-testapps:qemux86_64-poky-linux:1.0:r0:qemux86_64:14:22409ee3affc14c66d58fe749245d58a5b703b7b221139ff56e53c939db29886_package_write_ipk.tar.zst\n/srv/autobuilder/valkyrie.yocto.io/pub/sstate/a6/87/sstate:packagegroup-core-tools-testapps:qemux86_64-poky-linux:1.0:r0:qemux86_64:14:a687b9208e18f67f77d7ca167d6ec24eb7d86b2da1ac41ac174d4e6e27df228b_create_package_spdx.tar.zst\n/srv/autobuilder/valkyrie.yocto.io/pub/sstate/fb/fe/sstate:packagegroup-core-tools-testapps:qemux86_64-poky-linux:1.0:r0:qemux86_64:14:fbfe5507e64882c39e6c583ad58e20a649e6c36044e30eb9f341822bf17b17a4_package_qa.tar.zst\n/srv/autobuilder/valkyrie.yocto.io/pub/sstate/e6/00/sstate:mesa-demos:x86-64-v3-poky-linux:9.0.0:r0:x86-64-v3:14:e600cad85743c9b37ffdfd8c53a462c1a05434593b3d123131a4b0ff806fdda2_populate_sysroot.tar.zst\n/srv/autobuilder/valkyrie.yocto.io/pub/sstate/6d/bc/sstate:mesa-demos:x86-64-v3-poky-linux:9.0.0:r0:x86-64-v3:14:6dbca1dc6ba112efb0aab5a40752745f4010a6434e2e2a67ea6ac9ec45a377b3_package.tar.zst\n/srv/autobuilder/valkyrie.yocto.io/pub/sstate/73/63/sstate:mesa-demos:x86-64-v3-poky-linux:9.0.0:r0:x86-64-v3:14:7363cf1ec5dfe88099d1b86e67071cf11439ae26cc1797e0a00b14d0e4ee25c3_package_write_rpm.tar.zst\n/srv/autobuilder/valkyrie.yocto.io/pub/sstate/f5/bb/sstate:packagegroup-core-tools-testapps:qemux86_64-poky-linux:1.0:r0:qemux86_64:14:f5bbe56fc5962e7c722587660d5cb65e490b5567002c341e0c84c406a351fee4_package_write_deb.tar.zst\n/srv/autobuilder/valkyrie.yocto.io/pub/sstate/9f/12/sstate:mesa-demos:x86-64-v3-poky-linux:9.0.0:r0:x86-64-v3:14:9f124ed4beb1ee49c02c4ebdf5542ed809e04d8944e44b4b2f7364bfc82ec252_packagedata.tar.zst\n/srv/autobuilder/valkyrie.yocto.io/pub/sstate/5e/3f/sstate:rust:x86-64-v3-poky-linux:1.94.1:r0:x86-64-v3:14:5e3ff72c607b416242f9e528181a00080a67fdb8df854982cc2c51fa84238622_create_package_spdx.tar.zst\n/srv/autobuilder/valkyrie.yocto.io/pub/sstate/e3/1d/sstate:mesa-demos:x86-64-v3-poky-linux:9.0.0:r0:x86-64-v3:14:e31d4810c0fb95960ea48b8b6b8c6ebbbb48ea34ecfba2c2d59317a030538839_create_package_spdx.tar.zst\nFetcher diagnostics:\n\n\nStderr:\n2026-04-15 18:23:32,013 - oe-selftest - INFO - Adding: \"include selftest.inc\" in /srv/pokybuild/yocto-worker/a-full/build/build-st-1603814/conf/local.conf\n2026-04-15 18:23:32,013 - oe-selftest - INFO - Adding: \"include bblayers.inc\" in bblayers.conf\n",
    "oetags": [
     "yocto-mirrors"
    ],
    "status": "FAILED"
   }
  }
 }
}