{
 "oeselftest_ubuntu-26.04_qemux86-64_20260416140717": {
  "configuration": {
   "HOST_DISTRO": "ubuntu-26.04",
   "HOST_NAME": "ubuntu2604-vk-1",
   "LAYERS": {
    "meta": {
     "branch": "mathieu/master-next",
     "commit": "dd656723fba07306fd7e9d74574ea3c22a7bf300",
     "commit_count": 66849,
     "commit_time": 1776327523
    },
    "meta-poky": {
     "branch": "contrib/mathieu/master-next",
     "commit": "faf71d3c54d407e574a01019a505bf235edd0a0d",
     "commit_count": 1785,
     "commit_time": 1776147774
    },
    "meta-selftest": {
     "branch": "mathieu/master-next",
     "commit": "dd656723fba07306fd7e9d74574ea3c22a7bf300",
     "commit_count": 66849,
     "commit_time": 1776327523
    },
    "meta-yocto-bsp": {
     "branch": "contrib/mathieu/master-next",
     "commit": "faf71d3c54d407e574a01019a505bf235edd0a0d",
     "commit_count": 1785,
     "commit_time": 1776147774
    }
   },
   "MACHINE": "qemux86-64",
   "OESELFTEST_METADATA": {
    "exclude_tags": null,
    "run_all_tests": true,
    "run_tests": null,
    "select_tags": [
     "yocto-mirrors"
    ],
    "skips": null
   },
   "STARTTIME": "20260416140717",
   "TEST_TYPE": "oeselftest"
  },
  "result": {
   "buildoptions.SourceMirroring.test_yocto_source_mirror": {
    "duration": 223.62198495864868,
    "oetags": [
     "yocto-mirrors"
    ],
    "status": "PASSED"
   },
   "sstatetests.SStateMirrors.test_cdn_mirror_qemuarm64": {
    "duration": 358.203421831131,
    "log": "testtools.testresult.real._StringException: Traceback (most recent call last):\n  File \"/srv/pokybuild/yocto-worker/a-full/build/layers/openembedded-core/meta/lib/oeqa/selftest/cases/sstatetests.py\", line 984, in test_cdn_mirror_qemuarm64\n    self.run_test(\"qemuarm64\", \"core-image-minimal core-image-full-cmdline core-image-sato-sdk\", exceptions)\n    ~~~~~~~~~~~~~^^^^^^^^^^^^^^^^^^^^^^^^^^^^^^^^^^^^^^^^^^^^^^^^^^^^^^^^^^^^^^^^^^^^^^^^^^^^^^^^^^^^^^^^^^^\n  File \"/srv/pokybuild/yocto-worker/a-full/build/layers/openembedded-core/meta/lib/oeqa/selftest/cases/sstatetests.py\", line 974, in run_test\n    self.check_bb_output(result.output, targets, exceptions, check_cdn)\n    ~~~~~~~~~~~~~~~~~~~~^^^^^^^^^^^^^^^^^^^^^^^^^^^^^^^^^^^^^^^^^^^^^^^\n  File \"/srv/pokybuild/yocto-worker/a-full/build/layers/openembedded-core/meta/lib/oeqa/selftest/cases/sstatetests.py\", line 954, in check_bb_output\n    self.assertEqual(len(failed_urls), 0, \"Missing objects in the cache:\\n{}\\nFetcher diagnostics:\\n{}\".format(\"\\n\".join(failed_urls), \"\\n\".join(failed_urls_extrainfo)))\n    ~~~~~~~~~~~~~~~~^^^^^^^^^^^^^^^^^^^^^^^^^^^^^^^^^^^^^^^^^^^^^^^^^^^^^^^^^^^^^^^^^^^^^^^^^^^^^^^^^^^^^^^^^^^^^^^^^^^^^^^^^^^^^^^^^^^^^^^^^^^^^^^^^^^^^^^^^^^^^^^^^^^^^\n  File \"/usr/lib/python3.14/unittest/case.py\", line 925, in assertEqual\n    assertion_func(first, second, msg=msg)\n    ~~~~~~~~~~~~~~^^^^^^^^^^^^^^^^^^^^^^^^\n  File \"/usr/lib/python3.14/unittest/case.py\", line 918, in _baseAssertEqual\n    raise self.failureException(msg)\nAssertionError: 7 != 0 : Missing objects in the cache:\nfile://8a/59/sstate:rust:cortexa57-poky-linux:1.94.1:r0:cortexa57:14:8a59d9c4bfd9a9a98ef5438db7a15b1583a542bb60925b8dde4e4f10bf1362b6_create_package_spdx.tar.zst\nfile://a2/93/sstate:rust:cortexa57-poky-linux:1.94.1:r0:cortexa57:14:a2930442007563bc60889e1e1e27fe93c9d6322157b572a492153645d6f48d04_create_spdx.tar.zst\nfile://48/74/sstate:rust:cortexa57-poky-linux:1.94.1:r0:cortexa57:14:487412e4229f1d2b143f04970d78fc04f1fb442afcad3c40a44527636387cf5a_package_qa.tar.zst\nfile://7f/cc/sstate:rust:cortexa57-poky-linux:1.94.1:r0:cortexa57:14:7fcc6620bc9bf245f66e57f8e5b11c2b5fc93e9141e166ecb6caf85435a7c69b_package.tar.zst\nfile://6d/9c/sstate:rust:cortexa57-poky-linux:1.94.1:r0:cortexa57:14:6d9c6a27331c70c339610f32b0b62d13b0f6ea7e8d2e5c0ea66832901fff731c_populate_sysroot.tar.zst\nfile://ee/d4/sstate:rust:cortexa57-poky-linux:1.94.1:r0:cortexa57:14:eed4dfdfb6ffcc9c93b9b8fafebeb81ee0eade7e22a6e3ae35ed17f332914fb9_packagedata.tar.zst\nfile://06/e9/sstate:rust:cortexa57-poky-linux:1.94.1:r0:cortexa57:14:06e98befe3e66b8104c7d077eaf18725d55113196d0d43a61111a73e32bf6eaf_package_write_rpm.tar.zst\nFetcher diagnostics:\nDEBUG: checkstatus() urlopen failed for http://sstate.yoctoproject.org/all/8a/59/sstate%3Arust%3Acortexa57-poky-linux%3A1.94.1%3Ar0%3Acortexa57%3A14%3A8a59d9c4bfd9a9a98ef5438db7a15b1583a542bb60925b8dde4e4f10bf1362b6_create_package_spdx.tar.zst: HTTP Error 404: Not Found\nDEBUG: checkstatus() urlopen failed for http://sstate.yoctoproject.org/all/a2/93/sstate%3Arust%3Acortexa57-poky-linux%3A1.94.1%3Ar0%3Acortexa57%3A14%3Aa2930442007563bc60889e1e1e27fe93c9d6322157b572a492153645d6f48d04_create_spdx.tar.zst: HTTP Error 404: Not Found\nDEBUG: checkstatus() urlopen failed for http://sstate.yoctoproject.org/all/48/74/sstate%3Arust%3Acortexa57-poky-linux%3A1.94.1%3Ar0%3Acortexa57%3A14%3A487412e4229f1d2b143f04970d78fc04f1fb442afcad3c40a44527636387cf5a_package_qa.tar.zst: HTTP Error 404: Not Found\nDEBUG: checkstatus() urlopen failed for http://sstate.yoctoproject.org/all/7f/cc/sstate%3Arust%3Acortexa57-poky-linux%3A1.94.1%3Ar0%3Acortexa57%3A14%3A7fcc6620bc9bf245f66e57f8e5b11c2b5fc93e9141e166ecb6caf85435a7c69b_package.tar.zst: HTTP Error 404: Not Found\nDEBUG: checkstatus() urlopen failed for http://sstate.yoctoproject.org/all/6d/9c/sstate%3Arust%3Acortexa57-poky-linux%3A1.94.1%3Ar0%3Acortexa57%3A14%3A6d9c6a27331c70c339610f32b0b62d13b0f6ea7e8d2e5c0ea66832901fff731c_populate_sysroot.tar.zst: HTTP Error 404: Not Found\nDEBUG: checkstatus() urlopen failed for http://sstate.yoctoproject.org/all/ee/d4/sstate%3Arust%3Acortexa57-poky-linux%3A1.94.1%3Ar0%3Acortexa57%3A14%3Aeed4dfdfb6ffcc9c93b9b8fafebeb81ee0eade7e22a6e3ae35ed17f332914fb9_packagedata.tar.zst: HTTP Error 404: Not Found\nDEBUG: checkstatus() urlopen failed for http://sstate.yoctoproject.org/all/06/e9/sstate%3Arust%3Acortexa57-poky-linux%3A1.94.1%3Ar0%3Acortexa57%3A14%3A06e98befe3e66b8104c7d077eaf18725d55113196d0d43a61111a73e32bf6eaf_package_write_rpm.tar.zst: HTTP Error 404: Not Found\n\n\nStderr:\n2026-04-16 14:07:19,404 - oe-selftest - INFO - Adding: \"include selftest.inc\" in /srv/pokybuild/yocto-worker/a-full/build/build-st-1887482/conf/local.conf\n2026-04-16 14:07:19,404 - oe-selftest - INFO - Adding: \"include bblayers.inc\" in bblayers.conf\n/usr/lib/python3.14/unittest/case.py:606: RuntimeWarning: TestResult has no addDuration method\n  warnings.warn(\"TestResult has no addDuration method\",\n\n",
    "oetags": [
     "yocto-mirrors"
    ],
    "status": "FAILED"
   },
   "sstatetests.SStateMirrors.test_cdn_mirror_qemux86_64": {
    "duration": 301.4982969760895,
    "log": "testtools.testresult.real._StringException: Traceback (most recent call last):\n  File \"/srv/pokybuild/yocto-worker/a-full/build/layers/openembedded-core/meta/lib/oeqa/selftest/cases/sstatetests.py\", line 979, in test_cdn_mirror_qemux86_64\n    self.run_test(\"qemux86-64\", \"core-image-minimal core-image-full-cmdline core-image-sato-sdk\", exceptions)\n    ~~~~~~~~~~~~~^^^^^^^^^^^^^^^^^^^^^^^^^^^^^^^^^^^^^^^^^^^^^^^^^^^^^^^^^^^^^^^^^^^^^^^^^^^^^^^^^^^^^^^^^^^^\n  File \"/srv/pokybuild/yocto-worker/a-full/build/layers/openembedded-core/meta/lib/oeqa/selftest/cases/sstatetests.py\", line 974, in run_test\n    self.check_bb_output(result.output, targets, exceptions, check_cdn)\n    ~~~~~~~~~~~~~~~~~~~~^^^^^^^^^^^^^^^^^^^^^^^^^^^^^^^^^^^^^^^^^^^^^^^\n  File \"/srv/pokybuild/yocto-worker/a-full/build/layers/openembedded-core/meta/lib/oeqa/selftest/cases/sstatetests.py\", line 954, in check_bb_output\n    self.assertEqual(len(failed_urls), 0, \"Missing objects in the cache:\\n{}\\nFetcher diagnostics:\\n{}\".format(\"\\n\".join(failed_urls), \"\\n\".join(failed_urls_extrainfo)))\n    ~~~~~~~~~~~~~~~~^^^^^^^^^^^^^^^^^^^^^^^^^^^^^^^^^^^^^^^^^^^^^^^^^^^^^^^^^^^^^^^^^^^^^^^^^^^^^^^^^^^^^^^^^^^^^^^^^^^^^^^^^^^^^^^^^^^^^^^^^^^^^^^^^^^^^^^^^^^^^^^^^^^^^\n  File \"/usr/lib/python3.14/unittest/case.py\", line 925, in assertEqual\n    assertion_func(first, second, msg=msg)\n    ~~~~~~~~~~~~~~^^^^^^^^^^^^^^^^^^^^^^^^\n  File \"/usr/lib/python3.14/unittest/case.py\", line 918, in _baseAssertEqual\n    raise self.failureException(msg)\nAssertionError: 13 != 0 : Missing objects in the cache:\nfile://7a/96/sstate:mesa-demos:x86-64-v3-poky-linux:9.0.0:r0:x86-64-v3:14:7a96a245d935a1e350693519e2752e3e321e511fea6859bf9e8e09d2700cf984_package_write_rpm.tar.zst\nfile://08/27/sstate:rust:x86-64-v3-poky-linux:1.94.1:r0:x86-64-v3:14:0827a0506d1ad118c3e8aa4cd9126f70431e7072550b0b700ba22bac9fa0b8e3_create_package_spdx.tar.zst\nfile://cd/8f/sstate:mesa-demos:x86-64-v3-poky-linux:9.0.0:r0:x86-64-v3:14:cd8f6ebdd3ea40a1138020d065ad4baac051693073e88d63680ca4bc5d0ff576_package.tar.zst\nfile://bd/c0/sstate:mesa-demos:x86-64-v3-poky-linux:9.0.0:r0:x86-64-v3:14:bdc0db1584ef369e65ed439740968bee2c1b23c68827b976356398d2de9fc648_packagedata.tar.zst\nfile://6a/1c/sstate:mesa-demos:x86-64-v3-poky-linux:9.0.0:r0:x86-64-v3:14:6a1c7e1abd7b374be90a16c52ccfacbd56a3a323420c6296d24f3ceaa7cdd136_create_package_spdx.tar.zst\nfile://59/60/sstate:packagegroup-core-tools-testapps:qemux86_64-poky-linux:1.0:r0:qemux86_64:14:5960bdb5f78e81e207d346ea7369b50bf09c810e967ef58c9256c1ecb03a9729_package_qa.tar.zst\nfile://39/0f/sstate:packagegroup-core-tools-testapps:qemux86_64-poky-linux:1.0:r0:qemux86_64:14:390f894454168e8a204c5a89ca767b0fc31b3f782817e8c163c0f43f2ad5af0b_create_package_spdx.tar.zst\nfile://d0/ed/sstate:mesa-demos:x86-64-v3-poky-linux:9.0.0:r0:x86-64-v3:14:d0ed9aec453bf96afcacff414eaa70118d72ddb1ab4fb1098311a633c3163248_package_qa.tar.zst\nfile://a7/92/sstate:packagegroup-core-tools-testapps:qemux86_64-poky-linux:1.0:r0:qemux86_64:14:a792d85bd5084d9121dbf399a9cbfc77c48c08ec387aa125e12698bbd44f2f54_package_write_ipk.tar.zst\nfile://8e/94/sstate:mesa-demos:x86-64-v3-poky-linux:9.0.0:r0:x86-64-v3:14:8e947eaaf7529fd60ea9419c53bc7255891f358fdefd813049dab18b8a867976_populate_sysroot.tar.zst\nfile://0d/29/sstate:packagegroup-core-tools-testapps:qemux86_64-poky-linux:1.0:r0:qemux86_64:14:0d2966d05a1ef5973b7d6e803a4e218aba4fecebf218dba06e858028971cfd53_package_write_rpm.tar.zst\nfile://1b/3b/sstate:packagegroup-core-tools-testapps:qemux86_64-poky-linux:1.0:r0:qemux86_64:14:1b3b2de5ec87310805205eb27d1093937f7f9f6b5c649b5f044f93f90d376a68_package_write_deb.tar.zst\nfile://21/e0/sstate:mesa-demos:x86-64-v3-poky-linux:9.0.0:r0:x86-64-v3:14:21e0b802e8d0c91d0eaf1af59e826b0f47d5d5ff974e30ba6f7c36b313eb94f2_create_spdx.tar.zst\nFetcher diagnostics:\nDEBUG: checkstatus() urlopen failed for http://sstate.yoctoproject.org/all/7a/96/sstate%3Amesa-demos%3Ax86-64-v3-poky-linux%3A9.0.0%3Ar0%3Ax86-64-v3%3A14%3A7a96a245d935a1e350693519e2752e3e321e511fea6859bf9e8e09d2700cf984_package_write_rpm.tar.zst: HTTP Error 404: Not Found\nDEBUG: checkstatus() urlopen failed for http://sstate.yoctoproject.org/all/08/27/sstate%3Arust%3Ax86-64-v3-poky-linux%3A1.94.1%3Ar0%3Ax86-64-v3%3A14%3A0827a0506d1ad118c3e8aa4cd9126f70431e7072550b0b700ba22bac9fa0b8e3_create_package_spdx.tar.zst: HTTP Error 404: Not Found\nDEBUG: checkstatus() urlopen failed for http://sstate.yoctoproject.org/all/cd/8f/sstate%3Amesa-demos%3Ax86-64-v3-poky-linux%3A9.0.0%3Ar0%3Ax86-64-v3%3A14%3Acd8f6ebdd3ea40a1138020d065ad4baac051693073e88d63680ca4bc5d0ff576_package.tar.zst: HTTP Error 404: Not Found\nDEBUG: checkstatus() urlopen failed for http://sstate.yoctoproject.org/all/bd/c0/sstate%3Amesa-demos%3Ax86-64-v3-poky-linux%3A9.0.0%3Ar0%3Ax86-64-v3%3A14%3Abdc0db1584ef369e65ed439740968bee2c1b23c68827b976356398d2de9fc648_packagedata.tar.zst: HTTP Error 404: Not Found\nDEBUG: checkstatus() urlopen failed for http://sstate.yoctoproject.org/all/6a/1c/sstate%3Amesa-demos%3Ax86-64-v3-poky-linux%3A9.0.0%3Ar0%3Ax86-64-v3%3A14%3A6a1c7e1abd7b374be90a16c52ccfacbd56a3a323420c6296d24f3ceaa7cdd136_create_package_spdx.tar.zst: HTTP Error 404: Not Found\nDEBUG: checkstatus() urlopen failed for http://sstate.yoctoproject.org/all/59/60/sstate%3Apackagegroup-core-tools-testapps%3Aqemux86_64-poky-linux%3A1.0%3Ar0%3Aqemux86_64%3A14%3A5960bdb5f78e81e207d346ea7369b50bf09c810e967ef58c9256c1ecb03a9729_package_qa.tar.zst: HTTP Error 404: Not Found\nDEBUG: checkstatus() urlopen failed for http://sstate.yoctoproject.org/all/39/0f/sstate%3Apackagegroup-core-tools-testapps%3Aqemux86_64-poky-linux%3A1.0%3Ar0%3Aqemux86_64%3A14%3A390f894454168e8a204c5a89ca767b0fc31b3f782817e8c163c0f43f2ad5af0b_create_package_spdx.tar.zst: HTTP Error 404: Not Found\nDEBUG: checkstatus() urlopen failed for http://sstate.yoctoproject.org/all/d0/ed/sstate%3Amesa-demos%3Ax86-64-v3-poky-linux%3A9.0.0%3Ar0%3Ax86-64-v3%3A14%3Ad0ed9aec453bf96afcacff414eaa70118d72ddb1ab4fb1098311a633c3163248_package_qa.tar.zst: HTTP Error 404: Not Found\nDEBUG: checkstatus() urlopen failed for http://sstate.yoctoproject.org/all/a7/92/sstate%3Apackagegroup-core-tools-testapps%3Aqemux86_64-poky-linux%3A1.0%3Ar0%3Aqemux86_64%3A14%3Aa792d85bd5084d9121dbf399a9cbfc77c48c08ec387aa125e12698bbd44f2f54_package_write_ipk.tar.zst: HTTP Error 404: Not Found\nDEBUG: checkstatus() urlopen failed for http://sstate.yoctoproject.org/all/8e/94/sstate%3Amesa-demos%3Ax86-64-v3-poky-linux%3A9.0.0%3Ar0%3Ax86-64-v3%3A14%3A8e947eaaf7529fd60ea9419c53bc7255891f358fdefd813049dab18b8a867976_populate_sysroot.tar.zst: HTTP Error 404: Not Found\nDEBUG: checkstatus() urlopen failed for http://sstate.yoctoproject.org/all/0d/29/sstate%3Apackagegroup-core-tools-testapps%3Aqemux86_64-poky-linux%3A1.0%3Ar0%3Aqemux86_64%3A14%3A0d2966d05a1ef5973b7d6e803a4e218aba4fecebf218dba06e858028971cfd53_package_write_rpm.tar.zst: HTTP Error 404: Not Found\nDEBUG: checkstatus() urlopen failed for http://sstate.yoctoproject.org/all/1b/3b/sstate%3Apackagegroup-core-tools-testapps%3Aqemux86_64-poky-linux%3A1.0%3Ar0%3Aqemux86_64%3A14%3A1b3b2de5ec87310805205eb27d1093937f7f9f6b5c649b5f044f93f90d376a68_package_write_deb.tar.zst: HTTP Error 404: Not Found\nDEBUG: checkstatus() urlopen failed for http://sstate.yoctoproject.org/all/21/e0/sstate%3Amesa-demos%3Ax86-64-v3-poky-linux%3A9.0.0%3Ar0%3Ax86-64-v3%3A14%3A21e0b802e8d0c91d0eaf1af59e826b0f47d5d5ff974e30ba6f7c36b313eb94f2_create_spdx.tar.zst: HTTP Error 404: Not Found\n\n\nStderr:\n2026-04-16 14:07:19,404 - oe-selftest - INFO - Adding: \"include selftest.inc\" in /srv/pokybuild/yocto-worker/a-full/build/build-st-1887482/conf/local.conf\n2026-04-16 14:07:19,404 - oe-selftest - INFO - Adding: \"include bblayers.inc\" in bblayers.conf\n/usr/lib/python3.14/unittest/case.py:606: RuntimeWarning: TestResult has no addDuration method\n  warnings.warn(\"TestResult has no addDuration method\",\n\n/usr/lib/python3.14/unittest/case.py:606: RuntimeWarning: TestResult has no addDuration method\n  warnings.warn(\"TestResult has no addDuration method\",\n\n",
    "oetags": [
     "yocto-mirrors"
    ],
    "status": "FAILED"
   },
   "sstatetests.SStateMirrors.test_local_cache_qemuarm64": {
    "duration": 125.10151791572571,
    "log": "testtools.testresult.real._StringException: Traceback (most recent call last):\n  File \"/srv/pokybuild/yocto-worker/a-full/build/layers/openembedded-core/meta/lib/oeqa/selftest/cases/sstatetests.py\", line 992, in test_local_cache_qemuarm64\n    self.run_test(\"qemuarm64\", \"core-image-minimal core-image-full-cmdline core-image-sato-sdk\", exceptions, check_cdn = False)\n    ~~~~~~~~~~~~~^^^^^^^^^^^^^^^^^^^^^^^^^^^^^^^^^^^^^^^^^^^^^^^^^^^^^^^^^^^^^^^^^^^^^^^^^^^^^^^^^^^^^^^^^^^^^^^^^^^^^^^^^^^^^^\n  File \"/srv/pokybuild/yocto-worker/a-full/build/layers/openembedded-core/meta/lib/oeqa/selftest/cases/sstatetests.py\", line 974, in run_test\n    self.check_bb_output(result.output, targets, exceptions, check_cdn)\n    ~~~~~~~~~~~~~~~~~~~~^^^^^^^^^^^^^^^^^^^^^^^^^^^^^^^^^^^^^^^^^^^^^^^\n  File \"/srv/pokybuild/yocto-worker/a-full/build/layers/openembedded-core/meta/lib/oeqa/selftest/cases/sstatetests.py\", line 954, in check_bb_output\n    self.assertEqual(len(failed_urls), 0, \"Missing objects in the cache:\\n{}\\nFetcher diagnostics:\\n{}\".format(\"\\n\".join(failed_urls), \"\\n\".join(failed_urls_extrainfo)))\n    ~~~~~~~~~~~~~~~~^^^^^^^^^^^^^^^^^^^^^^^^^^^^^^^^^^^^^^^^^^^^^^^^^^^^^^^^^^^^^^^^^^^^^^^^^^^^^^^^^^^^^^^^^^^^^^^^^^^^^^^^^^^^^^^^^^^^^^^^^^^^^^^^^^^^^^^^^^^^^^^^^^^^^\n  File \"/usr/lib/python3.14/unittest/case.py\", line 925, in assertEqual\n    assertion_func(first, second, msg=msg)\n    ~~~~~~~~~~~~~~^^^^^^^^^^^^^^^^^^^^^^^^\n  File \"/usr/lib/python3.14/unittest/case.py\", line 918, in _baseAssertEqual\n    raise self.failureException(msg)\nAssertionError: 7 != 0 : Missing objects in the cache:\n/srv/autobuilder/valkyrie.yocto.io/pub/sstate/8a/59/sstate:rust:cortexa57-poky-linux:1.94.1:r0:cortexa57:14:8a59d9c4bfd9a9a98ef5438db7a15b1583a542bb60925b8dde4e4f10bf1362b6_create_package_spdx.tar.zst\n/srv/autobuilder/valkyrie.yocto.io/pub/sstate/a2/93/sstate:rust:cortexa57-poky-linux:1.94.1:r0:cortexa57:14:a2930442007563bc60889e1e1e27fe93c9d6322157b572a492153645d6f48d04_create_spdx.tar.zst\n/srv/autobuilder/valkyrie.yocto.io/pub/sstate/48/74/sstate:rust:cortexa57-poky-linux:1.94.1:r0:cortexa57:14:487412e4229f1d2b143f04970d78fc04f1fb442afcad3c40a44527636387cf5a_package_qa.tar.zst\n/srv/autobuilder/valkyrie.yocto.io/pub/sstate/7f/cc/sstate:rust:cortexa57-poky-linux:1.94.1:r0:cortexa57:14:7fcc6620bc9bf245f66e57f8e5b11c2b5fc93e9141e166ecb6caf85435a7c69b_package.tar.zst\n/srv/autobuilder/valkyrie.yocto.io/pub/sstate/6d/9c/sstate:rust:cortexa57-poky-linux:1.94.1:r0:cortexa57:14:6d9c6a27331c70c339610f32b0b62d13b0f6ea7e8d2e5c0ea66832901fff731c_populate_sysroot.tar.zst\n/srv/autobuilder/valkyrie.yocto.io/pub/sstate/ee/d4/sstate:rust:cortexa57-poky-linux:1.94.1:r0:cortexa57:14:eed4dfdfb6ffcc9c93b9b8fafebeb81ee0eade7e22a6e3ae35ed17f332914fb9_packagedata.tar.zst\n/srv/autobuilder/valkyrie.yocto.io/pub/sstate/06/e9/sstate:rust:cortexa57-poky-linux:1.94.1:r0:cortexa57:14:06e98befe3e66b8104c7d077eaf18725d55113196d0d43a61111a73e32bf6eaf_package_write_rpm.tar.zst\nFetcher diagnostics:\n\n\nStderr:\n2026-04-16 14:07:19,404 - oe-selftest - INFO - Adding: \"include selftest.inc\" in /srv/pokybuild/yocto-worker/a-full/build/build-st-1887482/conf/local.conf\n2026-04-16 14:07:19,404 - oe-selftest - INFO - Adding: \"include bblayers.inc\" in bblayers.conf\n/usr/lib/python3.14/unittest/case.py:606: RuntimeWarning: TestResult has no addDuration method\n  warnings.warn(\"TestResult has no addDuration method\",\n\n/usr/lib/python3.14/unittest/case.py:606: RuntimeWarning: TestResult has no addDuration method\n  warnings.warn(\"TestResult has no addDuration method\",\n\n",
    "oetags": [
     "yocto-mirrors"
    ],
    "status": "FAILED"
   },
   "sstatetests.SStateMirrors.test_local_cache_qemux86_64": {
    "duration": 110.27254676818848,
    "log": "testtools.testresult.real._StringException: Traceback (most recent call last):\n  File \"/srv/pokybuild/yocto-worker/a-full/build/layers/openembedded-core/meta/lib/oeqa/selftest/cases/sstatetests.py\", line 988, in test_local_cache_qemux86_64\n    self.run_test(\"qemux86-64\", \"core-image-minimal core-image-full-cmdline core-image-sato-sdk\", exceptions, check_cdn = False)\n    ~~~~~~~~~~~~~^^^^^^^^^^^^^^^^^^^^^^^^^^^^^^^^^^^^^^^^^^^^^^^^^^^^^^^^^^^^^^^^^^^^^^^^^^^^^^^^^^^^^^^^^^^^^^^^^^^^^^^^^^^^^^^\n  File \"/srv/pokybuild/yocto-worker/a-full/build/layers/openembedded-core/meta/lib/oeqa/selftest/cases/sstatetests.py\", line 974, in run_test\n    self.check_bb_output(result.output, targets, exceptions, check_cdn)\n    ~~~~~~~~~~~~~~~~~~~~^^^^^^^^^^^^^^^^^^^^^^^^^^^^^^^^^^^^^^^^^^^^^^^\n  File \"/srv/pokybuild/yocto-worker/a-full/build/layers/openembedded-core/meta/lib/oeqa/selftest/cases/sstatetests.py\", line 954, in check_bb_output\n    self.assertEqual(len(failed_urls), 0, \"Missing objects in the cache:\\n{}\\nFetcher diagnostics:\\n{}\".format(\"\\n\".join(failed_urls), \"\\n\".join(failed_urls_extrainfo)))\n    ~~~~~~~~~~~~~~~~^^^^^^^^^^^^^^^^^^^^^^^^^^^^^^^^^^^^^^^^^^^^^^^^^^^^^^^^^^^^^^^^^^^^^^^^^^^^^^^^^^^^^^^^^^^^^^^^^^^^^^^^^^^^^^^^^^^^^^^^^^^^^^^^^^^^^^^^^^^^^^^^^^^^^\n  File \"/usr/lib/python3.14/unittest/case.py\", line 925, in assertEqual\n    assertion_func(first, second, msg=msg)\n    ~~~~~~~~~~~~~~^^^^^^^^^^^^^^^^^^^^^^^^\n  File \"/usr/lib/python3.14/unittest/case.py\", line 918, in _baseAssertEqual\n    raise self.failureException(msg)\nAssertionError: 13 != 0 : Missing objects in the cache:\n/srv/autobuilder/valkyrie.yocto.io/pub/sstate/7a/96/sstate:mesa-demos:x86-64-v3-poky-linux:9.0.0:r0:x86-64-v3:14:7a96a245d935a1e350693519e2752e3e321e511fea6859bf9e8e09d2700cf984_package_write_rpm.tar.zst\n/srv/autobuilder/valkyrie.yocto.io/pub/sstate/08/27/sstate:rust:x86-64-v3-poky-linux:1.94.1:r0:x86-64-v3:14:0827a0506d1ad118c3e8aa4cd9126f70431e7072550b0b700ba22bac9fa0b8e3_create_package_spdx.tar.zst\n/srv/autobuilder/valkyrie.yocto.io/pub/sstate/cd/8f/sstate:mesa-demos:x86-64-v3-poky-linux:9.0.0:r0:x86-64-v3:14:cd8f6ebdd3ea40a1138020d065ad4baac051693073e88d63680ca4bc5d0ff576_package.tar.zst\n/srv/autobuilder/valkyrie.yocto.io/pub/sstate/bd/c0/sstate:mesa-demos:x86-64-v3-poky-linux:9.0.0:r0:x86-64-v3:14:bdc0db1584ef369e65ed439740968bee2c1b23c68827b976356398d2de9fc648_packagedata.tar.zst\n/srv/autobuilder/valkyrie.yocto.io/pub/sstate/6a/1c/sstate:mesa-demos:x86-64-v3-poky-linux:9.0.0:r0:x86-64-v3:14:6a1c7e1abd7b374be90a16c52ccfacbd56a3a323420c6296d24f3ceaa7cdd136_create_package_spdx.tar.zst\n/srv/autobuilder/valkyrie.yocto.io/pub/sstate/59/60/sstate:packagegroup-core-tools-testapps:qemux86_64-poky-linux:1.0:r0:qemux86_64:14:5960bdb5f78e81e207d346ea7369b50bf09c810e967ef58c9256c1ecb03a9729_package_qa.tar.zst\n/srv/autobuilder/valkyrie.yocto.io/pub/sstate/39/0f/sstate:packagegroup-core-tools-testapps:qemux86_64-poky-linux:1.0:r0:qemux86_64:14:390f894454168e8a204c5a89ca767b0fc31b3f782817e8c163c0f43f2ad5af0b_create_package_spdx.tar.zst\n/srv/autobuilder/valkyrie.yocto.io/pub/sstate/d0/ed/sstate:mesa-demos:x86-64-v3-poky-linux:9.0.0:r0:x86-64-v3:14:d0ed9aec453bf96afcacff414eaa70118d72ddb1ab4fb1098311a633c3163248_package_qa.tar.zst\n/srv/autobuilder/valkyrie.yocto.io/pub/sstate/a7/92/sstate:packagegroup-core-tools-testapps:qemux86_64-poky-linux:1.0:r0:qemux86_64:14:a792d85bd5084d9121dbf399a9cbfc77c48c08ec387aa125e12698bbd44f2f54_package_write_ipk.tar.zst\n/srv/autobuilder/valkyrie.yocto.io/pub/sstate/8e/94/sstate:mesa-demos:x86-64-v3-poky-linux:9.0.0:r0:x86-64-v3:14:8e947eaaf7529fd60ea9419c53bc7255891f358fdefd813049dab18b8a867976_populate_sysroot.tar.zst\n/srv/autobuilder/valkyrie.yocto.io/pub/sstate/0d/29/sstate:packagegroup-core-tools-testapps:qemux86_64-poky-linux:1.0:r0:qemux86_64:14:0d2966d05a1ef5973b7d6e803a4e218aba4fecebf218dba06e858028971cfd53_package_write_rpm.tar.zst\n/srv/autobuilder/valkyrie.yocto.io/pub/sstate/1b/3b/sstate:packagegroup-core-tools-testapps:qemux86_64-poky-linux:1.0:r0:qemux86_64:14:1b3b2de5ec87310805205eb27d1093937f7f9f6b5c649b5f044f93f90d376a68_package_write_deb.tar.zst\n/srv/autobuilder/valkyrie.yocto.io/pub/sstate/21/e0/sstate:mesa-demos:x86-64-v3-poky-linux:9.0.0:r0:x86-64-v3:14:21e0b802e8d0c91d0eaf1af59e826b0f47d5d5ff974e30ba6f7c36b313eb94f2_create_spdx.tar.zst\nFetcher diagnostics:\n\n\nStderr:\n2026-04-16 14:07:19,404 - oe-selftest - INFO - Adding: \"include selftest.inc\" in /srv/pokybuild/yocto-worker/a-full/build/build-st-1887482/conf/local.conf\n2026-04-16 14:07:19,404 - oe-selftest - INFO - Adding: \"include bblayers.inc\" in bblayers.conf\n/usr/lib/python3.14/unittest/case.py:606: RuntimeWarning: TestResult has no addDuration method\n  warnings.warn(\"TestResult has no addDuration method\",\n\n/usr/lib/python3.14/unittest/case.py:606: RuntimeWarning: TestResult has no addDuration method\n  warnings.warn(\"TestResult has no addDuration method\",\n\n",
    "oetags": [
     "yocto-mirrors"
    ],
    "status": "FAILED"
   }
  }
 }
}