{
 "oeselftest_ubuntu-22.04_qemux86-64_20260417122035": {
  "configuration": {
   "HOST_DISTRO": "ubuntu-22.04",
   "HOST_NAME": "ubuntu2204-vk-3",
   "LAYERS": {
    "meta": {
     "branch": "mathieu/master-next",
     "commit": "db59886ddea51000edc7f5925f4043a101d7bc7f",
     "commit_count": 66854,
     "commit_time": 1776406375
    },
    "meta-poky": {
     "branch": "contrib/mathieu/master-next",
     "commit": "faf71d3c54d407e574a01019a505bf235edd0a0d",
     "commit_count": 1785,
     "commit_time": 1776147774
    },
    "meta-selftest": {
     "branch": "mathieu/master-next",
     "commit": "db59886ddea51000edc7f5925f4043a101d7bc7f",
     "commit_count": 66854,
     "commit_time": 1776406375
    },
    "meta-yocto-bsp": {
     "branch": "contrib/mathieu/master-next",
     "commit": "faf71d3c54d407e574a01019a505bf235edd0a0d",
     "commit_count": 1785,
     "commit_time": 1776147774
    }
   },
   "MACHINE": "qemux86-64",
   "OESELFTEST_METADATA": {
    "exclude_tags": null,
    "run_all_tests": true,
    "run_tests": null,
    "select_tags": [
     "yocto-mirrors"
    ],
    "skips": null
   },
   "STARTTIME": "20260417122035",
   "TEST_TYPE": "oeselftest"
  },
  "result": {
   "buildoptions.SourceMirroring.test_yocto_source_mirror": {
    "duration": 98.23582768440247,
    "oetags": [
     "yocto-mirrors"
    ],
    "status": "PASSED"
   },
   "sstatetests.SStateMirrors.test_cdn_mirror_qemuarm64": {
    "duration": 581.1729655265808,
    "log": "testtools.testresult.real._StringException: Traceback (most recent call last):\n  File \"/srv/pokybuild/yocto-worker/a-full/build/layers/openembedded-core/meta/lib/oeqa/selftest/cases/sstatetests.py\", line 984, in test_cdn_mirror_qemuarm64\n    self.run_test(\"qemuarm64\", \"core-image-minimal core-image-full-cmdline core-image-sato-sdk\", exceptions)\n  File \"/srv/pokybuild/yocto-worker/a-full/build/layers/openembedded-core/meta/lib/oeqa/selftest/cases/sstatetests.py\", line 974, in run_test\n    self.check_bb_output(result.output, targets, exceptions, check_cdn)\n  File \"/srv/pokybuild/yocto-worker/a-full/build/layers/openembedded-core/meta/lib/oeqa/selftest/cases/sstatetests.py\", line 954, in check_bb_output\n    self.assertEqual(len(failed_urls), 0, \"Missing objects in the cache:\\n{}\\nFetcher diagnostics:\\n{}\".format(\"\\n\".join(failed_urls), \"\\n\".join(failed_urls_extrainfo)))\n  File \"/usr/lib/python3.10/unittest/case.py\", line 845, in assertEqual\n    assertion_func(first, second, msg=msg)\n  File \"/usr/lib/python3.10/unittest/case.py\", line 838, in _baseAssertEqual\n    raise self.failureException(msg)\nAssertionError: 7 != 0 : Missing objects in the cache:\nfile://d9/d5/sstate:rust:cortexa57-poky-linux:1.94.1:r0:cortexa57:14:d9d5331a3c7f8034c6c74496ff3e716f1d8fd254f60c545712897f1edb9083eb_populate_sysroot.tar.zst\nfile://a0/c6/sstate:rust:cortexa57-poky-linux:1.94.1:r0:cortexa57:14:a0c627a65f0830e3a3ebfb5e76178f91df99bf733ad4254c0d232dc56692409a_package_qa.tar.zst\nfile://fb/9c/sstate:rust:cortexa57-poky-linux:1.94.1:r0:cortexa57:14:fb9c3d2288d3c81fe448de63af7ceb3f31d8f1296acc09a135cba9fac70609e4_packagedata.tar.zst\nfile://e4/4b/sstate:rust:cortexa57-poky-linux:1.94.1:r0:cortexa57:14:e44b9c1a7a070bca9c6dc5ee543cfd12ddf693aace7526cdb2cf7bfec31ffc0e_create_package_spdx.tar.zst\nfile://15/23/sstate:rust:cortexa57-poky-linux:1.94.1:r0:cortexa57:14:15238cec8b328ce5df643e9a7b012ad01cb75b68a0abae240ed0918676ec09f2_create_spdx.tar.zst\nfile://82/a2/sstate:rust:cortexa57-poky-linux:1.94.1:r0:cortexa57:14:82a244a94633a2aa34db53edd745ffdb97004494d11fdf71e6d69f933a9961e2_package.tar.zst\nfile://6c/48/sstate:rust:cortexa57-poky-linux:1.94.1:r0:cortexa57:14:6c4873adb8e9848c540b6ad95c4b8b399d8ae85c7d13faa62c3fffe7a5aaaf81_package_write_rpm.tar.zst\nFetcher diagnostics:\nDEBUG: checkstatus() urlopen failed for http://sstate.yoctoproject.org/all/d9/d5/sstate%3Arust%3Acortexa57-poky-linux%3A1.94.1%3Ar0%3Acortexa57%3A14%3Ad9d5331a3c7f8034c6c74496ff3e716f1d8fd254f60c545712897f1edb9083eb_populate_sysroot.tar.zst: HTTP Error 404: Not Found\nDEBUG: checkstatus() urlopen failed for http://sstate.yoctoproject.org/all/a0/c6/sstate%3Arust%3Acortexa57-poky-linux%3A1.94.1%3Ar0%3Acortexa57%3A14%3Aa0c627a65f0830e3a3ebfb5e76178f91df99bf733ad4254c0d232dc56692409a_package_qa.tar.zst: HTTP Error 404: Not Found\nDEBUG: checkstatus() urlopen failed for http://sstate.yoctoproject.org/all/fb/9c/sstate%3Arust%3Acortexa57-poky-linux%3A1.94.1%3Ar0%3Acortexa57%3A14%3Afb9c3d2288d3c81fe448de63af7ceb3f31d8f1296acc09a135cba9fac70609e4_packagedata.tar.zst: HTTP Error 404: Not Found\nDEBUG: checkstatus() urlopen failed for http://sstate.yoctoproject.org/all/e4/4b/sstate%3Arust%3Acortexa57-poky-linux%3A1.94.1%3Ar0%3Acortexa57%3A14%3Ae44b9c1a7a070bca9c6dc5ee543cfd12ddf693aace7526cdb2cf7bfec31ffc0e_create_package_spdx.tar.zst: HTTP Error 404: Not Found\nDEBUG: checkstatus() urlopen failed for http://sstate.yoctoproject.org/all/15/23/sstate%3Arust%3Acortexa57-poky-linux%3A1.94.1%3Ar0%3Acortexa57%3A14%3A15238cec8b328ce5df643e9a7b012ad01cb75b68a0abae240ed0918676ec09f2_create_spdx.tar.zst: HTTP Error 404: Not Found\nDEBUG: checkstatus() urlopen failed for http://sstate.yoctoproject.org/all/82/a2/sstate%3Arust%3Acortexa57-poky-linux%3A1.94.1%3Ar0%3Acortexa57%3A14%3A82a244a94633a2aa34db53edd745ffdb97004494d11fdf71e6d69f933a9961e2_package.tar.zst: HTTP Error 404: Not Found\nDEBUG: checkstatus() urlopen failed for http://sstate.yoctoproject.org/all/6c/48/sstate%3Arust%3Acortexa57-poky-linux%3A1.94.1%3Ar0%3Acortexa57%3A14%3A6c4873adb8e9848c540b6ad95c4b8b399d8ae85c7d13faa62c3fffe7a5aaaf81_package_write_rpm.tar.zst: HTTP Error 404: Not Found\n\n\nStderr:\n2026-04-17 12:20:37,700 - oe-selftest - INFO - Adding: \"include selftest.inc\" in /srv/pokybuild/yocto-worker/a-full/build/build-st-1721351/conf/local.conf\n2026-04-17 12:20:37,701 - oe-selftest - INFO - Adding: \"include bblayers.inc\" in bblayers.conf\n",
    "oetags": [
     "yocto-mirrors"
    ],
    "status": "FAILED"
   },
   "sstatetests.SStateMirrors.test_cdn_mirror_qemux86_64": {
    "duration": 519.6823072433472,
    "log": "testtools.testresult.real._StringException: Traceback (most recent call last):\n  File \"/srv/pokybuild/yocto-worker/a-full/build/layers/openembedded-core/meta/lib/oeqa/selftest/cases/sstatetests.py\", line 979, in test_cdn_mirror_qemux86_64\n    self.run_test(\"qemux86-64\", \"core-image-minimal core-image-full-cmdline core-image-sato-sdk\", exceptions)\n  File \"/srv/pokybuild/yocto-worker/a-full/build/layers/openembedded-core/meta/lib/oeqa/selftest/cases/sstatetests.py\", line 974, in run_test\n    self.check_bb_output(result.output, targets, exceptions, check_cdn)\n  File \"/srv/pokybuild/yocto-worker/a-full/build/layers/openembedded-core/meta/lib/oeqa/selftest/cases/sstatetests.py\", line 954, in check_bb_output\n    self.assertEqual(len(failed_urls), 0, \"Missing objects in the cache:\\n{}\\nFetcher diagnostics:\\n{}\".format(\"\\n\".join(failed_urls), \"\\n\".join(failed_urls_extrainfo)))\n  File \"/usr/lib/python3.10/unittest/case.py\", line 845, in assertEqual\n    assertion_func(first, second, msg=msg)\n  File \"/usr/lib/python3.10/unittest/case.py\", line 838, in _baseAssertEqual\n    raise self.failureException(msg)\nAssertionError: 13 != 0 : Missing objects in the cache:\nfile://35/30/sstate:packagegroup-core-tools-testapps:qemux86_64-poky-linux:1.0:r0:qemux86_64:14:3530844fbd21f2615ae4d4e0c6c2bc9c3c1e66534b110749912410bf348dd9d7_package_write_rpm.tar.zst\nfile://18/b8/sstate:mesa-demos:x86-64-v3-poky-linux:9.0.0:r0:x86-64-v3:14:18b8b8796e8a834dabf0e2e355db5791c48fe4343f0091312b877424453bcd88_package.tar.zst\nfile://86/bf/sstate:mesa-demos:x86-64-v3-poky-linux:9.0.0:r0:x86-64-v3:14:86bf039ff530cea55b41ce0d8ccd1a5cad910fe6148e64f26cb82bbdd578babd_populate_sysroot.tar.zst\nfile://79/3a/sstate:packagegroup-core-tools-testapps:qemux86_64-poky-linux:1.0:r0:qemux86_64:14:793a99544ae012980143f7c64b47e7dfa67cc758ca9fb44c695918d3087971b1_create_package_spdx.tar.zst\nfile://96/ad/sstate:mesa-demos:x86-64-v3-poky-linux:9.0.0:r0:x86-64-v3:14:96ad0df0402c88cdb93f2474d5f648b9787e6c0898777e58575f030c5682e93f_package_write_rpm.tar.zst\nfile://f2/e7/sstate:mesa-demos:x86-64-v3-poky-linux:9.0.0:r0:x86-64-v3:14:f2e75b4799757956f325e704a145e0050b60eedfe8fd1ee7754ad8fb6a56fdad_create_package_spdx.tar.zst\nfile://45/b0/sstate:mesa-demos:x86-64-v3-poky-linux:9.0.0:r0:x86-64-v3:14:45b013666d4f749d1681f9c7479e1bc0aae83477e2a1e7e29699b8604d407440_package_qa.tar.zst\nfile://7e/37/sstate:rust:x86-64-v3-poky-linux:1.94.1:r0:x86-64-v3:14:7e37b5091adb87c577348f1f51f403a1b179b5cf82ab1d3faeddfe449f857323_create_package_spdx.tar.zst\nfile://e5/ab/sstate:mesa-demos:x86-64-v3-poky-linux:9.0.0:r0:x86-64-v3:14:e5ab30c4ff4704be4fc2a9ef8a9199eaddc9c6542fef88bf2f6c917af2bdc3fe_create_spdx.tar.zst\nfile://47/9e/sstate:packagegroup-core-tools-testapps:qemux86_64-poky-linux:1.0:r0:qemux86_64:14:479eb479b0454545ac2ac90aed99643cdc6b8e9684631039d8e3c3d9d7effb37_package_write_ipk.tar.zst\nfile://b7/87/sstate:mesa-demos:x86-64-v3-poky-linux:9.0.0:r0:x86-64-v3:14:b787adb480a543f5e0accb83c45ebe1af0645bac84c83af6a4472c0522198772_packagedata.tar.zst\nfile://a9/63/sstate:packagegroup-core-tools-testapps:qemux86_64-poky-linux:1.0:r0:qemux86_64:14:a96304ed9e4d0ffd218f5623e4d8eb8182849b602b185aa454f90d29e365c2de_package_qa.tar.zst\nfile://ec/89/sstate:packagegroup-core-tools-testapps:qemux86_64-poky-linux:1.0:r0:qemux86_64:14:ec89322e7426f87b2e5e2984ce33258ddcfca6b0e497c370a58f0a006520b66b_package_write_deb.tar.zst\nFetcher diagnostics:\nDEBUG: checkstatus() urlopen failed for http://sstate.yoctoproject.org/all/35/30/sstate%3Apackagegroup-core-tools-testapps%3Aqemux86_64-poky-linux%3A1.0%3Ar0%3Aqemux86_64%3A14%3A3530844fbd21f2615ae4d4e0c6c2bc9c3c1e66534b110749912410bf348dd9d7_package_write_rpm.tar.zst: HTTP Error 404: Not Found\nDEBUG: checkstatus() urlopen failed for http://sstate.yoctoproject.org/all/18/b8/sstate%3Amesa-demos%3Ax86-64-v3-poky-linux%3A9.0.0%3Ar0%3Ax86-64-v3%3A14%3A18b8b8796e8a834dabf0e2e355db5791c48fe4343f0091312b877424453bcd88_package.tar.zst: HTTP Error 404: Not Found\nDEBUG: checkstatus() urlopen failed for http://sstate.yoctoproject.org/all/86/bf/sstate%3Amesa-demos%3Ax86-64-v3-poky-linux%3A9.0.0%3Ar0%3Ax86-64-v3%3A14%3A86bf039ff530cea55b41ce0d8ccd1a5cad910fe6148e64f26cb82bbdd578babd_populate_sysroot.tar.zst: HTTP Error 404: Not Found\nDEBUG: checkstatus() urlopen failed for http://sstate.yoctoproject.org/all/79/3a/sstate%3Apackagegroup-core-tools-testapps%3Aqemux86_64-poky-linux%3A1.0%3Ar0%3Aqemux86_64%3A14%3A793a99544ae012980143f7c64b47e7dfa67cc758ca9fb44c695918d3087971b1_create_package_spdx.tar.zst: HTTP Error 404: Not Found\nDEBUG: checkstatus() urlopen failed for http://sstate.yoctoproject.org/all/96/ad/sstate%3Amesa-demos%3Ax86-64-v3-poky-linux%3A9.0.0%3Ar0%3Ax86-64-v3%3A14%3A96ad0df0402c88cdb93f2474d5f648b9787e6c0898777e58575f030c5682e93f_package_write_rpm.tar.zst: HTTP Error 404: Not Found\nDEBUG: checkstatus() urlopen failed for http://sstate.yoctoproject.org/all/f2/e7/sstate%3Amesa-demos%3Ax86-64-v3-poky-linux%3A9.0.0%3Ar0%3Ax86-64-v3%3A14%3Af2e75b4799757956f325e704a145e0050b60eedfe8fd1ee7754ad8fb6a56fdad_create_package_spdx.tar.zst: HTTP Error 404: Not Found\nDEBUG: checkstatus() urlopen failed for http://sstate.yoctoproject.org/all/45/b0/sstate%3Amesa-demos%3Ax86-64-v3-poky-linux%3A9.0.0%3Ar0%3Ax86-64-v3%3A14%3A45b013666d4f749d1681f9c7479e1bc0aae83477e2a1e7e29699b8604d407440_package_qa.tar.zst: HTTP Error 404: Not Found\nDEBUG: checkstatus() urlopen failed for http://sstate.yoctoproject.org/all/7e/37/sstate%3Arust%3Ax86-64-v3-poky-linux%3A1.94.1%3Ar0%3Ax86-64-v3%3A14%3A7e37b5091adb87c577348f1f51f403a1b179b5cf82ab1d3faeddfe449f857323_create_package_spdx.tar.zst: HTTP Error 404: Not Found\nDEBUG: checkstatus() urlopen failed for http://sstate.yoctoproject.org/all/e5/ab/sstate%3Amesa-demos%3Ax86-64-v3-poky-linux%3A9.0.0%3Ar0%3Ax86-64-v3%3A14%3Ae5ab30c4ff4704be4fc2a9ef8a9199eaddc9c6542fef88bf2f6c917af2bdc3fe_create_spdx.tar.zst: HTTP Error 404: Not Found\nDEBUG: checkstatus() urlopen failed for http://sstate.yoctoproject.org/all/47/9e/sstate%3Apackagegroup-core-tools-testapps%3Aqemux86_64-poky-linux%3A1.0%3Ar0%3Aqemux86_64%3A14%3A479eb479b0454545ac2ac90aed99643cdc6b8e9684631039d8e3c3d9d7effb37_package_write_ipk.tar.zst: HTTP Error 404: Not Found\nDEBUG: checkstatus() urlopen failed for http://sstate.yoctoproject.org/all/b7/87/sstate%3Amesa-demos%3Ax86-64-v3-poky-linux%3A9.0.0%3Ar0%3Ax86-64-v3%3A14%3Ab787adb480a543f5e0accb83c45ebe1af0645bac84c83af6a4472c0522198772_packagedata.tar.zst: HTTP Error 404: Not Found\nDEBUG: checkstatus() urlopen failed for http://sstate.yoctoproject.org/all/a9/63/sstate%3Apackagegroup-core-tools-testapps%3Aqemux86_64-poky-linux%3A1.0%3Ar0%3Aqemux86_64%3A14%3Aa96304ed9e4d0ffd218f5623e4d8eb8182849b602b185aa454f90d29e365c2de_package_qa.tar.zst: HTTP Error 404: Not Found\nDEBUG: checkstatus() urlopen failed for http://sstate.yoctoproject.org/all/ec/89/sstate%3Apackagegroup-core-tools-testapps%3Aqemux86_64-poky-linux%3A1.0%3Ar0%3Aqemux86_64%3A14%3Aec89322e7426f87b2e5e2984ce33258ddcfca6b0e497c370a58f0a006520b66b_package_write_deb.tar.zst: HTTP Error 404: Not Found\n\n\nStderr:\n2026-04-17 12:20:37,700 - oe-selftest - INFO - Adding: \"include selftest.inc\" in /srv/pokybuild/yocto-worker/a-full/build/build-st-1721351/conf/local.conf\n2026-04-17 12:20:37,701 - oe-selftest - INFO - Adding: \"include bblayers.inc\" in bblayers.conf\n",
    "oetags": [
     "yocto-mirrors"
    ],
    "status": "FAILED"
   },
   "sstatetests.SStateMirrors.test_local_cache_qemuarm64": {
    "duration": 141.78179478645325,
    "log": "testtools.testresult.real._StringException: Traceback (most recent call last):\n  File \"/srv/pokybuild/yocto-worker/a-full/build/layers/openembedded-core/meta/lib/oeqa/selftest/cases/sstatetests.py\", line 992, in test_local_cache_qemuarm64\n    self.run_test(\"qemuarm64\", \"core-image-minimal core-image-full-cmdline core-image-sato-sdk\", exceptions, check_cdn = False)\n  File \"/srv/pokybuild/yocto-worker/a-full/build/layers/openembedded-core/meta/lib/oeqa/selftest/cases/sstatetests.py\", line 974, in run_test\n    self.check_bb_output(result.output, targets, exceptions, check_cdn)\n  File \"/srv/pokybuild/yocto-worker/a-full/build/layers/openembedded-core/meta/lib/oeqa/selftest/cases/sstatetests.py\", line 954, in check_bb_output\n    self.assertEqual(len(failed_urls), 0, \"Missing objects in the cache:\\n{}\\nFetcher diagnostics:\\n{}\".format(\"\\n\".join(failed_urls), \"\\n\".join(failed_urls_extrainfo)))\n  File \"/usr/lib/python3.10/unittest/case.py\", line 845, in assertEqual\n    assertion_func(first, second, msg=msg)\n  File \"/usr/lib/python3.10/unittest/case.py\", line 838, in _baseAssertEqual\n    raise self.failureException(msg)\nAssertionError: 7 != 0 : Missing objects in the cache:\n/srv/autobuilder/valkyrie.yocto.io/pub/sstate/d9/d5/sstate:rust:cortexa57-poky-linux:1.94.1:r0:cortexa57:14:d9d5331a3c7f8034c6c74496ff3e716f1d8fd254f60c545712897f1edb9083eb_populate_sysroot.tar.zst\n/srv/autobuilder/valkyrie.yocto.io/pub/sstate/a0/c6/sstate:rust:cortexa57-poky-linux:1.94.1:r0:cortexa57:14:a0c627a65f0830e3a3ebfb5e76178f91df99bf733ad4254c0d232dc56692409a_package_qa.tar.zst\n/srv/autobuilder/valkyrie.yocto.io/pub/sstate/fb/9c/sstate:rust:cortexa57-poky-linux:1.94.1:r0:cortexa57:14:fb9c3d2288d3c81fe448de63af7ceb3f31d8f1296acc09a135cba9fac70609e4_packagedata.tar.zst\n/srv/autobuilder/valkyrie.yocto.io/pub/sstate/e4/4b/sstate:rust:cortexa57-poky-linux:1.94.1:r0:cortexa57:14:e44b9c1a7a070bca9c6dc5ee543cfd12ddf693aace7526cdb2cf7bfec31ffc0e_create_package_spdx.tar.zst\n/srv/autobuilder/valkyrie.yocto.io/pub/sstate/15/23/sstate:rust:cortexa57-poky-linux:1.94.1:r0:cortexa57:14:15238cec8b328ce5df643e9a7b012ad01cb75b68a0abae240ed0918676ec09f2_create_spdx.tar.zst\n/srv/autobuilder/valkyrie.yocto.io/pub/sstate/82/a2/sstate:rust:cortexa57-poky-linux:1.94.1:r0:cortexa57:14:82a244a94633a2aa34db53edd745ffdb97004494d11fdf71e6d69f933a9961e2_package.tar.zst\n/srv/autobuilder/valkyrie.yocto.io/pub/sstate/6c/48/sstate:rust:cortexa57-poky-linux:1.94.1:r0:cortexa57:14:6c4873adb8e9848c540b6ad95c4b8b399d8ae85c7d13faa62c3fffe7a5aaaf81_package_write_rpm.tar.zst\nFetcher diagnostics:\n\n\nStderr:\n2026-04-17 12:20:37,700 - oe-selftest - INFO - Adding: \"include selftest.inc\" in /srv/pokybuild/yocto-worker/a-full/build/build-st-1721351/conf/local.conf\n2026-04-17 12:20:37,701 - oe-selftest - INFO - Adding: \"include bblayers.inc\" in bblayers.conf\n",
    "oetags": [
     "yocto-mirrors"
    ],
    "status": "FAILED"
   },
   "sstatetests.SStateMirrors.test_local_cache_qemux86_64": {
    "duration": 129.27322816848755,
    "log": "testtools.testresult.real._StringException: Traceback (most recent call last):\n  File \"/srv/pokybuild/yocto-worker/a-full/build/layers/openembedded-core/meta/lib/oeqa/selftest/cases/sstatetests.py\", line 988, in test_local_cache_qemux86_64\n    self.run_test(\"qemux86-64\", \"core-image-minimal core-image-full-cmdline core-image-sato-sdk\", exceptions, check_cdn = False)\n  File \"/srv/pokybuild/yocto-worker/a-full/build/layers/openembedded-core/meta/lib/oeqa/selftest/cases/sstatetests.py\", line 974, in run_test\n    self.check_bb_output(result.output, targets, exceptions, check_cdn)\n  File \"/srv/pokybuild/yocto-worker/a-full/build/layers/openembedded-core/meta/lib/oeqa/selftest/cases/sstatetests.py\", line 954, in check_bb_output\n    self.assertEqual(len(failed_urls), 0, \"Missing objects in the cache:\\n{}\\nFetcher diagnostics:\\n{}\".format(\"\\n\".join(failed_urls), \"\\n\".join(failed_urls_extrainfo)))\n  File \"/usr/lib/python3.10/unittest/case.py\", line 845, in assertEqual\n    assertion_func(first, second, msg=msg)\n  File \"/usr/lib/python3.10/unittest/case.py\", line 838, in _baseAssertEqual\n    raise self.failureException(msg)\nAssertionError: 13 != 0 : Missing objects in the cache:\n/srv/autobuilder/valkyrie.yocto.io/pub/sstate/35/30/sstate:packagegroup-core-tools-testapps:qemux86_64-poky-linux:1.0:r0:qemux86_64:14:3530844fbd21f2615ae4d4e0c6c2bc9c3c1e66534b110749912410bf348dd9d7_package_write_rpm.tar.zst\n/srv/autobuilder/valkyrie.yocto.io/pub/sstate/18/b8/sstate:mesa-demos:x86-64-v3-poky-linux:9.0.0:r0:x86-64-v3:14:18b8b8796e8a834dabf0e2e355db5791c48fe4343f0091312b877424453bcd88_package.tar.zst\n/srv/autobuilder/valkyrie.yocto.io/pub/sstate/86/bf/sstate:mesa-demos:x86-64-v3-poky-linux:9.0.0:r0:x86-64-v3:14:86bf039ff530cea55b41ce0d8ccd1a5cad910fe6148e64f26cb82bbdd578babd_populate_sysroot.tar.zst\n/srv/autobuilder/valkyrie.yocto.io/pub/sstate/79/3a/sstate:packagegroup-core-tools-testapps:qemux86_64-poky-linux:1.0:r0:qemux86_64:14:793a99544ae012980143f7c64b47e7dfa67cc758ca9fb44c695918d3087971b1_create_package_spdx.tar.zst\n/srv/autobuilder/valkyrie.yocto.io/pub/sstate/96/ad/sstate:mesa-demos:x86-64-v3-poky-linux:9.0.0:r0:x86-64-v3:14:96ad0df0402c88cdb93f2474d5f648b9787e6c0898777e58575f030c5682e93f_package_write_rpm.tar.zst\n/srv/autobuilder/valkyrie.yocto.io/pub/sstate/f2/e7/sstate:mesa-demos:x86-64-v3-poky-linux:9.0.0:r0:x86-64-v3:14:f2e75b4799757956f325e704a145e0050b60eedfe8fd1ee7754ad8fb6a56fdad_create_package_spdx.tar.zst\n/srv/autobuilder/valkyrie.yocto.io/pub/sstate/45/b0/sstate:mesa-demos:x86-64-v3-poky-linux:9.0.0:r0:x86-64-v3:14:45b013666d4f749d1681f9c7479e1bc0aae83477e2a1e7e29699b8604d407440_package_qa.tar.zst\n/srv/autobuilder/valkyrie.yocto.io/pub/sstate/7e/37/sstate:rust:x86-64-v3-poky-linux:1.94.1:r0:x86-64-v3:14:7e37b5091adb87c577348f1f51f403a1b179b5cf82ab1d3faeddfe449f857323_create_package_spdx.tar.zst\n/srv/autobuilder/valkyrie.yocto.io/pub/sstate/e5/ab/sstate:mesa-demos:x86-64-v3-poky-linux:9.0.0:r0:x86-64-v3:14:e5ab30c4ff4704be4fc2a9ef8a9199eaddc9c6542fef88bf2f6c917af2bdc3fe_create_spdx.tar.zst\n/srv/autobuilder/valkyrie.yocto.io/pub/sstate/47/9e/sstate:packagegroup-core-tools-testapps:qemux86_64-poky-linux:1.0:r0:qemux86_64:14:479eb479b0454545ac2ac90aed99643cdc6b8e9684631039d8e3c3d9d7effb37_package_write_ipk.tar.zst\n/srv/autobuilder/valkyrie.yocto.io/pub/sstate/b7/87/sstate:mesa-demos:x86-64-v3-poky-linux:9.0.0:r0:x86-64-v3:14:b787adb480a543f5e0accb83c45ebe1af0645bac84c83af6a4472c0522198772_packagedata.tar.zst\n/srv/autobuilder/valkyrie.yocto.io/pub/sstate/a9/63/sstate:packagegroup-core-tools-testapps:qemux86_64-poky-linux:1.0:r0:qemux86_64:14:a96304ed9e4d0ffd218f5623e4d8eb8182849b602b185aa454f90d29e365c2de_package_qa.tar.zst\n/srv/autobuilder/valkyrie.yocto.io/pub/sstate/ec/89/sstate:packagegroup-core-tools-testapps:qemux86_64-poky-linux:1.0:r0:qemux86_64:14:ec89322e7426f87b2e5e2984ce33258ddcfca6b0e497c370a58f0a006520b66b_package_write_deb.tar.zst\nFetcher diagnostics:\n\n\nStderr:\n2026-04-17 12:20:37,700 - oe-selftest - INFO - Adding: \"include selftest.inc\" in /srv/pokybuild/yocto-worker/a-full/build/build-st-1721351/conf/local.conf\n2026-04-17 12:20:37,701 - oe-selftest - INFO - Adding: \"include bblayers.inc\" in bblayers.conf\n",
    "oetags": [
     "yocto-mirrors"
    ],
    "status": "FAILED"
   }
  }
 }
}