{
 "oeselftest_debian-13_qemux86-64_20260423172246": {
  "configuration": {
   "HOST_DISTRO": "debian-13",
   "HOST_NAME": "debian13-vk-1",
   "LAYERS": {
    "meta": {
     "branch": "mathieu/master-next-tests",
     "commit": "b94d200a055f537164318a32a3375148534ebe74",
     "commit_count": 66954,
     "commit_time": 1776942512
    },
    "meta-poky": {
     "branch": "contrib/mathieu/master-next",
     "commit": "a2880a93c60015f79128b560387951e8867da342",
     "commit_count": 1787,
     "commit_time": 1776430858
    },
    "meta-selftest": {
     "branch": "mathieu/master-next-tests",
     "commit": "b94d200a055f537164318a32a3375148534ebe74",
     "commit_count": 66954,
     "commit_time": 1776942512
    },
    "meta-yocto-bsp": {
     "branch": "contrib/mathieu/master-next",
     "commit": "a2880a93c60015f79128b560387951e8867da342",
     "commit_count": 1787,
     "commit_time": 1776430858
    }
   },
   "MACHINE": "qemux86-64",
   "OESELFTEST_METADATA": {
    "exclude_tags": null,
    "run_all_tests": true,
    "run_tests": null,
    "select_tags": [
     "yocto-mirrors"
    ],
    "skips": null
   },
   "STARTTIME": "20260423172246",
   "TEST_TYPE": "oeselftest"
  },
  "result": {
   "buildoptions.SourceMirroring.test_yocto_source_mirror": {
    "duration": 229.35955572128296,
    "oetags": [
     "yocto-mirrors"
    ],
    "status": "PASSED"
   },
   "sstatetests.SStateMirrors.test_cdn_mirror_qemuarm64": {
    "duration": 542.3117549419403,
    "log": "testtools.testresult.real._StringException: Traceback (most recent call last):\n  File \"/srv/pokybuild/yocto-worker/a-full/build/layers/openembedded-core/meta/lib/oeqa/selftest/cases/sstatetests.py\", line 984, in test_cdn_mirror_qemuarm64\n    self.run_test(\"qemuarm64\", \"core-image-minimal core-image-full-cmdline core-image-sato-sdk\", exceptions)\n    ~~~~~~~~~~~~~^^^^^^^^^^^^^^^^^^^^^^^^^^^^^^^^^^^^^^^^^^^^^^^^^^^^^^^^^^^^^^^^^^^^^^^^^^^^^^^^^^^^^^^^^^^\n  File \"/srv/pokybuild/yocto-worker/a-full/build/layers/openembedded-core/meta/lib/oeqa/selftest/cases/sstatetests.py\", line 974, in run_test\n    self.check_bb_output(result.output, targets, exceptions, check_cdn)\n    ~~~~~~~~~~~~~~~~~~~~^^^^^^^^^^^^^^^^^^^^^^^^^^^^^^^^^^^^^^^^^^^^^^^\n  File \"/srv/pokybuild/yocto-worker/a-full/build/layers/openembedded-core/meta/lib/oeqa/selftest/cases/sstatetests.py\", line 954, in check_bb_output\n    self.assertEqual(len(failed_urls), 0, \"Missing objects in the cache:\\n{}\\nFetcher diagnostics:\\n{}\".format(\"\\n\".join(failed_urls), \"\\n\".join(failed_urls_extrainfo)))\n    ~~~~~~~~~~~~~~~~^^^^^^^^^^^^^^^^^^^^^^^^^^^^^^^^^^^^^^^^^^^^^^^^^^^^^^^^^^^^^^^^^^^^^^^^^^^^^^^^^^^^^^^^^^^^^^^^^^^^^^^^^^^^^^^^^^^^^^^^^^^^^^^^^^^^^^^^^^^^^^^^^^^^^\n  File \"/usr/lib/python3.13/unittest/case.py\", line 907, in assertEqual\n    assertion_func(first, second, msg=msg)\n    ~~~~~~~~~~~~~~^^^^^^^^^^^^^^^^^^^^^^^^\n  File \"/usr/lib/python3.13/unittest/case.py\", line 900, in _baseAssertEqual\n    raise self.failureException(msg)\n/usr/lib/python3.13/unittest/case.py:597: RuntimeWarning: TestResult has no addDuration method\n  warnings.warn(\"TestResult has no addDuration method\",\n\nAssertionError: 7 != 0 : Missing objects in the cache:\nfile://18/ce/sstate:rust:cortexa57-poky-linux:1.94.1:r0:cortexa57:14:18ce6e0b97cb2056a68a7aadc03a80b3562b8ebde2377f8e62584b6bf2244ad2_package.tar.zst\nfile://88/54/sstate:rust:cortexa57-poky-linux:1.94.1:r0:cortexa57:14:885499c7233b5a2b6b7ce7ce89b06daef60989909c8a92ca092e90c33e5a5dff_package_write_rpm.tar.zst\nfile://94/0b/sstate:rust:cortexa57-poky-linux:1.94.1:r0:cortexa57:14:940baf52581148e0e2c9452f7d07d8c1cef59d95092ddeb652ebba05f2140a39_create_spdx.tar.zst\nfile://31/42/sstate:rust:cortexa57-poky-linux:1.94.1:r0:cortexa57:14:314267db1547e44825b564adcc99ee006dae33318409eda28f30860b8d5ac1c3_packagedata.tar.zst\nfile://6d/6f/sstate:rust:cortexa57-poky-linux:1.94.1:r0:cortexa57:14:6d6f80df187ab40d01eed0299e9eb722dd952dad535e56a5bd6816a9bfceb76b_create_package_spdx.tar.zst\nfile://57/25/sstate:rust:cortexa57-poky-linux:1.94.1:r0:cortexa57:14:572595d9822927595430942f933caa382258f95e2c280132b77d37d9389553b1_package_qa.tar.zst\nfile://bf/f2/sstate:rust:cortexa57-poky-linux:1.94.1:r0:cortexa57:14:bff212f0aa3169c2bcfc388dbafdce2fbefe9fb7ba42ac59f83f29b91a03b984_populate_sysroot.tar.zst\nFetcher diagnostics:\nDEBUG: checkstatus() urlopen failed for http://sstate.yoctoproject.org/all/18/ce/sstate%3Arust%3Acortexa57-poky-linux%3A1.94.1%3Ar0%3Acortexa57%3A14%3A18ce6e0b97cb2056a68a7aadc03a80b3562b8ebde2377f8e62584b6bf2244ad2_package.tar.zst: HTTP Error 404: Not Found\nDEBUG: checkstatus() urlopen failed for http://sstate.yoctoproject.org/all/88/54/sstate%3Arust%3Acortexa57-poky-linux%3A1.94.1%3Ar0%3Acortexa57%3A14%3A885499c7233b5a2b6b7ce7ce89b06daef60989909c8a92ca092e90c33e5a5dff_package_write_rpm.tar.zst: HTTP Error 404: Not Found\nDEBUG: checkstatus() urlopen failed for http://sstate.yoctoproject.org/all/94/0b/sstate%3Arust%3Acortexa57-poky-linux%3A1.94.1%3Ar0%3Acortexa57%3A14%3A940baf52581148e0e2c9452f7d07d8c1cef59d95092ddeb652ebba05f2140a39_create_spdx.tar.zst: HTTP Error 404: Not Found\nDEBUG: checkstatus() urlopen failed for http://sstate.yoctoproject.org/all/31/42/sstate%3Arust%3Acortexa57-poky-linux%3A1.94.1%3Ar0%3Acortexa57%3A14%3A314267db1547e44825b564adcc99ee006dae33318409eda28f30860b8d5ac1c3_packagedata.tar.zst: HTTP Error 404: Not Found\nDEBUG: checkstatus() urlopen failed for http://sstate.yoctoproject.org/all/6d/6f/sstate%3Arust%3Acortexa57-poky-linux%3A1.94.1%3Ar0%3Acortexa57%3A14%3A6d6f80df187ab40d01eed0299e9eb722dd952dad535e56a5bd6816a9bfceb76b_create_package_spdx.tar.zst: HTTP Error 404: Not Found\nDEBUG: checkstatus() urlopen failed for http://sstate.yoctoproject.org/all/57/25/sstate%3Arust%3Acortexa57-poky-linux%3A1.94.1%3Ar0%3Acortexa57%3A14%3A572595d9822927595430942f933caa382258f95e2c280132b77d37d9389553b1_package_qa.tar.zst: HTTP Error 404: Not Found\nDEBUG: checkstatus() urlopen failed for http://sstate.yoctoproject.org/all/bf/f2/sstate%3Arust%3Acortexa57-poky-linux%3A1.94.1%3Ar0%3Acortexa57%3A14%3Abff212f0aa3169c2bcfc388dbafdce2fbefe9fb7ba42ac59f83f29b91a03b984_populate_sysroot.tar.zst: HTTP Error 404: Not Found\n\n\nStderr:\n2026-04-23 17:22:48,986 - oe-selftest - INFO - Adding: \"include selftest.inc\" in /srv/pokybuild/yocto-worker/a-full/build/build-st-2991849/conf/local.conf\n2026-04-23 17:22:48,986 - oe-selftest - INFO - Adding: \"include bblayers.inc\" in bblayers.conf\n",
    "oetags": [
     "yocto-mirrors"
    ],
    "status": "FAILED"
   },
   "sstatetests.SStateMirrors.test_cdn_mirror_qemux86_64": {
    "duration": 469.4786913394928,
    "log": "testtools.testresult.real._StringException: Traceback (most recent call last):\n  File \"/srv/pokybuild/yocto-worker/a-full/build/layers/openembedded-core/meta/lib/oeqa/selftest/cases/sstatetests.py\", line 979, in test_cdn_mirror_qemux86_64\n    self.run_test(\"qemux86-64\", \"core-image-minimal core-image-full-cmdline core-image-sato-sdk\", exceptions)\n    ~~~~~~~~~~~~~^^^^^^^^^^^^^^^^^^^^^^^^^^^^^^^^^^^^^^^^^^^^^^^^^^^^^^^^^^^^^^^^^^^^^^^^^^^^^^^^^^^^^^^^^^^^\n  File \"/srv/pokybuild/yocto-worker/a-full/build/layers/openembedded-core/meta/lib/oeqa/selftest/cases/sstatetests.py\", line 974, in run_test\n    self.check_bb_output(result.output, targets, exceptions, check_cdn)\n    ~~~~~~~~~~~~~~~~~~~~^^^^^^^^^^^^^^^^^^^^^^^^^^^^^^^^^^^^^^^^^^^^^^^\n  File \"/srv/pokybuild/yocto-worker/a-full/build/layers/openembedded-core/meta/lib/oeqa/selftest/cases/sstatetests.py\", line 954, in check_bb_output\n    self.assertEqual(len(failed_urls), 0, \"Missing objects in the cache:\\n{}\\nFetcher diagnostics:\\n{}\".format(\"\\n\".join(failed_urls), \"\\n\".join(failed_urls_extrainfo)))\n    ~~~~~~~~~~~~~~~~^^^^^^^^^^^^^^^^^^^^^^^^^^^^^^^^^^^^^^^^^^^^^^^^^^^^^^^^^^^^^^^^^^^^^^^^^^^^^^^^^^^^^^^^^^^^^^^^^^^^^^^^^^^^^^^^^^^^^^^^^^^^^^^^^^^^^^^^^^^^^^^^^^^^^\n  File \"/usr/lib/python3.13/unittest/case.py\", line 907, in assertEqual\n    assertion_func(first, second, msg=msg)\n    ~~~~~~~~~~~~~~^^^^^^^^^^^^^^^^^^^^^^^^\n  File \"/usr/lib/python3.13/unittest/case.py\", line 900, in _baseAssertEqual\n    raise self.failureException(msg)\nAssertionError: 13 != 0 : Missing objects in the cache:\nfile://5c/1f/sstate:packagegroup-core-tools-testapps:qemux86_64-poky-linux:1.0:r0:qemux86_64:14:5c1f44abbd5f8e0572b1a17b036672ac5bc8d8d9796cf9db8d688984cdf240eb_package_write_ipk.tar.zst\nfile://6c/e7/sstate:mesa-demos:x86-64-v3-poky-linux:9.0.0:r0:x86-64-v3:14:6ce73c0f3e1291c3e2e06dc348948ec3bbcfa520821257bee5df81e5514f7fcf_populate_sysroot.tar.zst\nfile://d1/9f/sstate:mesa-demos:x86-64-v3-poky-linux:9.0.0:r0:x86-64-v3:14:d19f181e06da482b0c54cc55b9641286e67babb98bea6ba428b6c4af1ccdb503_package.tar.zst\nfile://f3/90/sstate:mesa-demos:x86-64-v3-poky-linux:9.0.0:r0:x86-64-v3:14:f390bdab23ffd8737aa979983d4877d64455d799f887e5f96906ec2b887efeaf_create_spdx.tar.zst\nfile://8a/cb/sstate:mesa-demos:x86-64-v3-poky-linux:9.0.0:r0:x86-64-v3:14:8acb3d1cec21cb25b9c6f165ed4dbdf4ca5183aa141bf9bb06e104bb3202780a_packagedata.tar.zst\nfile://90/44/sstate:packagegroup-core-tools-testapps:qemux86_64-poky-linux:1.0:r0:qemux86_64:14:904432a57441a72a9d2ac67cc7241beb64ffaeee5f2de7c2c4ec02b08caea076_package_write_rpm.tar.zst\nfile://f6/52/sstate:packagegroup-core-tools-testapps:qemux86_64-poky-linux:1.0:r0:qemux86_64:14:f65235b68d03294fd90c57a2dc79558435ce04fa626cdad982dcd10f2ae74697_create_package_spdx.tar.zst\nfile://0a/d8/sstate:mesa-demos:x86-64-v3-poky-linux:9.0.0:r0:x86-64-v3:14:0ad86ef95ff41863f694825dc147df111983612f1e1d69ea55846025e7f7bcab_package_qa.tar.zst\nfile://13/4a/sstate:mesa-demos:x86-64-v3-poky-linux:9.0.0:r0:x86-64-v3:14:134a858db887ce2877c22004fc9fa81b60536a8538dffe991d00ed370903c126_package_write_rpm.tar.zst\nfile://6f/cc/sstate:rust:x86-64-v3-poky-linux:1.94.1:r0:x86-64-v3:14:6fcc1216a46fc05920b570c46583c27d0eab4d2e1a9fc2ac4dc22784550ec266_create_package_spdx.tar.zst\nfile://5b/ab/sstate:packagegroup-core-tools-testapps:qemux86_64-poky-linux:1.0:r0:qemux86_64:14:5bab684a894bd777c40a801eb951af5ae044e19f214d1bfcbb816c2f89bf7f0d_package_write_deb.tar.zst\nfile://54/1e/sstate:mesa-demos:x86-64-v3-poky-linux:9.0.0:r0:x86-64-v3:14:541ef922b60a455fbeb8fd83de6373957a4e71286eae4a76311948fe4380ba1b_create_package_spdx.tar.zst\nfile://f5/56/sstate:packagegroup-core-tools-testapps:qemux86_64-poky-linux:1.0:r0:qemux86_64:14:f556490a8c683493fa8330f9e9da7f161d4f1ab605c6d58736ddda89060cca34_package_qa.tar.zst\nFetcher diagnostics:\nDEBUG: checkstatus() urlopen failed for http://sstate.yoctoproject.org/all/5c/1f/sstate%3Apackagegroup-core-tools-testapps%3Aqemux86_64-poky-linux%3A1.0%3Ar0%3Aqemux86_64%3A14%3A5c1f44abbd5f8e0572b1a17b036672ac5bc8d8d9796cf9db8d688984cdf240eb_package_write_ipk.tar.zst: HTTP Error 404: Not Found\nDEBUG: checkstatus() urlopen failed for http://sstate.yoctoproject.org/all/6c/e7/sstate%3Amesa-demos%3Ax86-64-v3-poky-linux%3A9.0.0%3Ar0%3Ax86-64-v3%3A14%3A6ce73c0f3e1291c3e2e06dc348948ec3bbcfa520821257bee5df81e5514f7fcf_populate_sysroot.tar.zst: HTTP Error 404: Not Found\nDEBUG: checkstatus() urlopen failed for http://sstate.yoctoproject.org/all/d1/9f/sstate%3Amesa-demos%3Ax86-64-v3-poky-linux%3A9.0.0%3Ar0%3Ax86-64-v3%3A14%3Ad19f181e06da482b0c54cc55b9641286e67babb98bea6ba428b6c4af1ccdb503_package.tar.zst: HTTP Error 404: Not Found\nDEBUG: checkstatus() urlopen failed for http://sstate.yoctoproject.org/all/f3/90/sstate%3Amesa-demos%3Ax86-64-v3-poky-linux%3A9.0.0%3Ar0%3Ax86-64-v3%3A14%3Af390bdab23ffd8737aa979983d4877d64455d799f887e5f96906ec2b887efeaf_create_spdx.tar.zst: HTTP Error 404: Not Found\nDEBUG: checkstatus() urlopen failed for http://sstate.yoctoproject.org/all/8a/cb/sstate%3Amesa-demos%3Ax86-64-v3-poky-linux%3A9.0.0%3Ar0%3Ax86-64-v3%3A14%3A8acb3d1cec21cb25b9c6f165ed4dbdf4ca5183aa141bf9bb06e104bb3202780a_packagedata.tar.zst: HTTP Error 404: Not Found\nDEBUG: checkstatus() urlopen failed for http://sstate.yoctoproject.org/all/90/44/sstate%3Apackagegroup-core-tools-testapps%3Aqemux86_64-poky-linux%3A1.0%3Ar0%3Aqemux86_64%3A14%3A904432a57441a72a9d2ac67cc7241beb64ffaeee5f2de7c2c4ec02b08caea076_package_write_rpm.tar.zst: HTTP Error 404: Not Found\nDEBUG: checkstatus() urlopen failed for http://sstate.yoctoproject.org/all/f6/52/sstate%3Apackagegroup-core-tools-testapps%3Aqemux86_64-poky-linux%3A1.0%3Ar0%3Aqemux86_64%3A14%3Af65235b68d03294fd90c57a2dc79558435ce04fa626cdad982dcd10f2ae74697_create_package_spdx.tar.zst: HTTP Error 404: Not Found\nDEBUG: checkstatus() urlopen failed for http://sstate.yoctoproject.org/all/0a/d8/sstate%3Amesa-demos%3Ax86-64-v3-poky-linux%3A9.0.0%3Ar0%3Ax86-64-v3%3A14%3A0ad86ef95ff41863f694825dc147df111983612f1e1d69ea55846025e7f7bcab_package_qa.tar.zst: HTTP Error 404: Not Found\nDEBUG: checkstatus() urlopen failed for http://sstate.yoctoproject.org/all/13/4a/sstate%3Amesa-demos%3Ax86-64-v3-poky-linux%3A9.0.0%3Ar0%3Ax86-64-v3%3A14%3A134a858db887ce2877c22004fc9fa81b60536a8538dffe991d00ed370903c126_package_write_rpm.tar.zst: HTTP Error 404: Not Found\nDEBUG: checkstatus() urlopen failed for http://sstate.yoctoproject.org/all/6f/cc/sstate%3Arust%3Ax86-64-v3-poky-linux%3A1.94.1%3Ar0%3Ax86-64-v3%3A14%3A6fcc1216a46fc05920b570c46583c27d0eab4d2e1a9fc2ac4dc22784550ec266_create_package_spdx.tar.zst: HTTP Error 404: Not Found\nDEBUG: checkstatus() urlopen failed for http://sstate.yoctoproject.org/all/5b/ab/sstate%3Apackagegroup-core-tools-testapps%3Aqemux86_64-poky-linux%3A1.0%3Ar0%3Aqemux86_64%3A14%3A5bab684a894bd777c40a801eb951af5ae044e19f214d1bfcbb816c2f89bf7f0d_package_write_deb.tar.zst: HTTP Error 404: Not Found\nDEBUG: checkstatus() urlopen failed for http://sstate.yoctoproject.org/all/54/1e/sstate%3Amesa-demos%3Ax86-64-v3-poky-linux%3A9.0.0%3Ar0%3Ax86-64-v3%3A14%3A541ef922b60a455fbeb8fd83de6373957a4e71286eae4a76311948fe4380ba1b_create_package_spdx.tar.zst: HTTP Error 404: Not Found\nDEBUG: checkstatus() urlopen failed for http://sstate.yoctoproject.org/all/f5/56/sstate%3Apackagegroup-core-tools-testapps%3Aqemux86_64-poky-linux%3A1.0%3Ar0%3Aqemux86_64%3A14%3Af556490a8c683493fa8330f9e9da7f161d4f1ab605c6d58736ddda89060cca34_package_qa.tar.zst: HTTP Error 404: Not Found\n/usr/lib/python3.13/unittest/case.py:597: RuntimeWarning: TestResult has no addDuration method\n  warnings.warn(\"TestResult has no addDuration method\",\n\n\nStderr:\n2026-04-23 17:22:48,986 - oe-selftest - INFO - Adding: \"include selftest.inc\" in /srv/pokybuild/yocto-worker/a-full/build/build-st-2991849/conf/local.conf\n2026-04-23 17:22:48,986 - oe-selftest - INFO - Adding: \"include bblayers.inc\" in bblayers.conf\n",
    "oetags": [
     "yocto-mirrors"
    ],
    "status": "FAILED"
   },
   "sstatetests.SStateMirrors.test_local_cache_qemuarm64": {
    "duration": 118.26503539085388,
    "log": "testtools.testresult.real._StringException: Traceback (most recent call last):\n  File \"/srv/pokybuild/yocto-worker/a-full/build/layers/openembedded-core/meta/lib/oeqa/selftest/cases/sstatetests.py\", line 992, in test_local_cache_qemuarm64\n    self.run_test(\"qemuarm64\", \"core-image-minimal core-image-full-cmdline core-image-sato-sdk\", exceptions, check_cdn = False)\n    ~~~~~~~~~~~~~^^^^^^^^^^^^^^^^^^^^^^^^^^^^^^^^^^^^^^^^^^^^^^^^^^^^^^^^^^^^^^^^^^^^^^^^^^^^^^^^^^^^^^^^^^^^^^^^^^^^^^^^^^^^^^\n  File \"/srv/pokybuild/yocto-worker/a-full/build/layers/openembedded-core/meta/lib/oeqa/selftest/cases/sstatetests.py\", line 974, in run_test\n    self.check_bb_output(result.output, targets, exceptions, check_cdn)\n    ~~~~~~~~~~~~~~~~~~~~^^^^^^^^^^^^^^^^^^^^^^^^^^^^^^^^^^^^^^^^^^^^^^^\n  File \"/srv/pokybuild/yocto-worker/a-full/build/layers/openembedded-core/meta/lib/oeqa/selftest/cases/sstatetests.py\", line 954, in check_bb_output\n    self.assertEqual(len(failed_urls), 0, \"Missing objects in the cache:\\n{}\\nFetcher diagnostics:\\n{}\".format(\"\\n\".join(failed_urls), \"\\n\".join(failed_urls_extrainfo)))\n    ~~~~~~~~~~~~~~~~^^^^^^^^^^^^^^^^^^^^^^^^^^^^^^^^^^^^^^^^^^^^^^^^^^^^^^^^^^^^^^^^^^^^^^^^^^^^^^^^^^^^^^^^^^^^^^^^^^^^^^^^^^^^^^^^^^^^^^^^^^^^^^^^^^^^^^^^^^^^^^^^^^^^^\n  File \"/usr/lib/python3.13/unittest/case.py\", line 907, in assertEqual\n    assertion_func(first, second, msg=msg)\n    ~~~~~~~~~~~~~~^^^^^^^^^^^^^^^^^^^^^^^^\n  File \"/usr/lib/python3.13/unittest/case.py\", line 900, in _baseAssertEqual\n    raise self.failureException(msg)\nAssertionError: 7 != 0 : Missing objects in the cache:\n/srv/autobuilder/valkyrie.yocto.io/pub/sstate/18/ce/sstate:rust:cortexa57-poky-linux:1.94.1:r0:cortexa57:14:18ce6e0b97cb2056a68a7aadc03a80b3562b8ebde2377f8e62584b6bf2244ad2_package.tar.zst\n/srv/autobuilder/valkyrie.yocto.io/pub/sstate/88/54/sstate:rust:cortexa57-poky-linux:1.94.1:r0:cortexa57:14:885499c7233b5a2b6b7ce7ce89b06daef60989909c8a92ca092e90c33e5a5dff_package_write_rpm.tar.zst\n/srv/autobuilder/valkyrie.yocto.io/pub/sstate/94/0b/sstate:rust:cortexa57-poky-linux:1.94.1:r0:cortexa57:14:940baf52581148e0e2c9452f7d07d8c1cef59d95092ddeb652ebba05f2140a39_create_spdx.tar.zst\n/srv/autobuilder/valkyrie.yocto.io/pub/sstate/31/42/sstate:rust:cortexa57-poky-linux:1.94.1:r0:cortexa57:14:314267db1547e44825b564adcc99ee006dae33318409eda28f30860b8d5ac1c3_packagedata.tar.zst\n/srv/autobuilder/valkyrie.yocto.io/pub/sstate/6d/6f/sstate:rust:cortexa57-poky-linux:1.94.1:r0:cortexa57:14:6d6f80df187ab40d01eed0299e9eb722dd952dad535e56a5bd6816a9bfceb76b_create_package_spdx.tar.zst\n/srv/autobuilder/valkyrie.yocto.io/pub/sstate/57/25/sstate:rust:cortexa57-poky-linux:1.94.1:r0:cortexa57:14:572595d9822927595430942f933caa382258f95e2c280132b77d37d9389553b1_package_qa.tar.zst\n/srv/autobuilder/valkyrie.yocto.io/pub/sstate/bf/f2/sstate:rust:cortexa57-poky-linux:1.94.1:r0:cortexa57:14:bff212f0aa3169c2bcfc388dbafdce2fbefe9fb7ba42ac59f83f29b91a03b984_populate_sysroot.tar.zst\nFetcher diagnostics:\n\n\nStderr:\n2026-04-23 17:22:48,986 - oe-selftest - INFO - Adding: \"include selftest.inc\" in /srv/pokybuild/yocto-worker/a-full/build/build-st-2991849/conf/local.conf\n2026-04-23 17:22:48,986 - oe-selftest - INFO - Adding: \"include bblayers.inc\" in bblayers.conf\n",
    "oetags": [
     "yocto-mirrors"
    ],
    "status": "FAILED"
   },
   "sstatetests.SStateMirrors.test_local_cache_qemux86_64": {
    "duration": 109.15806818008423,
    "log": "testtools.testresult.real._StringException: Traceback (most recent call last):\n  File \"/srv/pokybuild/yocto-worker/a-full/build/layers/openembedded-core/meta/lib/oeqa/selftest/cases/sstatetests.py\", line 988, in test_local_cache_qemux86_64\n    self.run_test(\"qemux86-64\", \"core-image-minimal core-image-full-cmdline core-image-sato-sdk\", exceptions, check_cdn = False)\n    ~~~~~~~~~~~~~^^^^^^^^^^^^^^^^^^^^^^^^^^^^^^^^^^^^^^^^^^^^^^^^^^^^^^^^^^^^^^^^^^^^^^^^^^^^^^^^^^^^^^^^^^^^^^^^^^^^^^^^^^^^^^^\n  File \"/srv/pokybuild/yocto-worker/a-full/build/layers/openembedded-core/meta/lib/oeqa/selftest/cases/sstatetests.py\", line 974, in run_test\n    self.check_bb_output(result.output, targets, exceptions, check_cdn)\n    ~~~~~~~~~~~~~~~~~~~~^^^^^^^^^^^^^^^^^^^^^^^^^^^^^^^^^^^^^^^^^^^^^^^\n  File \"/srv/pokybuild/yocto-worker/a-full/build/layers/openembedded-core/meta/lib/oeqa/selftest/cases/sstatetests.py\", line 954, in check_bb_output\n    self.assertEqual(len(failed_urls), 0, \"Missing objects in the cache:\\n{}\\nFetcher diagnostics:\\n{}\".format(\"\\n\".join(failed_urls), \"\\n\".join(failed_urls_extrainfo)))\n    ~~~~~~~~~~~~~~~~^^^^^^^^^^^^^^^^^^^^^^^^^^^^^^^^^^^^^^^^^^^^^^^^^^^^^^^^^^^^^^^^^^^^^^^^^^^^^^^^^^^^^^^^^^^^^^^^^^^^^^^^^^^^^^^^^^^^^^^^^^^^^^^^^^^^^^^^^^^^^^^^^^^^^\n  File \"/usr/lib/python3.13/unittest/case.py\", line 907, in assertEqual\n    assertion_func(first, second, msg=msg)\n    ~~~~~~~~~~~~~~^^^^^^^^^^^^^^^^^^^^^^^^\n  File \"/usr/lib/python3.13/unittest/case.py\", line 900, in _baseAssertEqual\n    raise self.failureException(msg)\nAssertionError: 13 != 0 : Missing objects in the cache:\n/srv/autobuilder/valkyrie.yocto.io/pub/sstate/5c/1f/sstate:packagegroup-core-tools-testapps:qemux86_64-poky-linux:1.0:r0:qemux86_64:14:5c1f44abbd5f8e0572b1a17b036672ac5bc8d8d9796cf9db8d688984cdf240eb_package_write_ipk.tar.zst\n/srv/autobuilder/valkyrie.yocto.io/pub/sstate/6c/e7/sstate:mesa-demos:x86-64-v3-poky-linux:9.0.0:r0:x86-64-v3:14:6ce73c0f3e1291c3e2e06dc348948ec3bbcfa520821257bee5df81e5514f7fcf_populate_sysroot.tar.zst\n/srv/autobuilder/valkyrie.yocto.io/pub/sstate/d1/9f/sstate:mesa-demos:x86-64-v3-poky-linux:9.0.0:r0:x86-64-v3:14:d19f181e06da482b0c54cc55b9641286e67babb98bea6ba428b6c4af1ccdb503_package.tar.zst\n/srv/autobuilder/valkyrie.yocto.io/pub/sstate/f3/90/sstate:mesa-demos:x86-64-v3-poky-linux:9.0.0:r0:x86-64-v3:14:f390bdab23ffd8737aa979983d4877d64455d799f887e5f96906ec2b887efeaf_create_spdx.tar.zst\n/srv/autobuilder/valkyrie.yocto.io/pub/sstate/8a/cb/sstate:mesa-demos:x86-64-v3-poky-linux:9.0.0:r0:x86-64-v3:14:8acb3d1cec21cb25b9c6f165ed4dbdf4ca5183aa141bf9bb06e104bb3202780a_packagedata.tar.zst\n/srv/autobuilder/valkyrie.yocto.io/pub/sstate/90/44/sstate:packagegroup-core-tools-testapps:qemux86_64-poky-linux:1.0:r0:qemux86_64:14:904432a57441a72a9d2ac67cc7241beb64ffaeee5f2de7c2c4ec02b08caea076_package_write_rpm.tar.zst\n/srv/autobuilder/valkyrie.yocto.io/pub/sstate/f6/52/sstate:packagegroup-core-tools-testapps:qemux86_64-poky-linux:1.0:r0:qemux86_64:14:f65235b68d03294fd90c57a2dc79558435ce04fa626cdad982dcd10f2ae74697_create_package_spdx.tar.zst\n/srv/autobuilder/valkyrie.yocto.io/pub/sstate/0a/d8/sstate:mesa-demos:x86-64-v3-poky-linux:9.0.0:r0:x86-64-v3:14:0ad86ef95ff41863f694825dc147df111983612f1e1d69ea55846025e7f7bcab_package_qa.tar.zst\n/srv/autobuilder/valkyrie.yocto.io/pub/sstate/13/4a/sstate:mesa-demos:x86-64-v3-poky-linux:9.0.0:r0:x86-64-v3:14:134a858db887ce2877c22004fc9fa81b60536a8538dffe991d00ed370903c126_package_write_rpm.tar.zst\n/srv/autobuilder/valkyrie.yocto.io/pub/sstate/6f/cc/sstate:rust:x86-64-v3-poky-linux:1.94.1:r0:x86-64-v3:14:6fcc1216a46fc05920b570c46583c27d0eab4d2e1a9fc2ac4dc22784550ec266_create_package_spdx.tar.zst\n/srv/autobuilder/valkyrie.yocto.io/pub/sstate/5b/ab/sstate:packagegroup-core-tools-testapps:qemux86_64-poky-linux:1.0:r0:qemux86_64:14:5bab684a894bd777c40a801eb951af5ae044e19f214d1bfcbb816c2f89bf7f0d_package_write_deb.tar.zst\n/srv/autobuilder/valkyrie.yocto.io/pub/sstate/54/1e/sstate:mesa-demos:x86-64-v3-poky-linux:9.0.0:r0:x86-64-v3:14:541ef922b60a455fbeb8fd83de6373957a4e71286eae4a76311948fe4380ba1b_create_package_spdx.tar.zst\n/srv/autobuilder/valkyrie.yocto.io/pub/sstate/f5/56/sstate:packagegroup-core-tools-testapps:qemux86_64-poky-linux:1.0:r0:qemux86_64:14:f556490a8c683493fa8330f9e9da7f161d4f1ab605c6d58736ddda89060cca34_package_qa.tar.zst\nFetcher diagnostics:\n\n\nStderr:\n2026-04-23 17:22:48,986 - oe-selftest - INFO - Adding: \"include selftest.inc\" in /srv/pokybuild/yocto-worker/a-full/build/build-st-2991849/conf/local.conf\n2026-04-23 17:22:48,986 - oe-selftest - INFO - Adding: \"include bblayers.inc\" in bblayers.conf\n",
    "oetags": [
     "yocto-mirrors"
    ],
    "status": "FAILED"
   }
  }
 }
}