{
 "oeselftest_ubuntu-24.04_qemuarm64_20260619185051": {
  "configuration": {
   "HOST_DISTRO": "ubuntu-24.04",
   "HOST_NAME": "ubuntu2404-vk-arm1",
   "LAYERS": {
    "meta": {
     "branch": "master-next",
     "commit": "3599e90cb1a85090f18d71677eb8c55f986fb361",
     "commit_count": 67513,
     "commit_time": 1781778477
    },
    "meta-poky": {
     "branch": "master",
     "commit": "366fa2f21bfb0d9c4de492e0204a0dd38ce241ab",
     "commit_count": 1805,
     "commit_time": 1781777642
    },
    "meta-selftest": {
     "branch": "master-next",
     "commit": "3599e90cb1a85090f18d71677eb8c55f986fb361",
     "commit_count": 67513,
     "commit_time": 1781778477
    },
    "meta-yocto-bsp": {
     "branch": "master",
     "commit": "366fa2f21bfb0d9c4de492e0204a0dd38ce241ab",
     "commit_count": 1805,
     "commit_time": 1781777642
    }
   },
   "MACHINE": "qemuarm64",
   "OESELFTEST_METADATA": {
    "exclude_tags": [
     "yocto-mirrors",
     "machine",
     "toolchain-user",
     "toolchain-system"
    ],
    "run_all_tests": true,
    "run_tests": null,
    "select_tags": null,
    "skips": [
     "distrodata.Distrodata.test_checkpkg",
     "reproducible"
    ]
   },
   "STARTTIME": "20260619185051",
   "TEST_TYPE": "oeselftest"
  },
  "result": {
   "archiver.Archiver.test_archiver_allows_to_filter_on_recipe_name": {
    "duration": 61.075517654418945,
    "status": "PASSED"
   },
   "archiver.Archiver.test_archiver_cleanup": {
    "duration": 110.88202452659607,
    "status": "PASSED"
   },
   "archiver.Archiver.test_archiver_filters_by_type": {
    "duration": 42.6465482711792,
    "status": "PASSED"
   },
   "archiver.Archiver.test_archiver_filters_by_type_and_name": {
    "duration": 47.67557072639465,
    "status": "PASSED"
   },
   "archiver.Archiver.test_archiver_mode_configured": {
    "duration": 42.37938475608826,
    "status": "PASSED"
   },
   "archiver.Archiver.test_archiver_mode_diff": {
    "duration": 45.39448952674866,
    "status": "PASSED"
   },
   "archiver.Archiver.test_archiver_mode_dumpdata": {
    "duration": 12.296214580535889,
    "status": "PASSED"
   },
   "archiver.Archiver.test_archiver_mode_mirror": {
    "duration": 40.973742723464966,
    "status": "PASSED"
   },
   "archiver.Archiver.test_archiver_mode_mirror_combined": {
    "duration": 51.1835412979126,
    "status": "PASSED"
   },
   "archiver.Archiver.test_archiver_mode_mirror_excludes": {
    "duration": 42.92028760910034,
    "status": "PASSED"
   },
   "archiver.Archiver.test_archiver_mode_mirror_gitsm": {
    "duration": 16.451402187347412,
    "status": "PASSED"
   },
   "archiver.Archiver.test_archiver_mode_mirror_gitsm_shallow": {
    "duration": 61.5149359703064,
    "status": "PASSED"
   },
   "archiver.Archiver.test_archiver_mode_original": {
    "duration": 40.74665832519531,
    "status": "PASSED"
   },
   "archiver.Archiver.test_archiver_mode_patched": {
    "duration": 12.701369762420654,
    "status": "PASSED"
   },
   "archiver.Archiver.test_archiver_mode_recipe": {
    "duration": 43.23086714744568,
    "status": "PASSED"
   },
   "archiver.Archiver.test_archiver_multiconfig_shared_unpack_and_patch": {
    "duration": 174.29106044769287,
    "status": "PASSED"
   },
   "archiver.Archiver.test_archiver_srpm_mode": {
    "duration": 103.37100982666016,
    "status": "PASSED"
   },
   "barebox.BareboxTest.test_boot_barebox": {
    "duration": 169.88283324241638,
    "oetags": [
     "runqemu"
    ],
    "status": "PASSED"
   },
   "baremetal.BaremetalTest.test_baremetal": {
    "duration": 93.1904628276825,
    "status": "PASSED"
   },
   "bbclasses.Systemd.test_systemd_in_distro": {
    "duration": 123.19573307037354,
    "status": "PASSED"
   },
   "bbclasses.Systemd.test_sysvinit_in_distro": {
    "duration": 57.433414697647095,
    "status": "PASSED"
   },
   "bblayers.BitbakeConfigBuild.test_enable_disable_builtin_fragments": {
    "duration": 24.904621362686157,
    "status": "PASSED"
   },
   "bblayers.BitbakeConfigBuild.test_enable_disable_fragments": {
    "duration": 22.97869300842285,
    "status": "PASSED"
   },
   "bblayers.BitbakeConfigBuild.test_show_fragment": {
    "duration": 2.0534746646881104,
    "status": "PASSED"
   },
   "bblayers.BitbakeLayers.test_bitbakelayers_add_remove": {
    "duration": 10.44890308380127,
    "status": "PASSED"
   },
   "bblayers.BitbakeLayers.test_bitbakelayers_createlayer": {
    "duration": 7.559901237487793,
    "status": "PASSED"
   },
   "bblayers.BitbakeLayers.test_bitbakelayers_flatten": {
    "duration": 46.02604579925537,
    "status": "PASSED"
   },
   "bblayers.BitbakeLayers.test_bitbakelayers_layerindexshowdepends": {
    "duration": 1.527907133102417,
    "status": "PASSED"
   },
   "bblayers.BitbakeLayers.test_bitbakelayers_setup": {
    "duration": 30.963701009750366,
    "status": "PASSED"
   },
   "bblayers.BitbakeLayers.test_bitbakelayers_showappends": {
    "duration": 11.61859679222107,
    "status": "PASSED"
   },
   "bblayers.BitbakeLayers.test_bitbakelayers_showcrossdepends": {
    "duration": 29.204612016677856,
    "status": "PASSED"
   },
   "bblayers.BitbakeLayers.test_bitbakelayers_showlayers": {
    "duration": 0.7173280715942383,
    "status": "PASSED"
   },
   "bblayers.BitbakeLayers.test_bitbakelayers_showoverlayed": {
    "duration": 4.707859992980957,
    "status": "PASSED"
   },
   "bblayers.BitbakeLayers.test_bitbakelayers_showrecipes": {
    "duration": 28.78507661819458,
    "status": "PASSED"
   },
   "bblayers.BitbakeLayers.test_bitbakelayers_updatelayer": {
    "duration": 5.824594020843506,
    "status": "PASSED"
   },
   "bblayers.BitbakeLayers.test_validate_bitbake_setup_default_registry": {
    "duration": 1.9665534496307373,
    "status": "PASSED"
   },
   "bblayers.BitbakeLayers.test_validate_examplelayersjson": {
    "duration": 0.2554817199707031,
    "status": "PASSED"
   },
   "bblock.BBLock.test_lock_architecture_specific": {
    "duration": 118.49011969566345,
    "status": "PASSED"
   },
   "bblock.BBLock.test_lock_multiple_recipe_single_task": {
    "duration": 867.4189178943634,
    "status": "PASSED"
   },
   "bblock.BBLock.test_lock_single_recipe_all_tasks": {
    "duration": 361.6232080459595,
    "status": "PASSED"
   },
   "bblock.BBLock.test_lock_single_recipe_multiple_tasks": {
    "duration": 490.63821625709534,
    "status": "PASSED"
   },
   "bblock.BBLock.test_lock_single_recipe_single_task": {
    "duration": 348.23061537742615,
    "status": "PASSED"
   },
   "bblogging.BitBakeLogging.test_python_exec_func_python_loggingA": {
    "duration": 61.9967565536499,
    "status": "PASSED"
   },
   "bblogging.BitBakeLogging.test_python_exec_func_python_loggingB": {
    "duration": 49.95229625701904,
    "status": "PASSED"
   },
   "bblogging.BitBakeLogging.test_python_exec_func_python_loggingC": {
    "duration": 40.764256954193115,
    "status": "PASSED"
   },
   "bblogging.BitBakeLogging.test_python_exec_func_python_loggingD": {
    "duration": 15.496958494186401,
    "status": "PASSED"
   },
   "bblogging.BitBakeLogging.test_python_exec_func_shell_loggingA": {
    "duration": 16.878024101257324,
    "status": "PASSED"
   },
   "bblogging.BitBakeLogging.test_python_exec_func_shell_loggingB": {
    "duration": 14.162877082824707,
    "status": "PASSED"
   },
   "bblogging.BitBakeLogging.test_python_exec_func_shell_loggingC": {
    "duration": 14.075087547302246,
    "status": "PASSED"
   },
   "bblogging.BitBakeLogging.test_python_exec_func_shell_loggingD": {
    "duration": 16.32905888557434,
    "status": "PASSED"
   },
   "bblogging.BitBakeLogging.test_python_exit_loggingA": {
    "duration": 16.69767165184021,
    "status": "PASSED"
   },
   "bblogging.BitBakeLogging.test_python_exit_loggingB": {
    "duration": 14.538454055786133,
    "status": "PASSED"
   },
   "bblogging.BitBakeLogging.test_python_exit_loggingC": {
    "duration": 14.87770700454712,
    "status": "PASSED"
   },
   "bblogging.BitBakeLogging.test_python_exit_loggingD": {
    "duration": 13.892246723175049,
    "status": "PASSED"
   },
   "bblogging.BitBakeLogging.test_python_fatal_loggingA": {
    "duration": 14.908686399459839,
    "status": "PASSED"
   },
   "bblogging.BitBakeLogging.test_python_fatal_loggingB": {
    "duration": 14.718682527542114,
    "status": "PASSED"
   },
   "bblogging.BitBakeLogging.test_python_fatal_loggingC": {
    "duration": 14.622753381729126,
    "status": "PASSED"
   },
   "bblogging.BitBakeLogging.test_python_fatal_loggingD": {
    "duration": 15.638272047042847,
    "status": "PASSED"
   },
   "bblogging.BitBakeLogging.test_shell_loggingA": {
    "duration": 14.209684610366821,
    "status": "PASSED"
   },
   "bblogging.BitBakeLogging.test_shell_loggingB": {
    "duration": 14.555209875106812,
    "status": "PASSED"
   },
   "bblogging.BitBakeLogging.test_shell_loggingC": {
    "duration": 14.64351749420166,
    "status": "PASSED"
   },
   "bblogging.BitBakeLogging.test_shell_loggingD": {
    "duration": 14.403321504592896,
    "status": "PASSED"
   },
   "bbtests.BitbakeTests.test_bb_env_bb_getvar_equality": {
    "duration": 3.798462152481079,
    "status": "PASSED"
   },
   "bbtests.BitbakeTests.test_bbappend_order": {
    "duration": 58.08693814277649,
    "status": "PASSED"
   },
   "bbtests.BitbakeTests.test_bitbake_g": {
    "duration": 8.098881244659424,
    "status": "PASSED"
   },
   "bbtests.BitbakeTests.test_bitbake_invalid_recipe": {
    "duration": 1.7470316886901855,
    "status": "PASSED"
   },
   "bbtests.BitbakeTests.test_bitbake_invalid_target": {
    "duration": 8.26997709274292,
    "status": "PASSED"
   },
   "bbtests.BitbakeTests.test_checkuri": {
    "duration": 12.381466388702393,
    "status": "PASSED"
   },
   "bbtests.BitbakeTests.test_continue": {
    "duration": 57.54957914352417,
    "status": "PASSED"
   },
   "bbtests.BitbakeTests.test_dry_run": {
    "duration": 10.310787200927734,
    "status": "PASSED"
   },
   "bbtests.BitbakeTests.test_environment": {
    "duration": 4.340622663497925,
    "status": "PASSED"
   },
   "bbtests.BitbakeTests.test_event_handler": {
    "duration": 42.474186182022095,
    "status": "PASSED"
   },
   "bbtests.BitbakeTests.test_force_task_1": {
    "duration": 90.51964616775513,
    "status": "PASSED"
   },
   "bbtests.BitbakeTests.test_force_task_2": {
    "duration": 40.58893799781799,
    "status": "PASSED"
   },
   "bbtests.BitbakeTests.test_git_patchtool": {
    "duration": 26.727193117141724,
    "status": "PASSED"
   },
   "bbtests.BitbakeTests.test_git_patchtool2": {
    "duration": 28.29675030708313,
    "status": "PASSED"
   },
   "bbtests.BitbakeTests.test_git_unpack_nonetwork": {
    "duration": 49.334723472595215,
    "status": "PASSED"
   },
   "bbtests.BitbakeTests.test_git_unpack_nonetwork_fail": {
    "duration": 14.957996606826782,
    "status": "PASSED"
   },
   "bbtests.BitbakeTests.test_image_manifest": {
    "duration": 94.04300928115845,
    "status": "PASSED"
   },
   "bbtests.BitbakeTests.test_invalid_patch": {
    "duration": 53.49179935455322,
    "status": "PASSED"
   },
   "bbtests.BitbakeTests.test_invalid_recipe_src_uri": {
    "duration": 5.837517499923706,
    "status": "PASSED"
   },
   "bbtests.BitbakeTests.test_just_parse": {
    "duration": 4.582738876342773,
    "status": "PASSED"
   },
   "bbtests.BitbakeTests.test_local_sstate": {
    "duration": 26.46484637260437,
    "status": "PASSED"
   },
   "bbtests.BitbakeTests.test_non_gplv3": {
    "duration": 43.18984603881836,
    "status": "PASSED"
   },
   "bbtests.BitbakeTests.test_postfile": {
    "duration": 4.628275394439697,
    "status": "PASSED"
   },
   "bbtests.BitbakeTests.test_prefile": {
    "duration": 7.038136959075928,
    "status": "PASSED"
   },
   "bbtests.BitbakeTests.test_rename_downloaded_file": {
    "duration": 42.062660455703735,
    "status": "PASSED"
   },
   "bbtests.BitbakeTests.test_run_bitbake_from_dir_1": {
    "duration": 3.144526958465576,
    "status": "PASSED"
   },
   "bbtests.BitbakeTests.test_run_bitbake_from_dir_2": {
    "duration": 3.7107865810394287,
    "status": "PASSED"
   },
   "bbtests.BitbakeTests.test_run_bitbake_from_dir_3": {
    "duration": 3.5448033809661865,
    "status": "PASSED"
   },
   "bbtests.BitbakeTests.test_setscene_only": {
    "duration": 30.733271598815918,
    "status": "PASSED"
   },
   "bbtests.BitbakeTests.test_skip_setscene": {
    "duration": 58.88323926925659,
    "status": "PASSED"
   },
   "bbtests.BitbakeTests.test_unexpanded_variable_in_path": {
    "duration": 43.18298053741455,
    "status": "PASSED"
   },
   "bbtests.BitbakeTests.test_version": {
    "duration": 6.128016710281372,
    "status": "PASSED"
   },
   "bbtests.BitbakeTests.test_warnings_errors": {
    "duration": 1.101367473602295,
    "status": "PASSED"
   },
   "buildhistory.BuildhistoryTests.test_buildhistory_basic": {
    "duration": 86.74446320533752,
    "status": "PASSED"
   },
   "buildhistory.BuildhistoryTests.test_buildhistory_buildtime_pr_backwards": {
    "duration": 95.74222302436829,
    "status": "PASSED"
   },
   "buildhistory.BuildhistoryTests.test_buildhistory_diff": {
    "duration": 94.39291429519653,
    "status": "PASSED"
   },
   "buildhistory.BuildhistoryTests.test_fileinfo": {
    "duration": 20.88484477996826,
    "status": "PASSED"
   },
   "buildoptions.ArchiverTest.test_arch_work_dir_and_export_source": {
    "duration": 69.78006744384766,
    "status": "PASSED"
   },
   "buildoptions.DiskMonTest.test_stoptask_behavior": {
    "duration": 147.4584982395172,
    "status": "PASSED"
   },
   "buildoptions.ImageOptionsTests.test_ccache_tool": {
    "duration": 160.34207940101624,
    "status": "PASSED"
   },
   "buildoptions.ImageOptionsTests.test_incremental_image_generation": {
    "duration": 242.476092338562,
    "status": "PASSED"
   },
   "buildoptions.ImageOptionsTests.test_read_only_image": {
    "duration": 283.28596568107605,
    "status": "PASSED"
   },
   "buildoptions.Poisoning.test_poisoning": {
    "duration": 60.17398118972778,
    "status": "PASSED"
   },
   "buildoptions.SanityOptionsTest.test_layer_without_git_dir": {
    "duration": 40.37050223350525,
    "status": "PASSED"
   },
   "buildoptions.SanityOptionsTest.test_options_warnqa_errorqa_switch": {
    "duration": 117.78104519844055,
    "status": "PASSED"
   },
   "buildoptions.ToolchainOptions.test_toolchain_fortran": {
    "duration": 62.38326549530029,
    "status": "PASSED"
   },
   "c_cpp.CMakeTests.test_cmake_qemu": {
    "duration": 55.63058114051819,
    "status": "PASSED"
   },
   "c_cpp.CMakeTests.test_cmake_qemu_failing": {
    "duration": 57.21147871017456,
    "status": "PASSED"
   },
   "c_cpp.MesonTests.test_meson_qemu": {
    "duration": 65.73127055168152,
    "status": "PASSED"
   },
   "c_cpp.MesonTests.test_meson_qemu_failing": {
    "duration": 66.4006519317627,
    "status": "PASSED"
   },
   "containerimage.ContainerImageTests.test_expected_files": {
    "duration": 81.06800103187561,
    "status": "PASSED"
   },
   "cve_check.CVECheck.test_convert_cve_version": {
    "duration": 0.011004447937011719,
    "status": "PASSED"
   },
   "cve_check.CVECheck.test_parse_cve_from_patch_contents": {
    "duration": 0.0057353973388671875,
    "status": "PASSED"
   },
   "cve_check.CVECheck.test_parse_cve_from_patch_filename": {
    "duration": 0.005251407623291016,
    "status": "PASSED"
   },
   "cve_check.CVECheck.test_product_match": {
    "duration": 0.00502777099609375,
    "status": "PASSED"
   },
   "cve_check.CVECheck.test_version_compare": {
    "duration": 0.006464481353759766,
    "status": "PASSED"
   },
   "debuginfod.Debuginfod.test_debuginfod_native": {
    "duration": 70.6545000076294,
    "status": "PASSED"
   },
   "debuginfod.Debuginfod.test_debuginfod_qemu": {
    "duration": 153.1981918811798,
    "oetags": [
     "runqemu"
    ],
    "status": "PASSED"
   },
   "devtool.DevtoolAddTests.test_devtool_add": {
    "duration": 103.80298066139221,
    "status": "PASSED"
   },
   "devtool.DevtoolAddTests.test_devtool_add_binary": {
    "duration": 85.27173662185669,
    "status": "PASSED"
   },
   "devtool.DevtoolAddTests.test_devtool_add_fetch": {
    "duration": 81.80225801467896,
    "status": "PASSED"
   },
   "devtool.DevtoolAddTests.test_devtool_add_fetch_git": {
    "duration": 91.72264432907104,
    "status": "PASSED"
   },
   "devtool.DevtoolAddTests.test_devtool_add_fetch_simple": {
    "duration": 56.44081115722656,
    "status": "PASSED"
   },
   "devtool.DevtoolAddTests.test_devtool_add_git_local": {
    "duration": 58.164360761642456,
    "status": "PASSED"
   },
   "devtool.DevtoolAddTests.test_devtool_add_git_style1": {
    "duration": 55.419105768203735,
    "status": "PASSED"
   },
   "devtool.DevtoolAddTests.test_devtool_add_git_style2": {
    "duration": 56.19353985786438,
    "status": "PASSED"
   },
   "devtool.DevtoolAddTests.test_devtool_add_library": {
    "duration": 74.97600078582764,
    "status": "PASSED"
   },
   "devtool.DevtoolAddTests.test_devtool_add_npm": {
    "duration": 1.0172078609466553,
    "log": "Test needs meta-oe for nodejs\n",
    "status": "SKIPPED"
   },
   "devtool.DevtoolAddTests.test_devtool_add_python_egg_requires": {
    "duration": 48.99480605125427,
    "status": "PASSED"
   },
   "devtool.DevtoolBuildImageTests.test_devtool_build_image": {
    "duration": 336.6487159729004,
    "status": "PASSED"
   },
   "devtool.DevtoolDeployTargetTests.test_devtool_deploy_target": {
    "duration": 320.7490108013153,
    "oetags": [
     "runqemu"
    ],
    "status": "PASSED"
   },
   "devtool.DevtoolExtractTests.test_devtool_extract": {
    "duration": 79.35396575927734,
    "status": "PASSED"
   },
   "devtool.DevtoolExtractTests.test_devtool_extract_virtual": {
    "duration": 47.260239601135254,
    "status": "PASSED"
   },
   "devtool.DevtoolIdeSdkTests.test_devtool_ide_sdk_code_cmake": {
    "duration": 450.2297041416168,
    "oetags": [
     "runqemu"
    ],
    "status": "PASSED"
   },
   "devtool.DevtoolIdeSdkTests.test_devtool_ide_sdk_code_kernel_module": {
    "duration": 715.9051654338837,
    "oetags": [
     "runqemu"
    ],
    "status": "PASSED"
   },
   "devtool.DevtoolIdeSdkTests.test_devtool_ide_sdk_code_meson": {
    "duration": 266.23886275291443,
    "status": "PASSED"
   },
   "devtool.DevtoolIdeSdkTests.test_devtool_ide_sdk_none_qemu": {
    "duration": 641.6287248134613,
    "oetags": [
     "runqemu"
    ],
    "status": "PASSED"
   },
   "devtool.DevtoolIdeSdkTests.test_devtool_ide_sdk_plugins": {
    "duration": 78.57164931297302,
    "status": "PASSED"
   },
   "devtool.DevtoolIdeSdkTests.test_devtool_ide_sdk_shared_sysroots": {
    "duration": 105.8275203704834,
    "status": "PASSED"
   },
   "devtool.DevtoolModifyTests.test_devtool_buildclean": {
    "duration": 365.01888370513916,
    "status": "PASSED"
   },
   "devtool.DevtoolModifyTests.test_devtool_modify": {
    "duration": 169.0112659931183,
    "status": "PASSED"
   },
   "devtool.DevtoolModifyTests.test_devtool_modify_git": {
    "duration": 107.21996259689331,
    "status": "PASSED"
   },
   "devtool.DevtoolModifyTests.test_devtool_modify_git_crates_subpath": {
    "duration": 120.01285696029663,
    "status": "PASSED"
   },
   "devtool.DevtoolModifyTests.test_devtool_modify_git_no_extract": {
    "duration": 35.86402344703674,
    "status": "PASSED"
   },
   "devtool.DevtoolModifyTests.test_devtool_modify_go": {
    "duration": 61.75568699836731,
    "status": "PASSED"
   },
   "devtool.DevtoolModifyTests.test_devtool_modify_invalid": {
    "duration": 161.82873630523682,
    "status": "PASSED"
   },
   "devtool.DevtoolModifyTests.test_devtool_modify_localfiles": {
    "duration": 109.76431965827942,
    "status": "PASSED"
   },
   "devtool.DevtoolModifyTests.test_devtool_modify_localfiles_only": {
    "duration": 88.9095823764801,
    "status": "PASSED"
   },
   "devtool.DevtoolModifyTests.test_devtool_modify_multiple_sources": {
    "duration": 96.70998954772949,
    "log": "testtools.testresult.real._StringException: Traceback (most recent call last):\n  File \"/srv/pokybuild/yocto-worker/oe-selftest-armhost/build/layers/openembedded-core/meta/lib/oeqa/selftest/cases/devtool.py\", line 1157, in test_devtool_modify_multiple_sources\n    result = bitbake(testrecipe)\n             ^^^^^^^^^^^^^^^^^^^\n  File \"/srv/pokybuild/yocto-worker/oe-selftest-armhost/build/layers/openembedded-core/meta/lib/oeqa/utils/commands.py\", line 236, in bitbake\n    return runCmd(cmd, ignore_status, timeout, output_log=output_log, **options)\n           ^^^^^^^^^^^^^^^^^^^^^^^^^^^^^^^^^^^^^^^^^^^^^^^^^^^^^^^^^^^^^^^^^^^^^\n  File \"/srv/pokybuild/yocto-worker/oe-selftest-armhost/build/layers/openembedded-core/meta/lib/oeqa/utils/commands.py\", line 214, in runCmd\n    raise AssertionError(\"Command '%s' returned non-zero exit status %d:\\n%s\" % (command, result.status, exc_output))\nAssertionError: Command 'bitbake  bzip2' returned non-zero exit status 1:\nNOTE: Reconnecting to bitbake server...\nLoading cache...done.\nLoaded 2075 entries from dependency cache.\nParsing recipes...done.\nParsing of 1031 .bb files complete (1030 cached, 1 parsed). 2075 targets, 63 skipped, 0 masked, 0 errors.\nNOTE: Resolving any missing task queue dependencies\n\nBuild Configuration:\nBB_VERSION           = \"2.19.0\"\nBUILD_SYS            = \"aarch64-linux\"\nNATIVELSBSTRING      = \"universal\"\nTARGET_SYS           = \"aarch64-poky-linux\"\nMACHINE              = \"qemuarm64\"\nSDKMACHINE           = \"aarch64\"\nDISTRO               = \"poky\"\nDISTRO_VERSION       = \"6.0.99+snapshot-3599e90cb1a85090f18d71677eb8c55f986fb361\"\nTUNE_FEATURES        = \"aarch64 crc cortexa57\"\nmeta                 = \"master-next:3599e90cb1a85090f18d71677eb8c55f986fb361\"\nmeta-yocto-bsp       \nmeta-poky            = \"master:366fa2f21bfb0d9c4de492e0204a0dd38ce241ab\"\nmeta-selftest        = \"master:0e7ec0de61d3eec85eadb866b46d9cf65bde2de9\"\nworkspace            = \"<unknown>:<unknown>\"\n\nInitialising tasks...done.\nChecking sstate mirror object availability...done.\nSstate summary: Wanted 318 Local 1 Mirrors 270 Missed 47 Current 202 (85% match, 90% complete)\nRemoving 26 stale sstate objects for arch aarch64...done.\nRemoving 3 stale sstate objects for arch cortexa57...done.\nRemoving 1 stale sstate objects for arch qemuarm64...done.\nNOTE: Executing Tasks\nNOTE: Running setscene task 227 of 520 (/tmp/devtoolqah725p3d8/core-copy/meta/recipes-devtools/make/make_4.4.1.bb:do_package_qa_setscene)\nNOTE: Running setscene task 268 of 520 (/tmp/devtoolqah725p3d8/core-copy/meta/recipes-extended/bash/bash_5.3.bb:do_package_setscene)\nNOTE: recipe make-4.4.1-r0: task do_package_qa_setscene: Started\nNOTE: recipe make-4.4.1-r0: task do_package_qa_setscene: Succeeded\nNOTE: Running setscene task 299 of 520 (/tmp/devtoolqah725p3d8/core-copy/meta/recipes-devtools/make/make_4.4.1.bb:do_package_write_rpm_setscene)\nNOTE: Running setscene task 310 of 520 (virtual:native:/tmp/devtoolqah725p3d8/core-copy/meta/recipes-devtools/opkg-utils/opkg-utils_0.7.0.bb:do_deploy_source_date_epoch_setscene)\nNOTE: Running setscene task 334 of 520 (/tmp/devtoolqah725p3d8/core-copy/meta/recipes-devtools/make/make_4.4.1.bb:do_create_spdx_setscene)\nNOTE: Running setscene task 339 of 520 (/tmp/devtoolqah725p3d8/core-copy/meta/recipes-core/base-files/base-files_3.0.14.bb:do_packagedata_setscene)\nNOTE: Running setscene task 350 of 520 (/tmp/devtoolqah725p3d8/core-copy/meta/recipes-support/gdbm/gdbm_1.26.bb:do_populate_sysroot_setscene)\nNOTE: Running setscene task 358 of 520 (/tmp/devtoolqah725p3d8/core-copy/meta/recipes-devtools/perl/perl_5.42.2.bb:do_deploy_source_date_epoch_setscene)\nNOTE: Running setscene task 387 of 520 (/tmp/devtoolqah725p3d8/core-copy/meta/recipes-devtools/opkg-utils/opkg-utils_0.7.0.bb:do_package_setscene)\nNOTE: Running setscene task 404 of 520 (virtual:native:/tmp/devtoolqah725p3d8/core-copy/meta/recipes-devtools/make/make_4.4.1.bb:do_create_spdx_setscene)\nNOTE: Running setscene task 405 of 520 (virtual:native:/tmp/devtoolqah725p3d8/core-copy/meta/recipes-devtools/perl-cross/perlcross_1.6.4.bb:do_create_spdx_setscene)\nNOTE: Running setscene task 407 of 520 (virtual:native:/tmp/devtoolqah725p3d8/core-copy/meta/recipes-devtools/perl/perl_5.42.2.bb:do_create_recipe_spdx_setscene)\nNOTE: Running setscene task 409 of 520 (virtual:native:/tmp/devtoolqah725p3d8/core-copy/meta/recipes-support/gdbm/gdbm_1.26.bb:do_create_spdx_setscene)\nNOTE: Running setscene task 414 of 520 (virtual:native:/tmp/devtoolqah725p3d8/core-copy/meta/recipes-core/zlib/zlib_1.3.2.bb:do_create_spdx_setscene)\nNOTE: recipe make-4.4.1-r0: task do_package_write_rpm_setscene: Started\nNOTE: recipe base-files-3.0.14-r0: task do_packagedata_setscene: Started\nNOTE: recipe make-4.4.1-r0: task do_create_spdx_setscene: Started\nNOTE: recipe perl-5.42.2-r0: task do_deploy_source_date_epoch_setscene: Started\nNOTE: recipe gdbm-1.26-r0: task do_populate_sysroot_setscene: Started\nNOTE: recipe opkg-utils-0.7.0-r0: task do_package_setscene: Started\nNOTE: recipe opkg-utils-native-0.7.0-r0: task do_deploy_source_date_epoch_setscene: Started\nNOTE: recipe bash-5.3-r0: task do_package_setscene: Started\nNOTE: recipe perlcross-native-1.6.4-r0: task do_create_spdx_setscene: Started\nNOTE: recipe make-native-4.4.1-r0: task do_create_spdx_setscene: Started\nNOTE: recipe zlib-native-1.3.2-r0: task do_create_spdx_setscene: Started\nNOTE: Running task 297 of 1370 (/tmp/devtoolqah725p3d8/core-copy/meta/recipes-extended/bzip2/bzip2_1.0.8.bb:do_recipe_qa)\nNOTE: recipe perl-native-5.42.2-r0: task do_create_recipe_spdx_setscene: Started\nNOTE: recipe gdbm-native-1.26-r0: task do_create_spdx_setscene: Started\nNOTE: recipe opkg-utils-native-0.7.0-r0: task do_deploy_source_date_epoch_setscene: Succeeded\nNOTE: recipe base-files-3.0.14-r0: task do_packagedata_setscene: Succeeded\nNOTE: recipe make-4.4.1-r0: task do_package_write_rpm_setscene: Succeeded\nNOTE: recipe perl-5.42.2-r0: task do_deploy_source_date_epoch_setscene: Succeeded\nNOTE: recipe perlcross-native-1.6.4-r0: task do_create_spdx_setscene: Succeeded\nNOTE: recipe make-4.4.1-r0: task do_create_spdx_setscene: Succeeded\nNOTE: Running setscene task 423 of 520 (/tmp/devtoolqah725p3d8/core-copy/meta/recipes-devtools/perl/perl_5.42.2.bb:do_recipe_qa_setscene)\nNOTE: Running setscene task 428 of 520 (/tmp/devtoolqah725p3d8/core-copy/meta/recipes-devtools/make/make_4.4.1.bb:do_recipe_qa_setscene)\nNOTE: recipe gdbm-1.26-r0: task do_populate_sysroot_setscene: Succeeded\nNOTE: recipe make-native-4.4.1-r0: task do_create_spdx_setscene: Succeeded\nNOTE: Running setscene task 430 of 520 (/tmp/devtoolqah725p3d8/core-copy/meta/recipes-support/gdbm/gdbm_1.26.bb:do_recipe_qa_setscene)\nNOTE: recipe zlib-native-1.3.2-r0: task do_create_spdx_setscene: Succeeded\nNOTE: recipe gdbm-native-1.26-r0: task do_create_spdx_setscene: Succeeded\nNOTE: recipe perl-native-5.42.2-r0: task do_create_recipe_spdx_setscene: Succeeded\nNOTE: recipe opkg-utils-0.7.0-r0: task do_package_setscene: Succeeded\nNOTE: Running setscene task 439 of 520 (virtual:native:/tmp/devtoolqah725p3d8/core-copy/meta/recipes-extended/bzip2/bzip2_1.0.8.bb:do_create_recipe_spdx_setscene)\nNOTE: Running setscene task 445 of 520 (/tmp/devtoolqah725p3d8/core-copy/meta/recipes-devtools/opkg-utils/opkg-utils_0.7.0.bb:do_deploy_source_date_epoch_setscene)\nNOTE: recipe bzip2-1.0.8-r0: task do_recipe_qa: Started\nNOTE: recipe make-4.4.1-r0: task do_recipe_qa_setscene: Started\nNOTE: recipe perl-5.42.2-r0: task do_recipe_qa_setscene: Started\nNOTE: recipe bzip2-1.0.8-r0: task do_recipe_qa: Succeeded\nNOTE: recipe gdbm-1.26-r0: task do_recipe_qa_setscene: Started\nNOTE: recipe opkg-utils-0.7.0-r0: task do_deploy_source_date_epoch_setscene: Started\nNOTE: recipe make-4.4.1-r0: task do_recipe_qa_setscene: Succeeded\nNOTE: recipe perl-5.42.2-r0: task do_recipe_qa_setscene: Succeeded\nNOTE: recipe gdbm-1.26-r0: task do_recipe_qa_setscene: Succeeded\nNOTE: recipe bzip2-native-1.0.8-r0: task do_create_recipe_spdx_setscene: Started\nNOTE: recipe opkg-utils-0.7.0-r0: task do_deploy_source_date_epoch_setscene: Succeeded\nNOTE: Running task 564 of 1370 (/tmp/devtoolqah725p3d8/core-copy/meta/recipes-extended/bzip2/bzip2_1.0.8.bb:do_fetch)\nNOTE: recipe bzip2-native-1.0.8-r0: task do_create_recipe_spdx_setscene: Succeeded\nNOTE: recipe bzip2-1.0.8-r0: task do_fetch: Started\nNOTE: recipe bzip2-1.0.8-r0: task do_fetch: Succeeded\nNOTE: Running task 565 of 1370 (/tmp/devtoolqah725p3d8/core-copy/meta/recipes-devtools/opkg-utils/opkg-utils_0.7.0.bb:do_fetch)\nNOTE: recipe opkg-utils-0.7.0-r0: task do_fetch: Started\nNOTE: recipe bash-5.3-r0: task do_package_setscene: Succeeded\nNOTE: Running setscene task 446 of 520 (/tmp/devtoolqah725p3d8/core-copy/meta/recipes-extended/bash/bash_5.3.bb:do_deploy_source_date_epoch_setscene)\nNOTE: Running setscene task 449 of 520 (virtual:native:/tmp/devtoolqah725p3d8/core-copy/meta/recipes-devtools/rpm/rpm_4.20.1.bb:do_deploy_source_date_epoch_setscene)\nNOTE: Running setscene task 451 of 520 (virtual:native:/tmp/devtoolqah725p3d8/core-copy/meta/recipes-devtools/dwarfsrcfiles/dwarfsrcfiles.bb:do_deploy_source_date_epoch_setscene)\nNOTE: Running setscene task 453 of 520 (virtual:native:/tmp/devtoolqah725p3d8/core-copy/meta/recipes-devtools/elfutils/elfutils_0.194.bb:do_deploy_source_date_epoch_setscene)\nNOTE: Running setscene task 454 of 520 (virtual:native:/tmp/devtoolqah725p3d8/core-copy/meta/recipes-devtools/file/file_5.48.bb:do_deploy_source_date_epoch_setscene)\nNOTE: Running setscene task 456 of 520 (virtual:native:/tmp/devtoolqah725p3d8/core-copy/meta/recipes-devtools/json-c/json-c_0.18.bb:do_deploy_source_date_epoch_setscene)\nNOTE: Running setscene task 462 of 520 (virtual:native:/tmp/devtoolqah725p3d8/core-copy/meta/recipes-support/libmicrohttpd/libmicrohttpd_1.0.5.bb:do_deploy_source_date_epoch_setscene)\nNOTE: Running setscene task 464 of 520 (virtual:native:/tmp/devtoolqah725p3d8/core-copy/meta/recipes-devtools/e2fsprogs/e2fsprogs_1.47.4.bb:do_deploy_source_date_epoch_setscene)\nNOTE: Running setscene task 465 of 520 (virtual:native:/tmp/devtoolqah725p3d8/core-copy/meta/recipes-support/p11-kit/p11-kit_0.26.2.bb:do_deploy_source_date_epoch_setscene)\nNOTE: Running setscene task 467 of 520 (virtual:native:/tmp/devtoolqah725p3d8/core-copy/meta/recipes-extended/libarchive/libarchive_3.8.7.bb:do_deploy_source_date_epoch_setscene)\nNOTE: Running setscene task 468 of 520 (virtual:native:/tmp/devtoolqah725p3d8/core-copy/meta/recipes-support/curl/curl_8.20.0.bb:do_deploy_source_date_epoch_setscene)\nNOTE: Running setscene task 469 of 520 (virtual:native:/tmp/devtoolqah725p3d8/core-copy/meta/recipes-support/gnutls/libtasn1_4.21.0.bb:do_deploy_source_date_epoch_setscene)\nNOTE: Running setscene task 472 of 520 (virtual:native:/tmp/devtoolqah725p3d8/core-copy/meta/recipes-devtools/meson/meson_1.11.1.bb:do_deploy_source_date_epoch_setscene)\nNOTE: Running setscene task 473 of 520 (virtual:native:/tmp/devtoolqah725p3d8/core-copy/meta/recipes-support/gnutls/gnutls_3.8.13.bb:do_deploy_source_date_epoch_setscene)\nNOTE: Running setscene task 475 of 520 (virtual:native:/tmp/devtoolqah725p3d8/core-copy/meta/recipes-support/libcap-ng/libcap-ng_0.9.3.bb:do_populate_sysroot_setscene)\nWARNING: opkg-utils-0.7.0-r0 do_fetch: Unable to get top level for /srv/autobuilder/valkyrie.yocto.io/current_sources/git2/git.yoctoproject.org.opkg-utils (not a git directory?): Fetcher failure: Fetch command ['git', '-c', 'gc.autoDetach=false', '-c', 'core.pager=cat', '-c', 'safe.bareRepository=all', '-c', 'clone.defaultRemoteName=origin', 'rev-parse', '--absolute-git-dir'] failed with exit code 128, output:\nfatal: not a git repository (or any parent up to mount point /srv)\nStopping at filesystem boundary (GIT_DISCOVERY_ACROSS_FILESYSTEM not set).\n\nERROR: opkg-utils-0.7.0-r0 do_fetch: Error executing a python function in exec_func_python() autogenerated:\n\nThe stack trace of python calls that resulted in this exception/failure was:\nFile: 'exec_func_python() autogenerated', lineno: 2, function: <module>\n     0001:\n *** 0002:base_do_fetch(d)\n     0003:\nFile: '/tmp/devtoolqah725p3d8/core-copy/meta/classes-global/base.bbclass', lineno: 190, function: base_do_fetch\n     0186:        return\n     0187:\n     0188:    try:\n     0189:        fetcher = bb.fetch2.Fetch(src_uri, d)\n *** 0190:        fetcher.download()\n     0191:    except bb.fetch2.BBFetchException as e:\n     0192:        bb.fatal(\"Bitbake Fetcher Error: \" + repr(e))\n     0193:}\n     0194:\nFile: '/srv/pokybuild/yocto-worker/oe-selftest-armhost/build/layers/bitbake/lib/bb/fetch2/__init__.py', lineno: 1951, function: download\n     1947:                    try:\n     1948:                        if not trusted_network(d, ud.url):\n     1949:                            raise UntrustedUrl(ud.url)\n     1950:                        logger.debug(\"Trying Upstream\")\n *** 1951:                        m.download(ud, d)\n     1952:                        if hasattr(m, \"build_mirror_data\"):\n     1953:                            m.build_mirror_data(ud, d)\n     1954:                        done = True\n     1955:                        # early checksum verify, so that if checksum mismatched,\nFile: '/srv/pokybuild/yocto-worker/oe-selftest-armhost/build/layers/bitbake/lib/bb/fetch2/git.py', lineno: 426, function: download\n     0422:                logger.warning(\"%s\", e)\n     0423:                needs_clone = True\n     0424:\n     0425:            if needs_clone:\n *** 0426:                shutil.rmtree(ud.clonedir)\n     0427:        else:\n     0428:            needs_clone = True\n     0429:\n     0430:        # If the repo still doesn't exist, fallback to cloning it\nFile: '/usr/lib/python3.12/shutil.py', lineno: 802, function: rmtree\n     0798:                try:\n     0799:                    # symlinks to directories are forbidden, see bug #1669\n     0800:                    raise OSError(\"Cannot call rmtree on a symbolic link\")\n     0801:                except OSError as err:\n *** 0802:                    onexc(os.path.islink, path, err)\n     0803:        finally:\n     0804:            if not fd_closed:\n     0805:                try:\n     0806:                    os.close(fd)\nFile: '/usr/lib/python3.12/shutil.py', lineno: 800, function: rmtree\n     0796:                    onexc(os.rmdir, path, err)\n     0797:            else:\n     0798:                try:\n     0799:                    # symlinks to directories are forbidden, see bug #1669\n *** 0800:                    raise OSError(\"Cannot call rmtree on a symbolic link\")\n     0801:                except OSError as err:\n     0802:                    onexc(os.path.islink, path, err)\n     0803:        finally:\n     0804:            if not fd_closed:\nException: OSError: Cannot call rmtree on a symbolic link\n\nNOTE: recipe bash-5.3-r0: task do_deploy_source_date_epoch_setscene: Started\nNOTE: recipe dwarfsrcfiles-native-1.0-r0: task do_deploy_source_date_epoch_setscene: Started\nNOTE: recipe file-native-5.48-r0: task do_deploy_source_date_epoch_setscene: Started\nNOTE: recipe rpm-native-1_4.20.1-r0: task do_deploy_source_date_epoch_setscene: Started\nNOTE: recipe libmicrohttpd-native-1.0.5-r0: task do_deploy_source_date_epoch_setscene: Started\nNOTE: recipe elfutils-native-0.194-r0: task do_deploy_source_date_epoch_setscene: Started\nNOTE: recipe json-c-native-0.18-r0: task do_deploy_source_date_epoch_setscene: Started\nNOTE: recipe e2fsprogs-native-1.47.4-r0: task do_deploy_source_date_epoch_setscene: Started\nNOTE: recipe meson-native-1.11.1-r0: task do_deploy_source_date_epoch_setscene: Started\nNOTE: recipe libarchive-native-3.8.7-r0: task do_deploy_source_date_epoch_setscene: Started\nNOTE: recipe p11-kit-native-0.26.2-r0: task do_deploy_source_date_epoch_setscene: Started\nNOTE: recipe libtasn1-native-4.21.0-r0: task do_deploy_source_date_epoch_setscene: Started\nNOTE: recipe libcap-ng-native-0.9.3-r0: task do_populate_sysroot_setscene: Started\nNOTE: recipe curl-native-8.20.0-r0: task do_deploy_source_date_epoch_setscene: Started\nNOTE: recipe gnutls-native-3.8.13-r0: task do_deploy_source_date_epoch_setscene: Started\nNOTE: recipe dwarfsrcfiles-native-1.0-r0: task do_deploy_source_date_epoch_setscene: Succeeded\nNOTE: Running setscene task 476 of 520 (virtual:native:/tmp/devtoolqah725p3d8/core-copy/meta/recipes-devtools/bison/bison_3.8.2.bb:do_populate_sysroot_setscene)\nNOTE: recipe bash-5.3-r0: task do_deploy_source_date_epoch_setscene: Succeeded\nNOTE: Running setscene task 478 of 520 (virtual:native:/tmp/devtoolqah725p3d8/core-copy/meta/recipes-extended/libidn/libidn2_2.3.8.bb:do_deploy_source_date_epoch_setscene)\nNOTE: recipe libmicrohttpd-native-1.0.5-r0: task do_deploy_source_date_epoch_setscene: Succeeded\nNOTE: recipe file-native-5.48-r0: task do_deploy_source_date_epoch_setscene: Succeeded\nNOTE: recipe rpm-native-1_4.20.1-r0: task do_deploy_source_date_epoch_setscene: Succeeded\nNOTE: recipe elfutils-native-0.194-r0: task do_deploy_source_date_epoch_setscene: Succeeded\nNOTE: Running setscene task 480 of 520 (virtual:native:/tmp/devtoolqah725p3d8/core-copy/meta/recipes-core/util-linux/util-linux_2.41.3.bb:do_deploy_source_date_epoch_setscene)\nNOTE: Running setscene task 481 of 520 (virtual:native:/tmp/devtoolqah725p3d8/core-copy/meta/recipes-gnome/gtk-doc/gtk-doc_1.35.1.bb:do_populate_sysroot_setscene)\nNOTE: Running setscene task 482 of 520 (virtual:native:/tmp/devtoolqah725p3d8/core-copy/meta/recipes-devtools/python/python3-setuptools_82.0.1.bb:do_deploy_source_date_epoch_setscene)\nNOTE: Running setscene task 483 of 520 (virtual:native:/tmp/devtoolqah725p3d8/core-copy/meta/recipes-devtools/python/python3-wheel_0.47.0.bb:do_deploy_source_date_epoch_setscene)\nNOTE: recipe json-c-native-0.18-r0: task do_deploy_source_date_epoch_setscene: Succeeded\nNOTE: recipe meson-native-1.11.1-r0: task do_deploy_source_date_epoch_setscene: Succeeded\nNOTE: recipe e2fsprogs-native-1.47.4-r0: task do_deploy_source_date_epoch_setscene: Succeeded\nNOTE: recipe libarchive-native-3.8.7-r0: task do_deploy_source_date_epoch_setscene: Succeeded\nNOTE: recipe libtasn1-native-4.21.0-r0: task do_deploy_source_date_epoch_setscene: Succeeded\nNOTE: Running setscene task 487 of 520 (virtual:native:/tmp/devtoolqah725p3d8/core-copy/meta/recipes-devtools/python/python3-packaging_26.2.bb:do_deploy_source_date_epoch_setscene)\nNOTE: recipe p11-kit-native-0.26.2-r0: task do_deploy_source_date_epoch_setscene: Succeeded\nNOTE: recipe curl-native-8.20.0-r0: task do_deploy_source_date_epoch_setscene: Succeeded\nNOTE: Running setscene task 488 of 520 (virtual:native:/tmp/devtoolqah725p3d8/core-copy/meta/recipes-devtools/python/python3-pyproject-hooks_1.2.0.bb:do_deploy_source_date_epoch_setscene)\nNOTE: Running setscene task 489 of 520 (virtual:native:/tmp/devtoolqah725p3d8/core-copy/meta/recipes-devtools/python/python3-build_1.5.0.bb:do_deploy_source_date_epoch_setscene)\nNOTE: Running setscene task 490 of 520 (virtual:native:/tmp/devtoolqah725p3d8/core-copy/meta/recipes-devtools/e2fsprogs/e2fsprogs_1.47.4.bb:do_recipe_qa_setscene)\nNOTE: Running setscene task 492 of 520 (virtual:native:/tmp/devtoolqah725p3d8/core-copy/meta/recipes-devtools/python/python3-installer_1.0.1.bb:do_deploy_source_date_epoch_setscene)\nNOTE: Running setscene task 495 of 520 (virtual:native:/tmp/devtoolqah725p3d8/core-copy/meta/recipes-devtools/autoconf-archive/autoconf-archive_2024.10.16.bb:do_populate_sysroot_setscene)\nNOTE: Running setscene task 497 of 520 (virtual:native:/tmp/devtoolqah725p3d8/core-copy/meta/recipes-devtools/python/python3-flit-core_3.12.0.bb:do_deploy_source_date_epoch_setscene)\nNOTE: recipe gnutls-native-3.8.13-r0: task do_deploy_source_date_epoch_setscene: Succeeded\nNOTE: Running setscene task 498 of 520 (virtual:native:/tmp/devtoolqah725p3d8/core-copy/meta/recipes-devtools/python/python3_3.14.6.bb:do_deploy_source_date_epoch_setscene)\nNOTE: recipe libcap-ng-native-0.9.3-r0: task do_populate_sysroot_setscene: Succeeded\nNOTE: Running setscene task 499 of 520 (virtual:native:/tmp/devtoolqah725p3d8/core-copy/meta/recipes-core/expat/expat_2.8.1.bb:do_deploy_source_date_epoch_setscene)\nNOTE: recipe bison-native-3.8.2-r0: task do_populate_sysroot_setscene: Started\nNOTE: recipe libidn2-native-2.3.8-r0: task do_deploy_source_date_epoch_setscene: Started\nNOTE: recipe python3-setuptools-native-82.0.1-r0: task do_deploy_source_date_epoch_setscene: Started\nNOTE: recipe gtk-doc-native-1.35.1-r0: task do_populate_sysroot_setscene: Started\nNOTE: recipe python3-wheel-native-0.47.0-r0: task do_deploy_source_date_epoch_setscene: Started\nNOTE: recipe python3-pyproject-hooks-native-1.2.0-r0: task do_deploy_source_date_epoch_setscene: Started\nNOTE: recipe python3-packaging-native-26.2-r0: task do_deploy_source_date_epoch_setscene: Started\nNOTE: recipe autoconf-archive-native-2024.10.16-r0: task do_populate_sysroot_setscene: Started\nNOTE: recipe python3-build-native-1.5.0-r0: task do_deploy_source_date_epoch_setscene: Started\nNOTE: recipe python3-installer-native-1.0.1-r0: task do_deploy_source_date_epoch_setscene: Started\nNOTE: recipe util-linux-native-2.41.3-r0: task do_deploy_source_date_epoch_setscene: Started\nNOTE: recipe python3-flit-core-native-3.12.0-r0: task do_deploy_source_date_epoch_setscene: Started\nNOTE: recipe e2fsprogs-native-1.47.4-r0: task do_recipe_qa_setscene: Started\nNOTE: recipe libidn2-native-2.3.8-r0: task do_deploy_source_date_epoch_setscene: Succeeded\nNOTE: recipe expat-native-2.8.1-r0: task do_deploy_source_date_epoch_setscene: Started\nNOTE: Running setscene task 502 of 520 (/tmp/devtoolqah725p3d8/core-copy/meta/recipes-devtools/cmake/cmake-native_4.3.3.bb:do_deploy_source_date_epoch_setscene)\nNOTE: recipe bison-native-3.8.2-r0: task do_populate_sysroot_setscene: Succeeded\nNOTE: recipe python3-setuptools-native-82.0.1-r0: task do_deploy_source_date_epoch_setscene: Succeeded\nNOTE: Running setscene task 503 of 520 (virtual:native:/tmp/devtoolqah725p3d8/core-copy/meta/recipes-connectivity/openssl/openssl_3.5.7.bb:do_deploy_source_date_epoch_setscene)\nNOTE: Running setscene task 506 of 520 (virtual:native:/tmp/devtoolqah725p3d8/core-copy/meta/recipes-support/libcap-ng/libcap-ng_0.9.3.bb:do_recipe_qa_setscene)\nNOTE: recipe python3-wheel-native-0.47.0-r0: task do_deploy_source_date_epoch_setscene: Succeeded\nNOTE: Running setscene task 507 of 520 (virtual:native:/tmp/devtoolqah725p3d8/core-copy/meta/recipes-devtools/bison/bison_3.8.2.bb:do_recipe_qa_setscene)\nNOTE: recipe gtk-doc-native-1.35.1-r0: task do_populate_sysroot_setscene: Succeeded\nNOTE: recipe python3-packaging-native-26.2-r0: task do_deploy_source_date_epoch_setscene: Succeeded\nNOTE: Running setscene task 510 of 520 (virtual:native:/tmp/devtoolqah725p3d8/core-copy/meta/recipes-gnome/gtk-doc/gtk-doc_1.35.1.bb:do_recipe_qa_setscene)\nNOTE: Running setscene task 511 of 520 (virtual:native:/tmp/devtoolqah725p3d8/core-copy/meta/recipes-devtools/perl/perl_5.42.2.bb:do_deploy_source_date_epoch_setscene)\nNOTE: recipe python3-pyproject-hooks-native-1.2.0-r0: task do_deploy_source_date_epoch_setscene: Succeeded\nNOTE: recipe python3-build-native-1.5.0-r0: task do_deploy_source_date_epoch_setscene: Succeeded\nNOTE: recipe python3-native-3.14.6-r0: task do_deploy_source_date_epoch_setscene: Started\nNOTE: recipe util-linux-native-2.41.3-r0: task do_deploy_source_date_epoch_setscene: Succeeded\nNOTE: recipe python3-installer-native-1.0.1-r0: task do_deploy_source_date_epoch_setscene: Succeeded\nNOTE: Running setscene task 513 of 520 (virtual:native:/tmp/devtoolqah725p3d8/core-copy/meta/recipes-devtools/perl-cross/perlcross_1.6.4.bb:do_populate_sysroot_setscene)\nNOTE: Running setscene task 514 of 520 (virtual:native:/tmp/devtoolqah725p3d8/core-copy/meta/recipes-extended/bzip2/bzip2_1.0.8.bb:do_deploy_source_date_epoch_setscene)\nNOTE: Running setscene task 515 of 520 (virtual:native:/tmp/devtoolqah725p3d8/core-copy/meta/recipes-core/util-linux/util-linux_2.41.3.bb:do_recipe_qa_setscene)\nNOTE: No pressure is limiting task startup\nNOTE: Running task 566 of 1370 (virtual:native:/tmp/devtoolqah725p3d8/core-copy/meta/recipes-devtools/python/python3-installer_1.0.1.bb:do_fetch)\nNOTE: recipe python3-flit-core-native-3.12.0-r0: task do_deploy_source_date_epoch_setscene: Succeeded\nNOTE: recipe e2fsprogs-native-1.47.4-r0: task do_recipe_qa_setscene: Succeeded\nNOTE: CPU pressure (>20000.0us) is limiting task startup\nNOTE: recipe expat-native-2.8.1-r0: task do_deploy_source_date_epoch_setscene: Succeeded\nNOTE: recipe cmake-native-4.3.3-r0: task do_deploy_source_date_epoch_setscene: Started\nNOTE: recipe autoconf-archive-native-2024.10.16-r0: task do_populate_sysroot_setscene: Succeeded\nNOTE: Running setscene task 517 of 520 (virtual:native:/tmp/devtoolqah725p3d8/core-copy/meta/recipes-devtools/autoconf-archive/autoconf-archive_2024.10.16.bb:do_recipe_qa_setscene)\nNOTE: recipe python3-native-3.14.6-r0: task do_deploy_source_date_epoch_setscene: Succeeded\nNOTE: recipe cmake-native-4.3.3-r0: task do_deploy_source_date_epoch_setscene: Succeeded\nNOTE: recipe libcap-ng-native-0.9.3-r0: task do_recipe_qa_setscene: Started\nNOTE: recipe perlcross-native-1.6.4-r0: task do_populate_sysroot_setscene: Started\nNOTE: recipe bison-native-3.8.2-r0: task do_recipe_qa_setscene: Started\nNOTE: recipe openssl-native-3.5.7-r0: task do_deploy_source_date_epoch_setscene: Started\nNOTE: recipe gtk-doc-native-1.35.1-r0: task do_recipe_qa_setscene: Started\nNOTE: recipe perl-native-5.42.2-r0: task do_deploy_source_date_epoch_setscene: Started\nNOTE: recipe python3-installer-native-1.0.1-r0: task do_fetch: Started\nNOTE: recipe python3-installer-native-1.0.1-r0: task do_fetch: Succeeded\nNOTE: recipe util-linux-native-2.41.3-r0: task do_recipe_qa_setscene: Started\nNOTE: recipe autoconf-archive-native-2024.10.16-r0: task do_recipe_qa_setscene: Started\nNOTE: recipe libcap-ng-native-0.9.3-r0: task do_recipe_qa_setscene: Succeeded\nNOTE: recipe openssl-native-3.5.7-r0: task do_deploy_source_date_epoch_setscene: Succeeded\nNOTE: recipe bison-native-3.8.2-r0: task do_recipe_qa_setscene: Succeeded\nNOTE: recipe bzip2-native-1.0.8-r0: task do_deploy_source_date_epoch_setscene: Started\nNOTE: recipe gtk-doc-native-1.35.1-r0: task do_recipe_qa_setscene: Succeeded\nNOTE: recipe perl-native-5.42.2-r0: task do_deploy_source_date_epoch_setscene: Succeeded\nNOTE: recipe util-linux-native-2.41.3-r0: task do_recipe_qa_setscene: Succeeded\nNOTE: recipe autoconf-archive-native-2024.10.16-r0: task do_recipe_qa_setscene: Succeeded\nNOTE: recipe perlcross-native-1.6.4-r0: task do_populate_sysroot_setscene: Succeeded\nNOTE: Running setscene task 519 of 520 (virtual:native:/tmp/devtoolqah725p3d8/core-copy/meta/recipes-devtools/perl-cross/perlcross_1.6.4.bb:do_recipe_qa_setscene)\nNOTE: recipe bzip2-native-1.0.8-r0: task do_deploy_source_date_epoch_setscene: Succeeded\nNOTE: Running setscene task 520 of 520 (virtual:native:/tmp/devtoolqah725p3d8/core-copy/meta/recipes-extended/bzip2/bzip2_1.0.8.bb:do_recipe_qa_setscene)\nNOTE: recipe perlcross-native-1.6.4-r0: task do_recipe_qa_setscene: Started\nNOTE: recipe perlcross-native-1.6.4-r0: task do_recipe_qa_setscene: Succeeded\nNOTE: recipe bzip2-native-1.0.8-r0: task do_recipe_qa_setscene: Started\nNOTE: recipe bzip2-native-1.0.8-r0: task do_recipe_qa_setscene: Succeeded\nNOTE: Setscene tasks completed\nERROR: Logfile of failure stored in: /srv/pokybuild/yocto-worker/oe-selftest-armhost/build/build-st-29913/tmp/work/cortexa57-poky-linux/opkg-utils/0.7.0/temp/log.do_fetch.1368932\nNOTE: recipe opkg-utils-0.7.0-r0: task do_fetch: Failed\nERROR: Task (/tmp/devtoolqah725p3d8/core-copy/meta/recipes-devtools/opkg-utils/opkg-utils_0.7.0.bb:do_fetch) failed with exit code '1'\nNOTE: Tasks Summary: Attempted 567 tasks of which 563 didn't need to be rerun and 1 failed.\nNOTE: The errors for this build are stored in /srv/pokybuild/yocto-worker/oe-selftest-armhost/build/build-st-29913/tmp/log/error-report/error_report_20260619191509.txt\nYou can send the errors to a reports server by running:\n  send-error-report /srv/pokybuild/yocto-worker/oe-selftest-armhost/build/build-st-29913/tmp/log/error-report/error_report_20260619191509.txt [-s server]\nNOTE: The contents of these logs will be posted in public if you use the above command with the default server. Please ensure you remove any identifying or proprietary information when prompted before sending.\n\nSummary: 1 task failed:\n  /tmp/devtoolqah725p3d8/core-copy/meta/recipes-devtools/opkg-utils/opkg-utils_0.7.0.bb:do_fetch\n    log: /srv/pokybuild/yocto-worker/oe-selftest-armhost/build/build-st-29913/tmp/work/cortexa57-poky-linux/opkg-utils/0.7.0/temp/log.do_fetch.1368932\nSummary: There was 1 WARNING message.\nSummary: There was 1 ERROR message, returning a non-zero exit code.\n/usr/lib/python3.12/unittest/case.py:580: RuntimeWarning: TestResult has no addDuration method\n  warnings.warn(\"TestResult has no addDuration method\",\n\n\nStderr:\n2026-06-19 18:50:54,547 - oe-selftest - INFO - Adding: \"include selftest.inc\" in /srv/pokybuild/yocto-worker/oe-selftest-armhost/build/build-st-29913/conf/local.conf\n2026-06-19 18:50:54,548 - oe-selftest - INFO - Adding: \"include bblayers.inc\" in bblayers.conf\n/usr/lib/python3.12/unittest/case.py:580: RuntimeWarning: TestResult has no addDuration method\n  warnings.warn(\"TestResult has no addDuration method\",\n\n/usr/lib/python3.12/unittest/case.py:580: RuntimeWarning: TestResult has no addDuration method\n  warnings.warn(\"TestResult has no addDuration method\",\n\n/usr/lib/python3.12/unittest/case.py:580: RuntimeWarning: TestResult has no addDuration method\n  warnings.warn(\"TestResult has no addDuration method\",\n\n/usr/lib/python3.12/unittest/case.py:580: RuntimeWarning: TestResult has no addDuration method\n  warnings.warn(\"TestResult has no addDuration method\",\n\n/usr/lib/python3.12/unittest/case.py:580: RuntimeWarning: TestResult has no addDuration method\n  warnings.warn(\"TestResult has no addDuration method\",\n\n/usr/lib/python3.12/unittest/case.py:580: RuntimeWarning: TestResult has no addDuration method\n  warnings.warn(\"TestResult has no addDuration method\",\n\n/usr/lib/python3.12/unittest/case.py:580: RuntimeWarning: TestResult has no addDuration method\n  warnings.warn(\"TestResult has no addDuration method\",\n\n/usr/lib/python3.12/unittest/case.py:580: RuntimeWarning: TestResult has no addDuration method\n  warnings.warn(\"TestResult has no addDuration method\",\n\n/usr/lib/python3.12/unittest/case.py:580: RuntimeWarning: TestResult has no addDuration method\n  warnings.warn(\"TestResult has no addDuration method\",\n\n/usr/lib/python3.12/unittest/case.py:580: RuntimeWarning: TestResult has no addDuration method\n  warnings.warn(\"TestResult has no addDuration method\",\n\n",
    "status": "FAILED"
   },
   "devtool.DevtoolModifyTests.test_devtool_modify_native": {
    "duration": 569.2155435085297,
    "status": "PASSED"
   },
   "devtool.DevtoolModifyTests.test_devtool_modify_nested_gitsm": {
    "duration": 58.3261923789978,
    "status": "PASSED"
   },
   "devtool.DevtoolModifyTests.test_devtool_modify_overrides": {
    "duration": 47.59906506538391,
    "status": "PASSED"
   },
   "devtool.DevtoolModifyTests.test_devtool_modify_virtual": {
    "duration": 48.41225862503052,
    "status": "PASSED"
   },
   "devtool.DevtoolResetTests.test_devtool_reset_all": {
    "duration": 258.0820951461792,
    "status": "PASSED"
   },
   "devtool.DevtoolResetTests.test_devtool_reset_re_plus_plus": {
    "duration": 50.08767557144165,
    "status": "PASSED"
   },
   "devtool.DevtoolTests.test_create_workspace": {
    "duration": 7.847865104675293,
    "status": "PASSED"
   },
   "devtool.DevtoolUpdateTests.test_devtool_finish_modify_git_subdir": {
    "duration": 162.72908306121826,
    "status": "PASSED"
   },
   "devtool.DevtoolUpdateTests.test_devtool_git_submodules": {
    "duration": 198.90959429740906,
    "status": "PASSED"
   },
   "devtool.DevtoolUpdateTests.test_devtool_update_recipe": {
    "duration": 64.5620322227478,
    "status": "PASSED"
   },
   "devtool.DevtoolUpdateTests.test_devtool_update_recipe_append": {
    "duration": 131.1908242702484,
    "status": "PASSED"
   },
   "devtool.DevtoolUpdateTests.test_devtool_update_recipe_append_git": {
    "duration": 129.09603643417358,
    "status": "PASSED"
   },
   "devtool.DevtoolUpdateTests.test_devtool_update_recipe_git": {
    "duration": 69.24752616882324,
    "status": "PASSED"
   },
   "devtool.DevtoolUpdateTests.test_devtool_update_recipe_local_files": {
    "duration": 128.5565962791443,
    "status": "PASSED"
   },
   "devtool.DevtoolUpdateTests.test_devtool_update_recipe_local_files_3": {
    "duration": 61.31614565849304,
    "status": "PASSED"
   },
   "devtool.DevtoolUpdateTests.test_devtool_update_recipe_local_files_subdir": {
    "duration": 58.180997371673584,
    "status": "PASSED"
   },
   "devtool.DevtoolUpdateTests.test_devtool_update_recipe_local_patch_gz": {
    "duration": 61.035773038864136,
    "status": "PASSED"
   },
   "devtool.DevtoolUpdateTests.test_devtool_update_recipe_long_filename": {
    "duration": 69.01110625267029,
    "status": "PASSED"
   },
   "devtool.DevtoolUpdateTests.test_devtool_update_recipe_with_gitignore": {
    "duration": 69.91233849525452,
    "status": "PASSED"
   },
   "devtool.DevtoolUpgradeTests.test_devtool_finish_modify_origlayer": {
    "duration": 174.0440275669098,
    "status": "PASSED"
   },
   "devtool.DevtoolUpgradeTests.test_devtool_finish_modify_otherlayer": {
    "duration": 99.30969333648682,
    "status": "PASSED"
   },
   "devtool.DevtoolUpgradeTests.test_devtool_finish_update_patch": {
    "duration": 99.54961776733398,
    "status": "PASSED"
   },
   "devtool.DevtoolUpgradeTests.test_devtool_finish_upgrade_origlayer": {
    "duration": 123.97920799255371,
    "status": "PASSED"
   },
   "devtool.DevtoolUpgradeTests.test_devtool_finish_upgrade_otherlayer": {
    "duration": 132.2537055015564,
    "status": "PASSED"
   },
   "devtool.DevtoolUpgradeTests.test_devtool_layer_plugins": {
    "duration": 3.6594326496124268,
    "status": "PASSED"
   },
   "devtool.DevtoolUpgradeTests.test_devtool_load_plugin": {
    "duration": 13.792286157608032,
    "status": "PASSED"
   },
   "devtool.DevtoolUpgradeTests.test_devtool_rename": {
    "duration": 118.10042762756348,
    "status": "PASSED"
   },
   "devtool.DevtoolUpgradeTests.test_devtool_upgrade": {
    "duration": 126.15556383132935,
    "status": "PASSED"
   },
   "devtool.DevtoolUpgradeTests.test_devtool_upgrade_all_checksums": {
    "duration": 114.33179044723511,
    "status": "PASSED"
   },
   "devtool.DevtoolUpgradeTests.test_devtool_upgrade_drop_md5sum": {
    "duration": 110.04077076911926,
    "status": "PASSED"
   },
   "devtool.DevtoolUpgradeTests.test_devtool_upgrade_git": {
    "duration": 68.47966957092285,
    "status": "PASSED"
   },
   "devtool.DevtoolUpgradeTests.test_devtool_upgrade_gitsm": {
    "duration": 78.46681594848633,
    "status": "PASSED"
   },
   "devtool.DevtoolUpgradeTests.test_devtool_upgrade_recipe_upgrade_extra_tasks": {
    "duration": 123.71217823028564,
    "status": "PASSED"
   },
   "devtool.DevtoolUpgradeTests.test_devtool_virtual_kernel_modify": {
    "duration": 1247.04212641716,
    "status": "PASSED"
   },
   "distrodata.Distrodata.test_checkpkg": {
    "duration": 0.0013461112976074219,
    "log": "Skip by the command line argument \"distrodata.Distrodata.test_checkpkg\"\n",
    "status": "SKIPPED"
   },
   "distrodata.Distrodata.test_common_include_recipes": {
    "duration": 90.58003735542297,
    "status": "PASSED"
   },
   "distrodata.Distrodata.test_maintainers": {
    "duration": 130.51179933547974,
    "status": "PASSED"
   },
   "efibootpartition.GenericEFITest.test_boot_efi": {
    "duration": 0.00576472282409668,
    "log": "test is qemux86-64 specific currently\n",
    "status": "SKIPPED"
   },
   "esdk.oeSDKExtSelfTest.test_image_generation_binary_feeds": {
    "duration": 134.74665451049805,
    "status": "PASSED"
   },
   "esdk.oeSDKExtSelfTest.test_install_libraries_headers": {
    "duration": 50.473923206329346,
    "status": "PASSED"
   },
   "externalsrc.ExternalSrc.test_externalsrc_srctree_hash_files": {
    "duration": 95.60895299911499,
    "status": "PASSED"
   },
   "fetch.Dependencies.test_dependencies": {
    "duration": 4.629354238510132,
    "status": "PASSED"
   },
   "fetch.Fetch.test_git_mirrors": {
    "duration": 120.51797771453857,
    "status": "PASSED"
   },
   "fitimage.FitImagePyTests.test_fitimage_py_conf_extra_mappings_unused_error": {
    "duration": 0.006357669830322266,
    "status": "PASSED"
   },
   "fitimage.FitImagePyTests.test_fitimage_py_conf_loadables": {
    "duration": 0.006517887115478516,
    "status": "PASSED"
   },
   "fitimage.FitImagePyTests.test_fitimage_py_conf_mappings": {
    "duration": 0.00755763053894043,
    "status": "PASSED"
   },
   "fitimage.FitImagePyTests.test_fitimage_py_conf_mappings_unused_error": {
    "duration": 0.006569623947143555,
    "status": "PASSED"
   },
   "fitimage.FitImagePyTests.test_fitimage_py_conf_mappings_with_alias": {
    "duration": 0.0065572261810302734,
    "status": "PASSED"
   },
   "fitimage.FitImagePyTests.test_fitimage_py_default": {
    "duration": 0.006273031234741211,
    "status": "PASSED"
   },
   "fitimage.FitImagePyTests.test_fitimage_py_default_dtb": {
    "duration": 0.007776737213134766,
    "status": "PASSED"
   },
   "fitimage.KernelFitImageRecipeTests.test_fit_image": {
    "duration": 118.86999177932739,
    "status": "PASSED"
   },
   "fitimage.KernelFitImageRecipeTests.test_fit_image_ext_dtb_dtbo": {
    "duration": 59.99693417549133,
    "status": "PASSED"
   },
   "fitimage.KernelFitImageRecipeTests.test_fit_image_sign_initramfs": {
    "duration": 134.68368554115295,
    "status": "PASSED"
   },
   "fitimage.KernelFitImageRecipeTests.test_fit_image_sign_initramfs_bundle": {
    "duration": 550.1678040027618,
    "status": "PASSED"
   },
   "fitimage.KernelFitImageRecipeTests.test_get_compatible_from_dtb": {
    "duration": 31.710700273513794,
    "status": "PASSED"
   },
   "fitimage.KernelFitImageRecipeTests.test_sign_fit_image_configurations": {
    "duration": 84.80499863624573,
    "status": "PASSED"
   },
   "fitimage.KernelFitImageRecipeTests.test_sign_fit_image_individual": {
    "duration": 84.89200019836426,
    "status": "PASSED"
   },
   "fitimage.UBootFitImageTests.test_sign_cascaded_uboot_fit_image": {
    "duration": 173.93678617477417,
    "status": "PASSED"
   },
   "fitimage.UBootFitImageTests.test_sign_standalone_uboot_atf_tee_fit_image": {
    "duration": 100.82229924201965,
    "status": "PASSED"
   },
   "fitimage.UBootFitImageTests.test_sign_standalone_uboot_fit_image": {
    "duration": 102.8046772480011,
    "status": "PASSED"
   },
   "fitimage.UBootFitImageTests.test_sign_uboot_fit_image_without_spl": {
    "duration": 130.88461446762085,
    "status": "PASSED"
   },
   "fitimage.UBootFitImageTests.test_sign_uboot_kernel_individual": {
    "duration": 130.40904021263123,
    "status": "PASSED"
   },
   "fitimage.UBootFitImageTests.test_uboot_atf_tee_fit_image": {
    "duration": 96.16714596748352,
    "status": "PASSED"
   },
   "fitimage.UBootFitImageTests.test_uboot_fit_image": {
    "duration": 97.32012987136841,
    "status": "PASSED"
   },
   "gdbserver.GdbServerTest.test_gdb_server": {
    "duration": 163.71138882637024,
    "status": "PASSED"
   },
   "gitarchivetests.GitArchiveTests.test_create_first_test_tag": {
    "duration": 0.8825054168701172,
    "status": "PASSED"
   },
   "gitarchivetests.GitArchiveTests.test_create_second_test_tag": {
    "duration": 0.9593169689178467,
    "status": "PASSED"
   },
   "gitarchivetests.GitArchiveTests.test_get_revs_on_branch": {
    "duration": 0.5885779857635498,
    "status": "PASSED"
   },
   "gitarchivetests.GitArchiveTests.test_get_tags_with_only_local_tag": {
    "duration": 0.5287430286407471,
    "status": "PASSED"
   },
   "gitarchivetests.GitArchiveTests.test_get_tags_without_valid_remote": {
    "duration": 1.0113487243652344,
    "status": "PASSED"
   },
   "gitarchivetests.GitArchiveTests.test_get_tags_without_valid_remote_and_wrong_url": {
    "duration": 0.4982576370239258,
    "status": "PASSED"
   },
   "gotoolchain.oeGoToolchainSelfTest.test_go_dep_build": {
    "duration": 4.076165676116943,
    "status": "PASSED"
   },
   "image_typedep.ImageTypeDepTests.test_conversion_typedep_added": {
    "duration": 49.42186498641968,
    "status": "PASSED"
   },
   "imagefeatures.ImageFeatures.test_all_users_can_connect_via_ssh_without_password": {
    "duration": 248.15634298324585,
    "oetags": [
     "runqemu"
    ],
    "status": "PASSED"
   },
   "imagefeatures.ImageFeatures.test_bmap": {
    "duration": 85.01533222198486,
    "status": "PASSED"
   },
   "imagefeatures.ImageFeatures.test_empty_image": {
    "duration": 58.64335227012634,
    "status": "PASSED"
   },
   "imagefeatures.ImageFeatures.test_hypervisor_fmts": {
    "duration": 100.41351580619812,
    "status": "PASSED"
   },
   "imagefeatures.ImageFeatures.test_image_fstypes": {
    "duration": 149.26204919815063,
    "status": "PASSED"
   },
   "imagefeatures.ImageFeatures.test_image_gen_debugfs": {
    "duration": 99.96641612052917,
    "status": "PASSED"
   },
   "imagefeatures.ImageFeatures.test_long_chain_conversion": {
    "duration": 91.7561902999878,
    "status": "PASSED"
   },
   "imagefeatures.ImageFeatures.test_mandb": {
    "duration": 151.38779425621033,
    "status": "PASSED"
   },
   "imagefeatures.ImageFeatures.test_no_busybox_base_utils": {
    "duration": 71.45022201538086,
    "status": "PASSED"
   },
   "imagefeatures.ImageFeatures.test_non_root_user_can_connect_via_ssh_without_password": {
    "duration": 139.29441380500793,
    "oetags": [
     "runqemu"
    ],
    "status": "PASSED"
   },
   "imagefeatures.ImageFeatures.test_useradd_static": {
    "duration": 121.57510328292847,
    "status": "PASSED"
   },
   "imagefeatures.ImageFeatures.test_wayland_support_in_image": {
    "duration": 156.7241494655609,
    "status": "PASSED"
   },
   "incompatible_lic.IncompatibleLicensePerImageTests.test_bash_and_license": {
    "duration": 103.34623169898987,
    "status": "PASSED"
   },
   "incompatible_lic.IncompatibleLicensePerImageTests.test_bash_default": {
    "duration": 112.5418004989624,
    "status": "PASSED"
   },
   "incompatible_lic.IncompatibleLicensePerImageTests.test_bash_license_exceptions": {
    "duration": 95.20490717887878,
    "status": "PASSED"
   },
   "incompatible_lic.IncompatibleLicensePerImageTests.test_bash_or_license": {
    "duration": 98.70292472839355,
    "status": "PASSED"
   },
   "incompatible_lic.IncompatibleLicenseTestObsolete.test_incompatible_alias_spdx_license": {
    "duration": 38.75083565711975,
    "status": "PASSED"
   },
   "incompatible_lic.IncompatibleLicenseTestObsolete.test_incompatible_alias_spdx_license_alias": {
    "duration": 40.0090172290802,
    "status": "PASSED"
   },
   "incompatible_lic.IncompatibleLicenseTestObsolete.test_incompatible_alias_spdx_license_alias_wildcard": {
    "duration": 37.07387113571167,
    "status": "PASSED"
   },
   "incompatible_lic.IncompatibleLicenseTestObsolete.test_incompatible_alias_spdx_license_wildcard": {
    "duration": 40.00167632102966,
    "status": "PASSED"
   },
   "incompatible_lic.IncompatibleLicenseTestObsolete.test_incompatible_all_licenses_wildcard": {
    "duration": 39.30965566635132,
    "status": "PASSED"
   },
   "incompatible_lic.IncompatibleLicenseTestObsolete.test_incompatible_spdx_license_alias_wildcard": {
    "duration": 40.08115100860596,
    "status": "PASSED"
   },
   "incompatible_lic.IncompatibleLicenseTestObsolete.test_incompatible_spdx_licenses_wildcard": {
    "duration": 39.77536606788635,
    "status": "PASSED"
   },
   "incompatible_lic.IncompatibleLicenseTests.test_incompatible_nonspdx_license": {
    "duration": 35.56734871864319,
    "status": "PASSED"
   },
   "incompatible_lic.IncompatibleLicenseTests.test_incompatible_spdx_license": {
    "duration": 33.13571119308472,
    "status": "PASSED"
   },
   "incompatible_lic.IncompatibleLicenseTests.test_incompatible_spdx_license_alias": {
    "duration": 5.80828070640564,
    "status": "PASSED"
   },
   "incompatible_lic.IncompatibleLicenseTests.test_incompatible_spdx_license_wildcard": {
    "duration": 33.237523794174194,
    "status": "PASSED"
   },
   "incompatible_lic.IncompatibleLicenseTests.test_incompatible_spdx_licenses": {
    "duration": 35.33257532119751,
    "status": "PASSED"
   },
   "incompatible_lic.NoGPL3InImagesTests.test_core_image_full_cmdline_weston": {
    "duration": 229.67654299736023,
    "status": "PASSED"
   },
   "incompatible_lic.NoGPL3InImagesTests.test_core_image_minimal": {
    "duration": 74.16886448860168,
    "status": "PASSED"
   },
   "install.InstallTests.test_gstreamer_plugins": {
    "duration": 209.1527910232544,
    "status": "PASSED"
   },
   "install.InstallTests.test_linux_firmware": {
    "duration": 164.7491636276245,
    "status": "PASSED"
   },
   "install.InstallTests.test_linux_modules": {
    "duration": 91.55426812171936,
    "status": "PASSED"
   },
   "install.InstallTests.test_perl": {
    "duration": 99.03362011909485,
    "status": "PASSED"
   },
   "install.InstallTests.test_python": {
    "duration": 100.35740375518799,
    "status": "PASSED"
   },
   "intercept.GitCheck.test_git_intercept": {
    "duration": 24.0648353099823,
    "status": "PASSED"
   },
   "kerneldevelopment.KernelDev.test_apply_patches": {
    "duration": 280.7365138530731,
    "status": "PASSED"
   },
   "layerappend.LayerAppendTests.test_layer_appends": {
    "duration": 76.58522081375122,
    "status": "PASSED"
   },
   "liboe.CopyTreeTests.test_copy_hardlink_tree_count": {
    "duration": 0.013908147811889648,
    "status": "PASSED"
   },
   "liboe.CopyTreeTests.test_copy_tree_special": {
    "duration": 0.011363744735717773,
    "status": "PASSED"
   },
   "liboe.CopyTreeTests.test_copy_tree_xattr": {
    "duration": 16.455848455429077,
    "status": "PASSED"
   },
   "liboe.SubprocessTests.test_subprocess_tweak": {
    "duration": 0.016067028045654297,
    "status": "PASSED"
   },
   "lic_checksum.LicenseTests.test_checksum_with_space": {
    "duration": 39.68443465232849,
    "status": "PASSED"
   },
   "lic_checksum.LicenseTests.test_nonmatching_checksum": {
    "duration": 24.999539136886597,
    "status": "PASSED"
   },
   "locales.LocalesTest.test_locales_off": {
    "duration": 136.7355659008026,
    "status": "PASSED"
   },
   "locales.LocalesTest.test_locales_on": {
    "duration": 97.05406284332275,
    "status": "PASSED"
   },
   "manifest.VerifyManifest.test_SDK_manifest_entries": {
    "duration": 387.51482796669006,
    "status": "PASSED"
   },
   "manifest.VerifyManifest.test_image_manifest_entries": {
    "duration": 14.785100936889648,
    "status": "PASSED"
   },
   "minidebuginfo.Minidebuginfo.test_minidebuginfo": {
    "duration": 149.2744174003601,
    "status": "PASSED"
   },
   "minidebuginfo.Minidebuginfo.test_minidebuginfo_qemu": {
    "duration": 159.93155646324158,
    "oetags": [
     "runqemu"
    ],
    "status": "PASSED"
   },
   "multiconfig.MultiConfig.test_multiconfig": {
    "duration": 410.42481231689453,
    "status": "PASSED"
   },
   "multiconfig.MultiConfig.test_multiconfig_inlayer": {
    "duration": 108.27150464057922,
    "status": "PASSED"
   },
   "multiconfig.MultiConfig.test_multiconfig_reparse": {
    "duration": 117.21346783638,
    "status": "PASSED"
   },
   "newlib.NewlibTest.test_newlib": {
    "duration": 59.26325058937073,
    "status": "PASSED"
   },
   "oelib.buildhistory.TestBlobParsing.test_blob_to_dict": {
    "duration": 1.6687941551208496,
    "status": "PASSED"
   },
   "oelib.buildhistory.TestBlobParsing.test_compare_dict_blobs": {
    "duration": 0.940727949142456,
    "status": "PASSED"
   },
   "oelib.buildhistory.TestBlobParsing.test_compare_dict_blobs_default": {
    "duration": 0.9110696315765381,
    "status": "PASSED"
   },
   "oelib.buildhistory.TestFileListCompare.test_compare_file_lists": {
    "duration": 0.1633002758026123,
    "status": "PASSED"
   },
   "oelib.elf.TestElf.test_machine_name": {
    "duration": 0.0010259151458740234,
    "status": "PASSED"
   },
   "oelib.license.TestComplexCombinations.test_tests": {
    "duration": 0.002259492874145508,
    "status": "PASSED"
   },
   "oelib.license.TestIsIncluded.test_tests": {
    "duration": 0.0033636093139648438,
    "status": "PASSED"
   },
   "oelib.license.TestSimpleCombinations.test_tests": {
    "duration": 0.002024412155151367,
    "status": "PASSED"
   },
   "oelib.license.TestSingleLicense.test_invalid_licenses": {
    "duration": 0.0005612373352050781,
    "status": "PASSED"
   },
   "oelib.license.TestSingleLicense.test_single_licenses": {
    "duration": 0.0006787776947021484,
    "status": "PASSED"
   },
   "oelib.package.TestIsKernelModule.test_detects_vermagic": {
    "duration": 0.003876924514770508,
    "status": "PASSED"
   },
   "oelib.package.TestIsKernelModule.test_rejects_plain_elf": {
    "duration": 0.0016551017761230469,
    "status": "PASSED"
   },
   "oelib.package.TestIsKernelModuleSigned.test_detects_signed": {
    "duration": 0.004033803939819336,
    "status": "PASSED"
   },
   "oelib.package.TestIsKernelModuleSigned.test_rejects_unsigned": {
    "duration": 0.0009753704071044922,
    "status": "PASSED"
   },
   "oelib.package.TestKernelModuleFilenameFilter.test_endswith_matches_ko": {
    "duration": 0.0025730133056640625,
    "status": "PASSED"
   },
   "oelib.package.TestKernelModuleFilenameFilter.test_endswith_rejects_non_ko": {
    "duration": 0.0025162696838378906,
    "status": "PASSED"
   },
   "oelib.package.TestKernelModuleFilenameFilter.test_old_predicate_had_false_positives": {
    "duration": 0.002532482147216797,
    "status": "PASSED"
   },
   "oelib.path.TestRealPath.test_loop": {
    "duration": 0.004624605178833008,
    "status": "PASSED"
   },
   "oelib.path.TestRealPath.test_norm": {
    "duration": 0.0030727386474609375,
    "status": "PASSED"
   },
   "oelib.path.TestRealPath.test_phys": {
    "duration": 0.0017964839935302734,
    "status": "PASSED"
   },
   "oelib.types.TestBooleanType.test_bool_equality": {
    "duration": 0.0014100074768066406,
    "status": "PASSED"
   },
   "oelib.types.TestBooleanType.test_false": {
    "duration": 0.0014510154724121094,
    "status": "PASSED"
   },
   "oelib.types.TestBooleanType.test_invalid": {
    "duration": 0.0015985965728759766,
    "status": "PASSED"
   },
   "oelib.types.TestBooleanType.test_true": {
    "duration": 0.0016350746154785156,
    "status": "PASSED"
   },
   "oelib.types.TestList.test_list_nosep": {
    "duration": 0.002412557601928711,
    "status": "PASSED"
   },
   "oelib.types.TestList.test_list_usersep": {
    "duration": 0.00269317626953125,
    "status": "PASSED"
   },
   "oelib.utils.TestDefaultFeatures.test_filter_default_features": {
    "duration": 0.0020363330841064453,
    "status": "PASSED"
   },
   "oelib.utils.TestMultiprocessLaunch.test_multiprocesslaunch": {
    "duration": 0.06584024429321289,
    "status": "PASSED"
   },
   "oelib.utils.TestPackagesFilterOutSystem.test_filter": {
    "duration": 0.002003192901611328,
    "status": "PASSED"
   },
   "oelib.utils.TestTrimVersion.test_num_exception": {
    "duration": 0.0011188983917236328,
    "status": "PASSED"
   },
   "oelib.utils.TestTrimVersion.test_valid": {
    "duration": 0.0011293888092041016,
    "status": "PASSED"
   },
   "oelib.utils.TestTrimVersion.test_version_exception": {
    "duration": 0.0013124942779541016,
    "status": "PASSED"
   },
   "oescripts.OEGitproxyTests.test_oegitproxy_help": {
    "duration": 0.05165266990661621,
    "status": "PASSED"
   },
   "oescripts.OEGitproxyTests.test_oegitproxy_proxy": {
    "duration": 0.19832134246826172,
    "status": "PASSED"
   },
   "oescripts.OEGitproxyTests.test_oegitproxy_proxy_dash": {
    "duration": 0.14902448654174805,
    "status": "PASSED"
   },
   "oescripts.OEListPackageconfigTests.test_packageconfig_flags_default": {
    "duration": 403.91701316833496,
    "status": "PASSED"
   },
   "oescripts.OEListPackageconfigTests.test_packageconfig_flags_help": {
    "duration": 0.4227132797241211,
    "status": "PASSED"
   },
   "oescripts.OEListPackageconfigTests.test_packageconfig_flags_option_all": {
    "duration": 405.1745591163635,
    "status": "PASSED"
   },
   "oescripts.OEListPackageconfigTests.test_packageconfig_flags_option_flags": {
    "duration": 466.7491307258606,
    "status": "PASSED"
   },
   "oescripts.OEListPackageconfigTests.test_packageconfig_flags_options_preferred_only": {
    "duration": 506.0595462322235,
    "status": "PASSED"
   },
   "oescripts.OEPybootchartguyTests.test_pybootchartguy_help": {
    "duration": 0.15844082832336426,
    "status": "PASSED"
   },
   "oescripts.OEPybootchartguyTests.test_pybootchartguy_to_generate_build_pdf_output": {
    "duration": 0.23889875411987305,
    "status": "PASSED"
   },
   "oescripts.OEPybootchartguyTests.test_pybootchartguy_to_generate_build_png_output": {
    "duration": 0.4575340747833252,
    "status": "PASSED"
   },
   "oescripts.OEPybootchartguyTests.test_pybootchartguy_to_generate_build_svg_output": {
    "duration": 0.20245099067687988,
    "status": "PASSED"
   },
   "oescripts.OeRunNativeTest.test_oe_run_native": {
    "duration": 55.0760772228241,
    "status": "PASSED"
   },
   "overlayfs.OverlayFSEtcRunTimeTests.test_all_required_variables_set": {
    "duration": 312.2361047267914,
    "oetags": [
     "runqemu"
    ],
    "status": "PASSED"
   },
   "overlayfs.OverlayFSEtcRunTimeTests.test_image_feature_conflict": {
    "duration": 5.763123989105225,
    "oetags": [
     "runqemu"
    ],
    "status": "PASSED"
   },
   "overlayfs.OverlayFSEtcRunTimeTests.test_image_feature_is_missing": {
    "duration": 0.0007665157318115234,
    "log": "tests are qemux86-64 specific currently\n",
    "oetags": [
     "runqemu"
    ],
    "status": "SKIPPED"
   },
   "overlayfs.OverlayFSEtcRunTimeTests.test_lower_layer_access": {
    "duration": 0.0007867813110351562,
    "log": "tests are qemux86-64 specific currently\n",
    "oetags": [
     "runqemu"
    ],
    "status": "SKIPPED"
   },
   "overlayfs.OverlayFSEtcRunTimeTests.test_postinst_on_target_for_read_only_rootfs": {
    "duration": 0.0008821487426757812,
    "log": "tests are qemux86-64 specific currently\n",
    "oetags": [
     "runqemu"
    ],
    "status": "SKIPPED"
   },
   "overlayfs.OverlayFSEtcRunTimeTests.test_sbin_init_original": {
    "duration": 0.0009942054748535156,
    "log": "tests are qemux86-64 specific currently\n",
    "oetags": [
     "runqemu"
    ],
    "status": "SKIPPED"
   },
   "overlayfs.OverlayFSEtcRunTimeTests.test_sbin_init_preinit": {
    "duration": 0.0011327266693115234,
    "log": "tests are qemux86-64 specific currently\n",
    "oetags": [
     "runqemu"
    ],
    "status": "SKIPPED"
   },
   "overlayfs.OverlayFSEtcRunTimeTests.test_sbin_init_read_only": {
    "duration": 0.0012590885162353516,
    "log": "tests are qemux86-64 specific currently\n",
    "oetags": [
     "runqemu"
    ],
    "status": "SKIPPED"
   },
   "overlayfs.OverlayFSTests.test_correct_image_fstab": {
    "duration": 159.17509841918945,
    "oetags": [
     "runqemu"
    ],
    "status": "PASSED"
   },
   "overlayfs.OverlayFSTests.test_correct_image_unit": {
    "duration": 110.71373009681702,
    "oetags": [
     "runqemu"
    ],
    "status": "PASSED"
   },
   "overlayfs.OverlayFSTests.test_distro_features_missing": {
    "duration": 38.933961629867554,
    "status": "PASSED"
   },
   "overlayfs.OverlayFSTests.test_mount_unit_not_set": {
    "duration": 23.576709985733032,
    "status": "PASSED"
   },
   "overlayfs.OverlayFSTests.test_not_all_units_installed": {
    "duration": 97.63131070137024,
    "status": "PASSED"
   },
   "overlayfs.OverlayFSTests.test_not_all_units_installed_but_qa_skipped": {
    "duration": 119.49261713027954,
    "status": "PASSED"
   },
   "overlayfs.OverlayFSTests.test_wrong_mount_unit_set": {
    "duration": 23.543681383132935,
    "status": "PASSED"
   },
   "package.PackageTests.test_gdb_hardlink_debug": {
    "duration": 136.10055994987488,
    "status": "PASSED"
   },
   "package.PackageTests.test_kmodule_prefilter": {
    "duration": 50.60846924781799,
    "status": "PASSED"
   },
   "package.PackageTests.test_package_name_conflict": {
    "duration": 18.823864221572876,
    "status": "PASSED"
   },
   "package.PackageTests.test_preserve_ownership": {
    "duration": 103.47062277793884,
    "status": "PASSED"
   },
   "package.PackageTests.test_preserve_sparse_hardlinks": {
    "duration": 51.710235595703125,
    "status": "PASSED"
   },
   "package.VersionOrdering.test_dpkg": {
    "duration": 0.035714149475097656,
    "status": "PASSED"
   },
   "package.VersionOrdering.test_opkg": {
    "duration": 0.049720048904418945,
    "status": "PASSED"
   },
   "package.VersionOrdering.test_rpm": {
    "duration": 0.2267470359802246,
    "status": "PASSED"
   },
   "picolibc.PicolibcTest.test_picolibc": {
    "duration": 66.88851165771484,
    "status": "PASSED"
   },
   "pkgdata.OePkgdataUtilTests.test_find_path": {
    "duration": 3.212373733520508,
    "status": "PASSED"
   },
   "pkgdata.OePkgdataUtilTests.test_glob": {
    "duration": 1.843881368637085,
    "status": "PASSED"
   },
   "pkgdata.OePkgdataUtilTests.test_list_pkg_files": {
    "duration": 8.906407117843628,
    "status": "PASSED"
   },
   "pkgdata.OePkgdataUtilTests.test_list_pkgs": {
    "duration": 8.084569931030273,
    "status": "PASSED"
   },
   "pkgdata.OePkgdataUtilTests.test_lookup_pkg": {
    "duration": 6.324678182601929,
    "status": "PASSED"
   },
   "pkgdata.OePkgdataUtilTests.test_lookup_recipe": {
    "duration": 2.7433648109436035,
    "status": "PASSED"
   },
   "pkgdata.OePkgdataUtilTests.test_multilib_variables": {
    "duration": 61.73200726509094,
    "status": "PASSED"
   },
   "pkgdata.OePkgdataUtilTests.test_no_param": {
    "duration": 0.09557080268859863,
    "status": "PASSED"
   },
   "pkgdata.OePkgdataUtilTests.test_read_value": {
    "duration": 3.874692916870117,
    "status": "PASSED"
   },
   "pkgdata.OePkgdataUtilTests.test_specify_pkgdatadir": {
    "duration": 1.291182279586792,
    "status": "PASSED"
   },
   "pokybleeding.PokyBleeding.test_poky_bleeding_autorev": {
    "duration": 109.70902347564697,
    "status": "PASSED"
   },
   "prservice.BitbakePrTests.test_import_export_override_db": {
    "duration": 271.2391564846039,
    "status": "PASSED"
   },
   "prservice.BitbakePrTests.test_import_export_replace_db": {
    "duration": 170.34465289115906,
    "status": "PASSED"
   },
   "prservice.BitbakePrTests.test_pr_service_deb_arch_dep": {
    "duration": 196.46778273582458,
    "status": "PASSED"
   },
   "prservice.BitbakePrTests.test_pr_service_deb_arch_indep": {
    "duration": 44.9837281703949,
    "status": "PASSED"
   },
   "prservice.BitbakePrTests.test_pr_service_ipk_arch_dep": {
    "duration": 181.45436453819275,
    "status": "PASSED"
   },
   "prservice.BitbakePrTests.test_pr_service_ipk_arch_indep": {
    "duration": 44.894113302230835,
    "status": "PASSED"
   },
   "prservice.BitbakePrTests.test_pr_service_rpm_arch_dep": {
    "duration": 156.01893877983093,
    "status": "PASSED"
   },
   "prservice.BitbakePrTests.test_pr_service_rpm_arch_indep": {
    "duration": 46.215484380722046,
    "status": "PASSED"
   },
   "prservice.BitbakePrTests.test_stopping_prservice_message": {
    "duration": 0.7619898319244385,
    "status": "PASSED"
   },
   "pseudo.Pseudo.test_pseudo_pyc_creation": {
    "duration": 13.269720315933228,
    "status": "PASSED"
   },
   "recipetool.RecipetoolAppendTests.test_recipetool_appendfile_add": {
    "duration": 116.45473957061768,
    "status": "PASSED"
   },
   "recipetool.RecipetoolAppendTests.test_recipetool_appendfile_add_bindir": {
    "duration": 49.94701647758484,
    "status": "PASSED"
   },
   "recipetool.RecipetoolAppendTests.test_recipetool_appendfile_add_machine": {
    "duration": 50.33266353607178,
    "status": "PASSED"
   },
   "recipetool.RecipetoolAppendTests.test_recipetool_appendfile_alternatives": {
    "duration": 42.36899518966675,
    "status": "PASSED"
   },
   "recipetool.RecipetoolAppendTests.test_recipetool_appendfile_basic": {
    "duration": 58.55520939826965,
    "status": "PASSED"
   },
   "recipetool.RecipetoolAppendTests.test_recipetool_appendfile_binary": {
    "duration": 43.36683917045593,
    "status": "PASSED"
   },
   "recipetool.RecipetoolAppendTests.test_recipetool_appendfile_extlayer": {
    "duration": 9.128022193908691,
    "status": "PASSED"
   },
   "recipetool.RecipetoolAppendTests.test_recipetool_appendfile_inst_func": {
    "duration": 60.39391016960144,
    "status": "PASSED"
   },
   "recipetool.RecipetoolAppendTests.test_recipetool_appendfile_inst_glob": {
    "duration": 53.19780254364014,
    "status": "PASSED"
   },
   "recipetool.RecipetoolAppendTests.test_recipetool_appendfile_inst_todir_glob": {
    "duration": 61.9964919090271,
    "status": "PASSED"
   },
   "recipetool.RecipetoolAppendTests.test_recipetool_appendfile_invalid": {
    "duration": 55.341973304748535,
    "status": "PASSED"
   },
   "recipetool.RecipetoolAppendTests.test_recipetool_appendfile_orig": {
    "duration": 57.38885521888733,
    "status": "PASSED"
   },
   "recipetool.RecipetoolAppendTests.test_recipetool_appendfile_patch": {
    "duration": 54.29639434814453,
    "status": "PASSED"
   },
   "recipetool.RecipetoolAppendTests.test_recipetool_appendfile_postinstall": {
    "duration": 64.6360399723053,
    "status": "PASSED"
   },
   "recipetool.RecipetoolAppendTests.test_recipetool_appendfile_renamed": {
    "duration": 57.68471550941467,
    "status": "PASSED"
   },
   "recipetool.RecipetoolAppendTests.test_recipetool_appendfile_script": {
    "duration": 53.67335319519043,
    "status": "PASSED"
   },
   "recipetool.RecipetoolAppendTests.test_recipetool_appendfile_subdir": {
    "duration": 52.714377880096436,
    "status": "PASSED"
   },
   "recipetool.RecipetoolAppendTests.test_recipetool_appendfile_todir": {
    "duration": 51.6854772567749,
    "status": "PASSED"
   },
   "recipetool.RecipetoolAppendTests.test_recipetool_appendfile_wildcard": {
    "duration": 17.230750799179077,
    "status": "PASSED"
   },
   "recipetool.RecipetoolAppendsrcTests.test_recipetool_appendsrcfile_basic": {
    "duration": 87.27875852584839,
    "status": "PASSED"
   },
   "recipetool.RecipetoolAppendsrcTests.test_recipetool_appendsrcfile_basic_wildcard": {
    "duration": 57.57061147689819,
    "status": "PASSED"
   },
   "recipetool.RecipetoolAppendsrcTests.test_recipetool_appendsrcfile_existing_in_src_uri": {
    "duration": 21.10093331336975,
    "status": "PASSED"
   },
   "recipetool.RecipetoolAppendsrcTests.test_recipetool_appendsrcfile_existing_in_src_uri_diff_params": {
    "duration": 23.58566164970398,
    "status": "PASSED"
   },
   "recipetool.RecipetoolAppendsrcTests.test_recipetool_appendsrcfile_machine": {
    "duration": 68.9541368484497,
    "status": "PASSED"
   },
   "recipetool.RecipetoolAppendsrcTests.test_recipetool_appendsrcfile_replace_file_srcdir": {
    "duration": 38.349801778793335,
    "status": "PASSED"
   },
   "recipetool.RecipetoolAppendsrcTests.test_recipetool_appendsrcfile_srcdir_basic": {
    "duration": 24.970821857452393,
    "status": "PASSED"
   },
   "recipetool.RecipetoolAppendsrcTests.test_recipetool_appendsrcfile_subdir_basic": {
    "duration": 47.5065484046936,
    "status": "PASSED"
   },
   "recipetool.RecipetoolAppendsrcTests.test_recipetool_appendsrcfile_subdir_basic_dirdest": {
    "duration": 46.97782278060913,
    "status": "PASSED"
   },
   "recipetool.RecipetoolAppendsrcTests.test_recipetool_appendsrcfile_update_recipe_basic": {
    "duration": 10.695542335510254,
    "status": "PASSED"
   },
   "recipetool.RecipetoolAppendsrcTests.test_recipetool_appendsrcfiles_basic": {
    "duration": 58.9735209941864,
    "status": "PASSED"
   },
   "recipetool.RecipetoolAppendsrcTests.test_recipetool_appendsrcfiles_basic_subdir": {
    "duration": 60.46962380409241,
    "status": "PASSED"
   },
   "recipetool.RecipetoolCreateTests.test_recipetool_create": {
    "duration": 39.074995040893555,
    "status": "PASSED"
   },
   "recipetool.RecipetoolCreateTests.test_recipetool_create_autotools": {
    "duration": 65.5439076423645,
    "status": "PASSED"
   },
   "recipetool.RecipetoolCreateTests.test_recipetool_create_cmake": {
    "duration": 39.75279402732849,
    "status": "PASSED"
   },
   "recipetool.RecipetoolCreateTests.test_recipetool_create_git_http": {
    "duration": 40.889145612716675,
    "status": "PASSED"
   },
   "recipetool.RecipetoolCreateTests.test_recipetool_create_git_srcbranch": {
    "duration": 41.14604663848877,
    "status": "PASSED"
   },
   "recipetool.RecipetoolCreateTests.test_recipetool_create_git_srcuri_branch": {
    "duration": 41.133147954940796,
    "status": "PASSED"
   },
   "recipetool.RecipetoolCreateTests.test_recipetool_create_git_srcuri_master": {
    "duration": 41.541624546051025,
    "status": "PASSED"
   },
   "recipetool.RecipetoolCreateTests.test_recipetool_create_github": {
    "duration": 44.26495361328125,
    "status": "PASSED"
   },
   "recipetool.RecipetoolCreateTests.test_recipetool_create_github_tarball": {
    "duration": 42.93765830993652,
    "status": "PASSED"
   },
   "recipetool.RecipetoolCreateTests.test_recipetool_create_go": {
    "duration": 57.6021192073822,
    "status": "PASSED"
   },
   "recipetool.RecipetoolCreateTests.test_recipetool_create_npm": {
    "duration": 1.3611559867858887,
    "log": "Test needs meta-oe for nodejs\n",
    "status": "SKIPPED"
   },
   "recipetool.RecipetoolCreateTests.test_recipetool_create_python3_pep517_flit_core_buildapi": {
    "duration": 46.80322766304016,
    "status": "PASSED"
   },
   "recipetool.RecipetoolCreateTests.test_recipetool_create_python3_pep517_hatchling": {
    "duration": 41.81384801864624,
    "status": "PASSED"
   },
   "recipetool.RecipetoolCreateTests.test_recipetool_create_python3_pep517_maturin": {
    "duration": 41.140758991241455,
    "status": "PASSED"
   },
   "recipetool.RecipetoolCreateTests.test_recipetool_create_python3_pep517_mesonpy": {
    "duration": 42.897563219070435,
    "status": "PASSED"
   },
   "recipetool.RecipetoolCreateTests.test_recipetool_create_python3_pep517_poetry_core_masonry_api": {
    "duration": 41.00498700141907,
    "status": "PASSED"
   },
   "recipetool.RecipetoolCreateTests.test_recipetool_create_python3_pep517_setuptools_build_meta": {
    "duration": 42.56995153427124,
    "status": "PASSED"
   },
   "recipetool.RecipetoolCreateTests.test_recipetool_create_python3_pep517_setuptools_build_meta_license_pep639": {
    "duration": 40.6832013130188,
    "status": "PASSED"
   },
   "recipetool.RecipetoolCreateTests.test_recipetool_create_python3_pep517_setuptools_build_meta_license_prepep639": {
    "duration": 40.30734467506409,
    "status": "PASSED"
   },
   "recipetool.RecipetoolCreateTests.test_recipetool_create_python3_setuptools": {
    "duration": 40.1491916179657,
    "status": "PASSED"
   },
   "recipetool.RecipetoolCreateTests.test_recipetool_create_python3_setuptools_pypi": {
    "duration": 68.85675311088562,
    "status": "PASSED"
   },
   "recipetool.RecipetoolCreateTests.test_recipetool_create_python3_setuptools_pypi_tarball": {
    "duration": 41.28435921669006,
    "status": "PASSED"
   },
   "recipetool.RecipetoolCreateTests.test_recipetool_create_simple": {
    "duration": 42.049461364746094,
    "status": "PASSED"
   },
   "recipetool.RecipetoolTests.test_recipetool_handle_license_vars": {
    "duration": 2.2327167987823486,
    "status": "PASSED"
   },
   "recipetool.RecipetoolTests.test_recipetool_load_plugin": {
    "duration": 9.180311679840088,
    "status": "PASSED"
   },
   "recipetool.RecipetoolTests.test_recipetool_split_pkg_licenses": {
    "duration": 0.01714181900024414,
    "status": "PASSED"
   },
   "recipeutils.RecipeUtilsTests.test_patch_recipe_appends": {
    "duration": 0.1667344570159912,
    "status": "PASSED"
   },
   "recipeutils.RecipeUtilsTests.test_patch_recipe_singleappend": {
    "duration": 0.14269351959228516,
    "status": "PASSED"
   },
   "recipeutils.RecipeUtilsTests.test_patch_recipe_varflag": {
    "duration": 0.10157489776611328,
    "status": "PASSED"
   },
   "recipeutils.RecipeUtilsTests.test_split_var_value": {
    "duration": 0.00555872917175293,
    "status": "PASSED"
   },
   "recipeutils.RecipeUtilsTests.test_validate_pn": {
    "duration": 0.005950450897216797,
    "status": "PASSED"
   },
   "reproducible.DiffoscopeTests.test_diffoscope": {
    "log": "Skip by the command line argument \"reproducible\"\n",
    "status": "SKIPPED"
   },
   "reproducible.ReproducibleTests.test_reproducible_builds": {
    "log": "Skip by the command line argument \"reproducible\"\n",
    "status": "SKIPPED"
   },
   "resulttooltests.ResultToolTests.test_can_compare_ltp_tests": {
    "duration": 0.006607532501220703,
    "status": "PASSED"
   },
   "resulttooltests.ResultToolTests.test_can_match_non_static_ptest_names": {
    "duration": 0.004971742630004883,
    "status": "PASSED"
   },
   "resulttooltests.ResultToolTests.test_can_not_compare_non_ltp_tests": {
    "duration": 0.004885435104370117,
    "status": "PASSED"
   },
   "resulttooltests.ResultToolTests.test_junit_empty_testresults": {
    "duration": 0.004964351654052734,
    "status": "PASSED"
   },
   "resulttooltests.ResultToolTests.test_junit_log_attached": {
    "duration": 0.005051374435424805,
    "status": "PASSED"
   },
   "resulttooltests.ResultToolTests.test_junit_log_inline": {
    "duration": 0.005221128463745117,
    "status": "PASSED"
   },
   "resulttooltests.ResultToolTests.test_junit_missing_image_tests": {
    "duration": 0.005074739456176758,
    "status": "PASSED"
   },
   "resulttooltests.ResultToolTests.test_junit_missing_ptests": {
    "duration": 0.004746913909912109,
    "status": "PASSED"
   },
   "resulttooltests.ResultToolTests.test_machine_matches": {
    "duration": 0.004662752151489258,
    "status": "PASSED"
   },
   "resulttooltests.ResultToolTests.test_machine_mismatches": {
    "duration": 0.004728078842163086,
    "status": "PASSED"
   },
   "resulttooltests.ResultToolTests.test_merge_can_merged_results": {
    "duration": 0.004641056060791016,
    "status": "PASSED"
   },
   "resulttooltests.ResultToolTests.test_metadata_matching_is_only_checked_for_relevant_test_type": {
    "duration": 0.004632711410522461,
    "status": "PASSED"
   },
   "resulttooltests.ResultToolTests.test_regression_can_get_regression_base_target_pair": {
    "duration": 0.004715919494628906,
    "status": "PASSED"
   },
   "resulttooltests.ResultToolTests.test_regression_can_get_regression_result": {
    "duration": 0.00475311279296875,
    "status": "PASSED"
   },
   "resulttooltests.ResultToolTests.test_report_can_aggregate_test_result": {
    "duration": 0.004638195037841797,
    "status": "PASSED"
   },
   "resulttooltests.ResultToolTests.test_results_with_matching_metadata_can_be_compared": {
    "duration": 0.0046138763427734375,
    "status": "PASSED"
   },
   "resulttooltests.ResultToolTests.test_results_with_mismatching_metadata_can_not_be_compared": {
    "duration": 0.00460505485534668,
    "status": "PASSED"
   },
   "resulttooltests.ResultToolTests.test_results_without_metadata_can_be_compared": {
    "duration": 0.004735469818115234,
    "status": "PASSED"
   },
   "resulttooltests.ResultToolTests.test_target_result_with_missing_metadata_can_not_be_compared": {
    "duration": 0.004766702651977539,
    "status": "PASSED"
   },
   "retain.Retain.test_retain_always": {
    "duration": 52.69426441192627,
    "status": "PASSED"
   },
   "retain.Retain.test_retain_failure": {
    "duration": 60.57932472229004,
    "status": "PASSED"
   },
   "retain.Retain.test_retain_global": {
    "duration": 93.99391722679138,
    "status": "PASSED"
   },
   "retain.Retain.test_retain_misc": {
    "duration": 104.42702579498291,
    "status": "PASSED"
   },
   "rootfspostcommandstests.ShadowUtilsTidyFiles.test_shadowutils_backup_files": {
    "duration": 37.29822111129761,
    "log": "Testcase skipped as 'tidy_shadowutils_files' rootfs post process command is not the set SORT_PASSWD_POSTPROCESS_COMMAND.\n",
    "status": "SKIPPED"
   },
   "rootfspostcommandstests.ShadowUtilsTidyFiles.test_shadowutils_sorted_files": {
    "duration": 8.054460048675537,
    "log": "Testcase skipped as 'tidy_shadowutils_files' rootfs post process command is not the set SORT_PASSWD_POSTPROCESS_COMMAND.\n",
    "status": "SKIPPED"
   },
   "rpmtests.BitbakeTests.test_rpm_filenames": {
    "duration": 9.301869630813599,
    "status": "PASSED"
   },
   "runcmd.RunCmdTests.test_list_not_found": {
    "duration": 0.010294437408447266,
    "status": "PASSED"
   },
   "runcmd.RunCmdTests.test_list_okay": {
    "duration": 0.034481048583984375,
    "status": "PASSED"
   },
   "runcmd.RunCmdTests.test_log": {
    "duration": 0.008549213409423828,
    "status": "PASSED"
   },
   "runcmd.RunCmdTests.test_log_split": {
    "duration": 0.007929563522338867,
    "status": "PASSED"
   },
   "runcmd.RunCmdTests.test_no_shell": {
    "duration": 0.006905794143676758,
    "status": "PASSED"
   },
   "runcmd.RunCmdTests.test_output": {
    "duration": 0.008038043975830078,
    "status": "PASSED"
   },
   "runcmd.RunCmdTests.test_output_split": {
    "duration": 0.008428335189819336,
    "status": "PASSED"
   },
   "runcmd.RunCmdTests.test_result_assertion": {
    "duration": 0.03322267532348633,
    "status": "PASSED"
   },
   "runcmd.RunCmdTests.test_result_exception": {
    "duration": 0.02292633056640625,
    "status": "PASSED"
   },
   "runcmd.RunCmdTests.test_result_false": {
    "duration": 0.022321224212646484,
    "status": "PASSED"
   },
   "runcmd.RunCmdTests.test_result_okay": {
    "duration": 0.02449488639831543,
    "status": "PASSED"
   },
   "runcmd.RunCmdTests.test_shell": {
    "duration": 0.017607450485229492,
    "status": "PASSED"
   },
   "runcmd.RunCmdTests.test_stdin": {
    "duration": 0.008426904678344727,
    "status": "PASSED"
   },
   "runcmd.RunCmdTests.test_stdin_timeout": {
    "duration": 10.012097597122192,
    "status": "PASSED"
   },
   "runcmd.RunCmdTests.test_timeout": {
    "duration": 10.011863708496094,
    "status": "PASSED"
   },
   "runcmd.RunCmdTests.test_timeout_split": {
    "duration": 10.013322353363037,
    "status": "PASSED"
   },
   "runqemu.RunqemuTests.test_boot_compressed_wic_by_path": {
    "duration": 0.0008568763732910156,
    "log": "wic tests are qemux86-64 specific currently\n",
    "oetags": [
     "runqemu"
    ],
    "status": "SKIPPED"
   },
   "runqemu.RunqemuTests.test_boot_compressed_wic_by_recipe": {
    "duration": 0.0007956027984619141,
    "log": "wic tests are qemux86-64 specific currently\n",
    "oetags": [
     "runqemu"
    ],
    "status": "SKIPPED"
   },
   "runqemu.RunqemuTests.test_boot_deploy": {
    "duration": 100.5948076248169,
    "oetags": [
     "runqemu"
    ],
    "status": "PASSED"
   },
   "runqemu.RunqemuTests.test_boot_deploy_hddimg": {
    "duration": 0.0014586448669433594,
    "log": "Test skipped on aarch64\n",
    "oetags": [
     "runqemu"
    ],
    "status": "SKIPPED"
   },
   "runqemu.RunqemuTests.test_boot_machine": {
    "duration": 25.166078805923462,
    "oetags": [
     "runqemu"
    ],
    "status": "PASSED"
   },
   "runqemu.RunqemuTests.test_boot_machine_ext4": {
    "duration": 25.076679468154907,
    "oetags": [
     "runqemu"
    ],
    "status": "PASSED"
   },
   "runqemu.RunqemuTests.test_boot_machine_iso": {
    "duration": 0.0018613338470458984,
    "log": "Test skipped on aarch64\n",
    "oetags": [
     "runqemu"
    ],
    "status": "SKIPPED"
   },
   "runqemu.RunqemuTests.test_boot_machine_slirp": {
    "duration": 24.230729579925537,
    "oetags": [
     "runqemu"
    ],
    "status": "PASSED"
   },
   "runqemu.RunqemuTests.test_boot_machine_slirp_qcow2": {
    "duration": 0.0031337738037109375,
    "log": "tests are qemux86-64 specific currently\n",
    "oetags": [
     "runqemu"
    ],
    "status": "SKIPPED"
   },
   "runqemu.RunqemuTests.test_boot_qemu_boot": {
    "duration": 22.213727712631226,
    "oetags": [
     "runqemu"
    ],
    "status": "PASSED"
   },
   "runqemu.RunqemuTests.test_boot_recipe_image": {
    "duration": 28.703324794769287,
    "oetags": [
     "runqemu"
    ],
    "status": "PASSED"
   },
   "runqemu.RunqemuTests.test_boot_recipe_image_vdi": {
    "duration": 0.0017962455749511719,
    "log": "tests are qemux86-64 specific currently\n",
    "oetags": [
     "runqemu"
    ],
    "status": "SKIPPED"
   },
   "runqemu.RunqemuTests.test_boot_recipe_image_vmdk": {
    "duration": 0.0014455318450927734,
    "log": "tests are qemux86-64 specific currently\n",
    "oetags": [
     "runqemu"
    ],
    "status": "SKIPPED"
   },
   "runqemu.RunqemuTests.test_boot_rootfs": {
    "duration": 22.7962429523468,
    "oetags": [
     "runqemu"
    ],
    "status": "PASSED"
   },
   "runtime_test.Postinst.test_failing_postinst": {
    "duration": 305.31829595565796,
    "oetags": [
     "runqemu"
    ],
    "status": "PASSED"
   },
   "runtime_test.Postinst.test_postinst_rootfs_and_boot_systemd": {
    "duration": 502.2799119949341,
    "oetags": [
     "runqemu"
    ],
    "status": "PASSED"
   },
   "runtime_test.Postinst.test_postinst_rootfs_and_boot_sysvinit": {
    "duration": 452.1631124019623,
    "oetags": [
     "runqemu"
    ],
    "status": "PASSED"
   },
   "runtime_test.RustKernel.test_kernel_rust_sample": {
    "duration": 101.31033158302307,
    "oetags": [
     "runqemu"
    ],
    "status": "PASSED"
   },
   "runtime_test.SystemTap.test_crosstap_helloworld": {
    "duration": 222.17724013328552,
    "oetags": [
     "runqemu"
    ],
    "status": "PASSED"
   },
   "runtime_test.SystemTap.test_crosstap_pstree": {
    "duration": 54.42092990875244,
    "oetags": [
     "runqemu"
    ],
    "status": "PASSED"
   },
   "runtime_test.SystemTap.test_crosstap_syscalls_by_pid": {
    "duration": 53.24935173988342,
    "oetags": [
     "runqemu"
    ],
    "status": "PASSED"
   },
   "runtime_test.SystemTap.test_crosstap_syscalls_by_proc": {
    "duration": 53.5194947719574,
    "oetags": [
     "runqemu"
    ],
    "status": "PASSED"
   },
   "runtime_test.TestExport.test_testexport_basic": {
    "duration": 90.97365403175354,
    "oetags": [
     "runqemu"
    ],
    "status": "PASSED"
   },
   "runtime_test.TestExport.test_testexport_sdk": {
    "duration": 138.63605761528015,
    "status": "PASSED"
   },
   "runtime_test.TestImage.test_testimage_apt": {
    "duration": 258.14777731895447,
    "oetags": [
     "runqemu"
    ],
    "status": "PASSED"
   },
   "runtime_test.TestImage.test_testimage_dnf": {
    "duration": 232.27979826927185,
    "oetags": [
     "runqemu"
    ],
    "status": "PASSED"
   },
   "runtime_test.TestImage.test_testimage_install": {
    "duration": 192.4428153038025,
    "oetags": [
     "runqemu"
    ],
    "status": "PASSED"
   },
   "runtime_test.TestImage.test_testimage_slirp": {
    "duration": 134.2355077266693,
    "oetags": [
     "runqemu"
    ],
    "status": "PASSED"
   },
   "runtime_test.TestImage.test_testimage_virgl_gtk_sdl": {
    "duration": 0.0014643669128417969,
    "log": "test needs qemux86-64\n",
    "oetags": [
     "runqemu"
    ],
    "status": "SKIPPED"
   },
   "runtime_test.TestImage.test_testimage_virgl_headless": {
    "duration": 0.0017342567443847656,
    "log": "test needs qemux86-64\n",
    "oetags": [
     "runqemu"
    ],
    "status": "SKIPPED"
   },
   "rust.RustStaticMuslTest.test_static_musl_linking": {
    "duration": 74.66317129135132,
    "status": "PASSED"
   },
   "sdk.SDKTests.test_sdk_manifests": {
    "duration": 460.4931843280792,
    "status": "PASSED"
   },
   "sdk.SDKTests.test_sdk_runqemu": {
    "duration": 504.9439821243286,
    "status": "PASSED"
   },
   "selftest.ExternalLayer.test_list_imported": {
    "duration": 0.012915611267089844,
    "status": "PASSED"
   },
   "signing.LockedSignatures.test_locked_signatures": {
    "duration": 160.9267761707306,
    "status": "PASSED"
   },
   "signing.Signing.test_signing_packages": {
    "duration": 175.54323029518127,
    "status": "PASSED"
   },
   "signing.Signing.test_signing_sstate_archive": {
    "duration": 225.45119762420654,
    "status": "PASSED"
   },
   "spdx.SPDX30Check.test_baremetal_helloworld": {
    "duration": 75.57450008392334,
    "status": "PASSED"
   },
   "spdx.SPDX30Check.test_base_files": {
    "duration": 68.51666736602783,
    "status": "PASSED"
   },
   "spdx.SPDX30Check.test_core_image_minimal": {
    "duration": 77.65237283706665,
    "status": "PASSED"
   },
   "spdx.SPDX30Check.test_core_image_minimal_sdk": {
    "duration": 390.64288210868835,
    "status": "PASSED"
   },
   "spdx.SPDX30Check.test_custom_annotation_vars": {
    "duration": 47.55425262451172,
    "status": "PASSED"
   },
   "spdx.SPDX30Check.test_download_location_defensive_handling": {
    "duration": 17.88747787475586,
    "status": "PASSED"
   },
   "spdx.SPDX30Check.test_extra_opts": {
    "duration": 137.9301233291626,
    "status": "PASSED"
   },
   "spdx.SPDX30Check.test_gcc_include_source": {
    "duration": 135.29098105430603,
    "status": "PASSED"
   },
   "spdx.SPDX30Check.test_kernel_config_spdx": {
    "duration": 144.57522201538086,
    "status": "PASSED"
   },
   "spdx.SPDX30Check.test_packageconfig_spdx": {
    "duration": 43.176074504852295,
    "status": "PASSED"
   },
   "spdx.SPDX30Check.test_version_extraction_patterns": {
    "duration": 16.868085861206055,
    "status": "PASSED"
   },
   "spdx.SPDX30Check.test_world_sbom": {
    "duration": 48.71507453918457,
    "status": "PASSED"
   },
   "sstatetests.SStateCacheManagement.test_sstate_cache_management_script_using_machine": {
    "duration": 199.62190341949463,
    "status": "PASSED"
   },
   "sstatetests.SStateCacheManagement.test_sstate_cache_management_script_using_pr_1": {
    "duration": 78.19449353218079,
    "status": "PASSED"
   },
   "sstatetests.SStateCacheManagement.test_sstate_cache_management_script_using_pr_2": {
    "duration": 108.78947305679321,
    "status": "PASSED"
   },
   "sstatetests.SStateCacheManagement.test_sstate_cache_management_script_using_pr_3": {
    "duration": 169.39211654663086,
    "status": "PASSED"
   },
   "sstatetests.SStateCleanup.test_cleansstate_task_distro_nonspecific": {
    "duration": 61.66543531417847,
    "status": "PASSED"
   },
   "sstatetests.SStateCleanup.test_cleansstate_task_distro_specific": {
    "duration": 67.47425580024719,
    "status": "PASSED"
   },
   "sstatetests.SStateCleanup.test_cleansstate_task_distro_specific_nonspecific": {
    "duration": 62.82032918930054,
    "status": "PASSED"
   },
   "sstatetests.SStateCreation.test_sstate_creation_distro_nonspecific": {
    "duration": 68.24453139305115,
    "status": "PASSED"
   },
   "sstatetests.SStateCreation.test_sstate_creation_distro_specific": {
    "duration": 58.01039004325867,
    "status": "PASSED"
   },
   "sstatetests.SStateDistroTests.test_rebuild_distro_specific_sstate_cross_native_targets": {
    "duration": 78.38538408279419,
    "status": "PASSED"
   },
   "sstatetests.SStateDistroTests.test_rebuild_distro_specific_sstate_cross_target": {
    "duration": 76.8888988494873,
    "status": "PASSED"
   },
   "sstatetests.SStateDistroTests.test_rebuild_distro_specific_sstate_native_target": {
    "duration": 74.30474710464478,
    "status": "PASSED"
   },
   "sstatetests.SStateFindSiginfo.test_sstate_compare_sigfiles_and_find_siginfo": {
    "duration": 345.9669725894928,
    "status": "PASSED"
   },
   "sstatetests.SStateHashSameSigs.test_sstate_32_64_same_hash": {
    "duration": 121.41042804718018,
    "status": "PASSED"
   },
   "sstatetests.SStateHashSameSigs.test_sstate_nativelsbstring_same_hash": {
    "duration": 143.13623905181885,
    "status": "PASSED"
   },
   "sstatetests.SStateHashSameSigs.test_sstate_sdk_arch_same_hash": {
    "duration": 140.13391375541687,
    "status": "PASSED"
   },
   "sstatetests.SStateHashSameSigs2.test_sstate_allarch_samesigs": {
    "duration": 175.3649547100067,
    "status": "PASSED"
   },
   "sstatetests.SStateHashSameSigs2.test_sstate_nativesdk_samesigs_multilib": {
    "duration": 220.73811101913452,
    "status": "PASSED"
   },
   "sstatetests.SStateHashSameSigs3.test_sstate_multilib_or_not_native_samesigs": {
    "duration": 112.1859118938446,
    "status": "PASSED"
   },
   "sstatetests.SStateHashSameSigs3.test_sstate_sametune_samesigs": {
    "duration": 297.5638415813446,
    "status": "PASSED"
   },
   "sstatetests.SStateHashSameSigs4.test_sstate_movelayer_samesigs": {
    "duration": 115.513352394104,
    "status": "PASSED"
   },
   "sstatetests.SStateHashSameSigs4.test_sstate_noop_samesigs": {
    "duration": 197.5336892604828,
    "status": "PASSED"
   },
   "sstatetests.SStatePrintdiff.test_gcc_runtime_vs_gcc_source": {
    "duration": 780.5572106838226,
    "status": "PASSED"
   },
   "sstatetests.SStatePrintdiff.test_image_minimal_vs_base_do_configure": {
    "duration": 840.0941233634949,
    "status": "PASSED"
   },
   "sstatetests.SStatePrintdiff.test_image_minimal_vs_perlcross": {
    "duration": 395.0926387310028,
    "status": "PASSED"
   },
   "sstatetests.SStateTests.test_autorev_sstate_works": {
    "duration": 95.29376816749573,
    "status": "PASSED"
   },
   "sysroot.SysrootTests.test_sysroot_cleanup": {
    "duration": 85.42703294754028,
    "status": "PASSED"
   },
   "sysroot.SysrootTests.test_sysroot_la": {
    "duration": 34.26535201072693,
    "status": "PASSED"
   },
   "sysroot.SysrootTests.test_sysroot_max_shebang": {
    "duration": 17.459341764450073,
    "status": "PASSED"
   },
   "sysroot.SysrootTests.test_sysroot_pkgconfig": {
    "duration": 33.88905429840088,
    "status": "PASSED"
   },
   "systemd_boot.Systemdboot.test_efi_systemdboot_images_can_be_built": {
    "duration": 170.03429889678955,
    "status": "PASSED"
   },
   "tinfoil.TinfoilTests.test_datastore_operations": {
    "duration": 1.0256779193878174,
    "status": "PASSED"
   },
   "tinfoil.TinfoilTests.test_expand": {
    "duration": 0.5106949806213379,
    "status": "PASSED"
   },
   "tinfoil.TinfoilTests.test_getvar": {
    "duration": 1.013707160949707,
    "status": "PASSED"
   },
   "tinfoil.TinfoilTests.test_getvar_bb_origenv": {
    "duration": 1.0121924877166748,
    "status": "PASSED"
   },
   "tinfoil.TinfoilTests.test_list_recipes": {
    "duration": 5.736025333404541,
    "status": "PASSED"
   },
   "tinfoil.TinfoilTests.test_parse_recipe": {
    "duration": 4.853729724884033,
    "status": "PASSED"
   },
   "tinfoil.TinfoilTests.test_parse_recipe_copy_expand": {
    "duration": 5.411679744720459,
    "status": "PASSED"
   },
   "tinfoil.TinfoilTests.test_parse_recipe_custom_data": {
    "duration": 4.802682399749756,
    "status": "PASSED"
   },
   "tinfoil.TinfoilTests.test_parse_virtual_recipe": {
    "duration": 5.374887466430664,
    "status": "PASSED"
   },
   "tinfoil.TinfoilTests.test_parse_virtual_recipe_custom_data": {
    "duration": 5.4127795696258545,
    "status": "PASSED"
   },
   "tinfoil.TinfoilTests.test_setvariable_clean": {
    "duration": 2.2707064151763916,
    "status": "PASSED"
   },
   "tinfoil.TinfoilTests.test_variable_history": {
    "duration": 4.930105447769165,
    "status": "PASSED"
   },
   "tinfoil.TinfoilTests.test_wait_event": {
    "duration": 2.0055572986602783,
    "status": "PASSED"
   },
   "toolchain.ToolchainTests.test_toolchain_switching": {
    "duration": 142.31008124351501,
    "status": "PASSED"
   },
   "uboot.UBootConfigTest.test_uboot_config_extract": {
    "duration": 36.31346106529236,
    "status": "PASSED"
   },
   "uboot.UBootConfigTest.test_uboot_config_extract_error_missing_config": {
    "duration": 35.846843242645264,
    "status": "PASSED"
   },
   "uboot.UBootConfigTest.test_uboot_config_extract_error_nothing_set": {
    "duration": 41.014748334884644,
    "status": "PASSED"
   },
   "uboot.UBootConfigTest.test_uboot_config_extract_error_set_both_config_and_machine": {
    "duration": 37.11193251609802,
    "status": "PASSED"
   },
   "uboot.UBootConfigTest.test_uboot_config_extract_error_set_uboot_config_binary": {
    "duration": 37.2943754196167,
    "status": "PASSED"
   },
   "uboot.UBootConfigTest.test_uboot_config_extract_error_set_uboot_config_fragments": {
    "duration": 37.96881866455078,
    "status": "PASSED"
   },
   "uboot.UBootConfigTest.test_uboot_config_extract_error_set_uboot_config_image_fstypes": {
    "duration": 36.62091135978699,
    "status": "PASSED"
   },
   "uboot.UBootConfigTest.test_uboot_config_extract_error_set_uboot_config_make_opts": {
    "duration": 36.196341037750244,
    "status": "PASSED"
   },
   "uboot.UBootConfigTest.test_uboot_config_extract_legacy": {
    "duration": 45.30575108528137,
    "status": "PASSED"
   },
   "uboot.UBootConfigTest.test_uboot_config_extract_single_config": {
    "duration": 42.59299969673157,
    "status": "PASSED"
   },
   "uboot.UBootTest.test_boot_uboot": {
    "duration": 97.47507452964783,
    "oetags": [
     "runqemu"
    ],
    "status": "PASSED"
   },
   "uboot.UBootTest.test_boot_uboot_kvm_to_full_target": {
    "duration": 137.45108938217163,
    "oetags": [
     "runqemu"
    ],
    "status": "PASSED"
   },
   "uboot.UBootTest.test_uboot_config_initial_env_binary": {
    "duration": 53.3363471031189,
    "status": "PASSED"
   },
   "uboot.UBootTest.test_uboot_initial_env_binary": {
    "duration": 48.900676012039185,
    "status": "PASSED"
   },
   "uki.UkiTest.test_uki_boot_systemd": {
    "duration": 0.0012552738189697266,
    "log": "Test skipped on aarch64\n",
    "oetags": [
     "runqemu"
    ],
    "status": "SKIPPED"
   },
   "uki.UkiTest.test_uki_sysvinit": {
    "duration": 0.0017523765563964844,
    "log": "Test skipped on aarch64\n",
    "oetags": [
     "runqemu"
    ],
    "status": "SKIPPED"
   },
   "usergrouptests.UserGroupTests.test_add_task_between_p_sysroot_and_package": {
    "duration": 49.117514848709106,
    "status": "PASSED"
   },
   "usergrouptests.UserGroupTests.test_group_from_dep_package": {
    "duration": 34.75776720046997,
    "status": "PASSED"
   },
   "usergrouptests.UserGroupTests.test_postinst_order": {
    "duration": 12.540102243423462,
    "status": "PASSED"
   },
   "usergrouptests.UserGroupTests.test_static_useradd_from_dynamic": {
    "duration": 185.44703769683838,
    "status": "PASSED"
   },
   "usergrouptests.UserGroupTests.test_useradd_depends_only": {
    "duration": 11.841540098190308,
    "status": "PASSED"
   },
   "wic.CLITests.test_createhelp": {
    "duration": 74.86406803131104,
    "status": "PASSED"
   },
   "wic.CLITests.test_help": {
    "duration": 4.4885241985321045,
    "status": "PASSED"
   },
   "wic.CLITests.test_help_create": {
    "duration": 5.162757396697998,
    "status": "PASSED"
   },
   "wic.CLITests.test_help_kickstart": {
    "duration": 4.59099006652832,
    "status": "PASSED"
   },
   "wic.CLITests.test_help_list": {
    "duration": 4.758148670196533,
    "status": "PASSED"
   },
   "wic.CLITests.test_help_overview": {
    "duration": 5.977133512496948,
    "status": "PASSED"
   },
   "wic.CLITests.test_help_plugins": {
    "duration": 4.49443507194519,
    "status": "PASSED"
   },
   "wic.CLITests.test_list_images": {
    "duration": 9.911431550979614,
    "status": "PASSED"
   },
   "wic.CLITests.test_list_source_plugins": {
    "duration": 10.186690330505371,
    "status": "PASSED"
   },
   "wic.CLITests.test_listed_images_help": {
    "duration": 85.93664193153381,
    "status": "PASSED"
   },
   "wic.CLITests.test_listhelp": {
    "duration": 5.4212799072265625,
    "status": "PASSED"
   },
   "wic.CLITests.test_no_command": {
    "duration": 4.688819169998169,
    "status": "PASSED"
   },
   "wic.CLITests.test_unsupported_subcommand": {
    "duration": 4.271082878112793,
    "status": "PASSED"
   },
   "wic.CLITests.test_version": {
    "duration": 5.016786098480225,
    "status": "PASSED"
   },
   "wic.ModifyTests.test_wic_cp": {
    "duration": 166.40971493721008,
    "status": "PASSED"
   },
   "wic.ModifyTests.test_wic_cp_ext": {
    "duration": 79.88358449935913,
    "status": "PASSED"
   },
   "wic.ModifyTests.test_wic_ls": {
    "duration": 49.17835235595703,
    "status": "PASSED"
   },
   "wic.ModifyTests.test_wic_ls_ext": {
    "duration": 45.34808683395386,
    "status": "PASSED"
   },
   "wic.ModifyTests.test_wic_rm": {
    "duration": 61.048298835754395,
    "status": "PASSED"
   },
   "wic.ModifyTests.test_wic_rm_ext": {
    "duration": 63.30070972442627,
    "status": "PASSED"
   },
   "wic.Wic.test_bootloader_config": {
    "duration": 0.0016009807586669922,
    "log": "Test skipped on aarch64\n",
    "status": "SKIPPED"
   },
   "wic.Wic.test_build_artifacts": {
    "duration": 0.0023615360260009766,
    "log": "Test skipped on aarch64\n",
    "status": "SKIPPED"
   },
   "wic.Wic.test_build_image_name": {
    "duration": 151.6431827545166,
    "status": "PASSED"
   },
   "wic.Wic.test_build_rootfs_long": {
    "duration": 51.703293800354004,
    "status": "PASSED"
   },
   "wic.Wic.test_build_rootfs_short": {
    "duration": 49.59030318260193,
    "status": "PASSED"
   },
   "wic.Wic.test_change_directory": {
    "duration": 38.888336420059204,
    "status": "PASSED"
   },
   "wic.Wic.test_change_directory_errors": {
    "duration": 62.70362114906311,
    "status": "PASSED"
   },
   "wic.Wic.test_compress_bzip2": {
    "duration": 39.31951928138733,
    "status": "PASSED"
   },
   "wic.Wic.test_compress_gzip": {
    "duration": 38.91076731681824,
    "status": "PASSED"
   },
   "wic.Wic.test_compress_xz": {
    "duration": 40.76716756820679,
    "status": "PASSED"
   },
   "wic.Wic.test_debug_long": {
    "duration": 35.631638050079346,
    "status": "PASSED"
   },
   "wic.Wic.test_debug_short": {
    "duration": 36.6182656288147,
    "status": "PASSED"
   },
   "wic.Wic.test_default_output_dir": {
    "duration": 0.0006871223449707031,
    "log": "Test skipped on aarch64\n",
    "status": "SKIPPED"
   },
   "wic.Wic.test_efi_bootpart": {
    "duration": 88.09670829772949,
    "status": "PASSED"
   },
   "wic.Wic.test_exclude_path": {
    "duration": 51.05081343650818,
    "status": "PASSED"
   },
   "wic.Wic.test_exclude_path_errors": {
    "duration": 67.73919034004211,
    "status": "PASSED"
   },
   "wic.Wic.test_exclude_path_with_extra_space": {
    "duration": 135.20605373382568,
    "status": "PASSED"
   },
   "wic.Wic.test_extra_space": {
    "duration": 38.04670572280884,
    "status": "PASSED"
   },
   "wic.Wic.test_gpt_image": {
    "duration": 0.001417398452758789,
    "log": "Test skipped on aarch64\n",
    "status": "SKIPPED"
   },
   "wic.Wic.test_grub_install_pcbios": {
    "duration": 0.0016832351684570312,
    "log": "Test skipped on aarch64\n",
    "status": "SKIPPED"
   },
   "wic.Wic.test_include_path": {
    "duration": 45.08304786682129,
    "status": "PASSED"
   },
   "wic.Wic.test_include_path_embeded": {
    "duration": 50.79152011871338,
    "status": "PASSED"
   },
   "wic.Wic.test_include_path_errors": {
    "duration": 109.51009178161621,
    "status": "PASSED"
   },
   "wic.Wic.test_iso_image": {
    "duration": 0.00160980224609375,
    "log": "Test skipped on aarch64\n",
    "status": "SKIPPED"
   },
   "wic.Wic.test_kernel_install": {
    "duration": 55.365535259246826,
    "status": "PASSED"
   },
   "wic.Wic.test_mkefidisk": {
    "duration": 36.67498016357422,
    "status": "PASSED"
   },
   "wic.Wic.test_no_fstab_update": {
    "duration": 53.42115640640259,
    "status": "PASSED"
   },
   "wic.Wic.test_no_fstab_update_errors": {
    "duration": 55.249149322509766,
    "status": "PASSED"
   },
   "wic.Wic.test_no_table": {
    "duration": 30.30193829536438,
    "status": "PASSED"
   },
   "wic.Wic.test_partition_hidden_attributes": {
    "duration": 36.517950773239136,
    "status": "PASSED"
   },
   "wic.Wic.test_permissions": {
    "duration": 345.6472690105438,
    "status": "PASSED"
   },
   "wic.Wic.test_qemux86_directdisk": {
    "duration": 0.0018687248229980469,
    "log": "Test skipped on aarch64\n",
    "status": "SKIPPED"
   },
   "wic.Wic.test_rootfs_artifacts": {
    "duration": 0.0035991668701171875,
    "log": "Test skipped on aarch64\n",
    "status": "SKIPPED"
   },
   "wic.Wic.test_rootfs_indirect_recipes": {
    "duration": 0.004243612289428711,
    "log": "Test skipped on aarch64\n",
    "status": "SKIPPED"
   },
   "wic.Wic.test_sdimage_bootpart": {
    "duration": 69.72936677932739,
    "status": "PASSED"
   },
   "wic.Wic.test_skip_build_check_long": {
    "duration": 30.771754264831543,
    "status": "PASSED"
   },
   "wic.Wic.test_skip_build_check_short": {
    "duration": 31.365330934524536,
    "status": "PASSED"
   },
   "wic.Wic.test_skip_kernel_install": {
    "duration": 44.662619829177856,
    "status": "PASSED"
   },
   "wic.Wic.test_systemd_bootdisk": {
    "duration": 118.88073682785034,
    "status": "PASSED"
   },
   "wic.Wic.test_wic_sector_size_cli": {
    "duration": 93.39032888412476,
    "status": "PASSED"
   },
   "wic.Wic.test_wic_sector_size_env": {
    "duration": 95.83672523498535,
    "status": "PASSED"
   },
   "wic.Wic.test_wrong_compressor": {
    "duration": 5.098967790603638,
    "status": "PASSED"
   },
   "wic.Wic2.test_biosplusefi_plugin": {
    "duration": 0.0014221668243408203,
    "log": "Test skipped on aarch64\n",
    "status": "SKIPPED"
   },
   "wic.Wic2.test_biosplusefi_plugin_qemu": {
    "duration": 0.0019757747650146484,
    "log": "Test skipped on aarch64\n",
    "oetags": [
     "runqemu"
    ],
    "status": "SKIPPED"
   },
   "wic.Wic2.test_bmap_long": {
    "duration": 187.53228783607483,
    "status": "PASSED"
   },
   "wic.Wic2.test_bmap_short": {
    "duration": 35.36357498168945,
    "status": "PASSED"
   },
   "wic.Wic2.test_diskid_on_gpt_partition": {
    "duration": 41.37475037574768,
    "status": "PASSED"
   },
   "wic.Wic2.test_diskid_on_msdos_partition": {
    "duration": 42.53389096260071,
    "status": "PASSED"
   },
   "wic.Wic2.test_efi_plugin_plain_systemd_boot_qemu_aarch64": {
    "duration": 219.13934111595154,
    "oetags": [
     "runqemu"
    ],
    "status": "PASSED"
   },
   "wic.Wic2.test_efi_plugin_plain_systemd_boot_qemu_x86": {
    "duration": 0.0015909671783447266,
    "log": "Test skipped on aarch64\n",
    "oetags": [
     "runqemu"
    ],
    "status": "SKIPPED"
   },
   "wic.Wic2.test_efi_plugin_unified_kernel_image_qemu": {
    "duration": 0.0024008750915527344,
    "log": "Test skipped on aarch64\n",
    "oetags": [
     "runqemu"
    ],
    "status": "SKIPPED"
   },
   "wic.Wic2.test_empty_plugin": {
    "duration": 140.42660236358643,
    "status": "PASSED"
   },
   "wic.Wic2.test_empty_zeroize_plugin": {
    "duration": 63.962366819381714,
    "status": "PASSED"
   },
   "wic.Wic2.test_expand_mbr_image": {
    "duration": 0.0016262531280517578,
    "log": "Test skipped on aarch64\n",
    "oetags": [
     "runqemu"
    ],
    "status": "SKIPPED"
   },
   "wic.Wic2.test_extra_filesystem_space": {
    "duration": 41.8915114402771,
    "status": "PASSED"
   },
   "wic.Wic2.test_extra_partition_plugin": {
    "duration": 128.56974816322327,
    "status": "PASSED"
   },
   "wic.Wic2.test_extra_partition_space": {
    "duration": 54.422030210494995,
    "status": "PASSED"
   },
   "wic.Wic2.test_fixed_size": {
    "duration": 47.25954461097717,
    "status": "PASSED"
   },
   "wic.Wic2.test_fixed_size_error": {
    "duration": 41.362154483795166,
    "status": "PASSED"
   },
   "wic.Wic2.test_fs_types": {
    "duration": 41.356075048446655,
    "status": "PASSED"
   },
   "wic.Wic2.test_gpt_partition_name": {
    "duration": 130.13414359092712,
    "status": "PASSED"
   },
   "wic.Wic2.test_image_bootpart_globbed": {
    "duration": 85.52570247650146,
    "status": "PASSED"
   },
   "wic.Wic2.test_image_env": {
    "duration": 71.77260279655457,
    "status": "PASSED"
   },
   "wic.Wic2.test_image_vars_dir_long": {
    "duration": 13.057206630706787,
    "status": "PASSED"
   },
   "wic.Wic2.test_image_vars_dir_short": {
    "duration": 13.271169185638428,
    "status": "PASSED"
   },
   "wic.Wic2.test_kickstart_parser": {
    "duration": 40.87478256225586,
    "status": "PASSED"
   },
   "wic.Wic2.test_mkfs_extraopts": {
    "duration": 39.65012049674988,
    "status": "PASSED"
   },
   "wic.Wic2.test_offset": {
    "duration": 219.74015545845032,
    "status": "PASSED"
   },
   "wic.Wic2.test_qemu": {
    "duration": 0.0022263526916503906,
    "log": "Test skipped on aarch64\n",
    "oetags": [
     "runqemu"
    ],
    "status": "SKIPPED"
   },
   "wic.Wic2.test_qemu_efi": {
    "duration": 0.003056764602661133,
    "log": "Test skipped on aarch64\n",
    "oetags": [
     "runqemu"
    ],
    "status": "SKIPPED"
   },
   "wic.Wic2.test_rawcopy_plugin": {
    "duration": 133.8059322834015,
    "status": "PASSED"
   },
   "wic.Wic2.test_rawcopy_plugin_qemu": {
    "duration": 0.0018780231475830078,
    "log": "Test skipped on aarch64\n",
    "oetags": [
     "runqemu"
    ],
    "status": "SKIPPED"
   },
   "wic.Wic2.test_rawcopy_plugin_unpack": {
    "duration": 136.67465209960938,
    "status": "PASSED"
   },
   "wic.Wic2.test_uefi_kernel": {
    "duration": 132.78969717025757,
    "status": "PASSED"
   },
   "wic.Wic2.test_wic_image_type": {
    "duration": 0.0016300678253173828,
    "log": "Test skipped on aarch64\n",
    "status": "SKIPPED"
   },
   "wrapper.WrapperTests.test_shebang_wrapper": {
    "duration": 57.78724718093872,
    "status": "PASSED"
   },
   "yoctotestresultsquerytests.TestResultsQueryTests.test_create_workdir": {
    "duration": 128.66928029060364,
    "status": "PASSED"
   },
   "yoctotestresultsquerytests.TestResultsQueryTests.test_get_sha1": {
    "duration": 0.18460583686828613,
    "status": "PASSED"
   }
  }
 }
}