{
 "oeselftest_ubuntu-24.04_qemuarm64_20260623125201": {
  "configuration": {
   "HOST_DISTRO": "ubuntu-24.04",
   "HOST_NAME": "ubuntu2404-vk-arm2",
   "LAYERS": {
    "meta": {
     "branch": "mathieu/master-next",
     "commit": "10ace5cb9e4b9b323c3f713d3b15b6554681af2f",
     "commit_count": 67575,
     "commit_time": 1782217450
    },
    "meta-poky": {
     "branch": "contrib/mathieu/master-next",
     "commit": "366fa2f21bfb0d9c4de492e0204a0dd38ce241ab",
     "commit_count": 1805,
     "commit_time": 1781777642
    },
    "meta-selftest": {
     "branch": "mathieu/master-next",
     "commit": "10ace5cb9e4b9b323c3f713d3b15b6554681af2f",
     "commit_count": 67575,
     "commit_time": 1782217450
    },
    "meta-yocto-bsp": {
     "branch": "contrib/mathieu/master-next",
     "commit": "366fa2f21bfb0d9c4de492e0204a0dd38ce241ab",
     "commit_count": 1805,
     "commit_time": 1781777642
    }
   },
   "MACHINE": "qemuarm64",
   "OESELFTEST_METADATA": {
    "exclude_tags": [
     "yocto-mirrors",
     "machine",
     "toolchain-user",
     "toolchain-system"
    ],
    "run_all_tests": true,
    "run_tests": null,
    "select_tags": null,
    "skips": [
     "distrodata.Distrodata.test_checkpkg",
     "reproducible"
    ]
   },
   "STARTTIME": "20260623125201",
   "TEST_TYPE": "oeselftest"
  },
  "result": {
   "archiver.Archiver.test_archiver_allows_to_filter_on_recipe_name": {
    "duration": 60.2073175907135,
    "status": "PASSED"
   },
   "archiver.Archiver.test_archiver_cleanup": {
    "duration": 107.58760714530945,
    "status": "PASSED"
   },
   "archiver.Archiver.test_archiver_filters_by_type": {
    "duration": 46.910512924194336,
    "status": "PASSED"
   },
   "archiver.Archiver.test_archiver_filters_by_type_and_name": {
    "duration": 47.867947578430176,
    "status": "PASSED"
   },
   "archiver.Archiver.test_archiver_mode_configured": {
    "duration": 46.435903787612915,
    "status": "PASSED"
   },
   "archiver.Archiver.test_archiver_mode_diff": {
    "duration": 49.05110192298889,
    "status": "PASSED"
   },
   "archiver.Archiver.test_archiver_mode_dumpdata": {
    "duration": 15.311354398727417,
    "status": "PASSED"
   },
   "archiver.Archiver.test_archiver_mode_mirror": {
    "duration": 44.06575417518616,
    "status": "PASSED"
   },
   "archiver.Archiver.test_archiver_mode_mirror_combined": {
    "duration": 64.32877802848816,
    "status": "PASSED"
   },
   "archiver.Archiver.test_archiver_mode_mirror_excludes": {
    "duration": 50.256133794784546,
    "status": "PASSED"
   },
   "archiver.Archiver.test_archiver_mode_mirror_gitsm": {
    "duration": 29.145912170410156,
    "status": "PASSED"
   },
   "archiver.Archiver.test_archiver_mode_mirror_gitsm_shallow": {
    "duration": 75.11537003517151,
    "status": "PASSED"
   },
   "archiver.Archiver.test_archiver_mode_original": {
    "duration": 50.72700595855713,
    "status": "PASSED"
   },
   "archiver.Archiver.test_archiver_mode_patched": {
    "duration": 16.509697198867798,
    "status": "PASSED"
   },
   "archiver.Archiver.test_archiver_mode_recipe": {
    "duration": 54.09334707260132,
    "status": "PASSED"
   },
   "archiver.Archiver.test_archiver_multiconfig_shared_unpack_and_patch": {
    "duration": 213.55271005630493,
    "status": "PASSED"
   },
   "archiver.Archiver.test_archiver_srpm_mode": {
    "duration": 178.12841725349426,
    "status": "PASSED"
   },
   "barebox.BareboxTest.test_boot_barebox": {
    "duration": 6124.41884469986,
    "oetags": [
     "runqemu"
    ],
    "status": "PASSED"
   },
   "baremetal.BaremetalTest.test_baremetal": {
    "duration": 6145.458868741989,
    "status": "PASSED"
   },
   "bbclasses.Systemd.test_systemd_in_distro": {
    "duration": 121.10510158538818,
    "status": "PASSED"
   },
   "bbclasses.Systemd.test_sysvinit_in_distro": {
    "duration": 57.87227153778076,
    "status": "PASSED"
   },
   "bblayers.BitbakeConfigBuild.test_enable_disable_builtin_fragments": {
    "duration": 24.70473027229309,
    "status": "PASSED"
   },
   "bblayers.BitbakeConfigBuild.test_enable_disable_fragments": {
    "duration": 22.247880697250366,
    "status": "PASSED"
   },
   "bblayers.BitbakeConfigBuild.test_show_fragment": {
    "duration": 2.021461009979248,
    "status": "PASSED"
   },
   "bblayers.BitbakeLayers.test_bitbakelayers_add_remove": {
    "duration": 13.578659534454346,
    "status": "PASSED"
   },
   "bblayers.BitbakeLayers.test_bitbakelayers_createlayer": {
    "duration": 8.837964534759521,
    "status": "PASSED"
   },
   "bblayers.BitbakeLayers.test_bitbakelayers_flatten": {
    "duration": 49.809178590774536,
    "status": "PASSED"
   },
   "bblayers.BitbakeLayers.test_bitbakelayers_layerindexshowdepends": {
    "duration": 1.8724007606506348,
    "status": "PASSED"
   },
   "bblayers.BitbakeLayers.test_bitbakelayers_setup": {
    "duration": 42.594441652297974,
    "status": "PASSED"
   },
   "bblayers.BitbakeLayers.test_bitbakelayers_showappends": {
    "duration": 10.192493438720703,
    "status": "PASSED"
   },
   "bblayers.BitbakeLayers.test_bitbakelayers_showcrossdepends": {
    "duration": 26.7945556640625,
    "status": "PASSED"
   },
   "bblayers.BitbakeLayers.test_bitbakelayers_showlayers": {
    "duration": 0.8724942207336426,
    "status": "PASSED"
   },
   "bblayers.BitbakeLayers.test_bitbakelayers_showoverlayed": {
    "duration": 5.768699407577515,
    "status": "PASSED"
   },
   "bblayers.BitbakeLayers.test_bitbakelayers_showrecipes": {
    "duration": 32.026612758636475,
    "status": "PASSED"
   },
   "bblayers.BitbakeLayers.test_bitbakelayers_updatelayer": {
    "duration": 7.64892578125,
    "status": "PASSED"
   },
   "bblayers.BitbakeLayers.test_validate_bitbake_setup_default_registry": {
    "duration": 2.4830565452575684,
    "status": "PASSED"
   },
   "bblayers.BitbakeLayers.test_validate_examplelayersjson": {
    "duration": 0.3388185501098633,
    "status": "PASSED"
   },
   "bblock.BBLock.test_lock_architecture_specific": {
    "duration": 125.80897927284241,
    "status": "PASSED"
   },
   "bblock.BBLock.test_lock_multiple_recipe_single_task": {
    "duration": 2048.942898750305,
    "status": "PASSED"
   },
   "bblock.BBLock.test_lock_single_recipe_all_tasks": {
    "duration": 1231.5288362503052,
    "status": "PASSED"
   },
   "bblock.BBLock.test_lock_single_recipe_multiple_tasks": {
    "duration": 643.4839973449707,
    "status": "PASSED"
   },
   "bblock.BBLock.test_lock_single_recipe_single_task": {
    "duration": 730.2556457519531,
    "status": "PASSED"
   },
   "bblogging.BitBakeLogging.test_python_exec_func_python_loggingA": {
    "duration": 62.2218861579895,
    "status": "PASSED"
   },
   "bblogging.BitBakeLogging.test_python_exec_func_python_loggingB": {
    "duration": 49.95941424369812,
    "status": "PASSED"
   },
   "bblogging.BitBakeLogging.test_python_exec_func_python_loggingC": {
    "duration": 41.534478187561035,
    "status": "PASSED"
   },
   "bblogging.BitBakeLogging.test_python_exec_func_python_loggingD": {
    "duration": 16.79463505744934,
    "status": "PASSED"
   },
   "bblogging.BitBakeLogging.test_python_exec_func_shell_loggingA": {
    "duration": 17.477799892425537,
    "status": "PASSED"
   },
   "bblogging.BitBakeLogging.test_python_exec_func_shell_loggingB": {
    "duration": 16.50883936882019,
    "status": "PASSED"
   },
   "bblogging.BitBakeLogging.test_python_exec_func_shell_loggingC": {
    "duration": 15.044137716293335,
    "status": "PASSED"
   },
   "bblogging.BitBakeLogging.test_python_exec_func_shell_loggingD": {
    "duration": 16.375000715255737,
    "status": "PASSED"
   },
   "bblogging.BitBakeLogging.test_python_exit_loggingA": {
    "duration": 15.821060419082642,
    "status": "PASSED"
   },
   "bblogging.BitBakeLogging.test_python_exit_loggingB": {
    "duration": 15.242648124694824,
    "status": "PASSED"
   },
   "bblogging.BitBakeLogging.test_python_exit_loggingC": {
    "duration": 14.291303396224976,
    "status": "PASSED"
   },
   "bblogging.BitBakeLogging.test_python_exit_loggingD": {
    "duration": 14.364055871963501,
    "status": "PASSED"
   },
   "bblogging.BitBakeLogging.test_python_fatal_loggingA": {
    "duration": 16.35052227973938,
    "status": "PASSED"
   },
   "bblogging.BitBakeLogging.test_python_fatal_loggingB": {
    "duration": 16.916139125823975,
    "status": "PASSED"
   },
   "bblogging.BitBakeLogging.test_python_fatal_loggingC": {
    "duration": 17.247652292251587,
    "status": "PASSED"
   },
   "bblogging.BitBakeLogging.test_python_fatal_loggingD": {
    "duration": 15.510535955429077,
    "status": "PASSED"
   },
   "bblogging.BitBakeLogging.test_shell_loggingA": {
    "duration": 14.89369511604309,
    "status": "PASSED"
   },
   "bblogging.BitBakeLogging.test_shell_loggingB": {
    "duration": 16.385879039764404,
    "status": "PASSED"
   },
   "bblogging.BitBakeLogging.test_shell_loggingC": {
    "duration": 15.90424370765686,
    "status": "PASSED"
   },
   "bblogging.BitBakeLogging.test_shell_loggingD": {
    "duration": 16.038914442062378,
    "status": "PASSED"
   },
   "bbtests.BitbakeTests.test_bb_env_bb_getvar_equality": {
    "duration": 3.943622350692749,
    "status": "PASSED"
   },
   "bbtests.BitbakeTests.test_bbappend_order": {
    "duration": 56.234036922454834,
    "status": "PASSED"
   },
   "bbtests.BitbakeTests.test_bitbake_g": {
    "duration": 7.002614498138428,
    "status": "PASSED"
   },
   "bbtests.BitbakeTests.test_bitbake_invalid_recipe": {
    "duration": 1.9092521667480469,
    "status": "PASSED"
   },
   "bbtests.BitbakeTests.test_bitbake_invalid_target": {
    "duration": 6.7260894775390625,
    "status": "PASSED"
   },
   "bbtests.BitbakeTests.test_checkuri": {
    "duration": 12.27152132987976,
    "status": "PASSED"
   },
   "bbtests.BitbakeTests.test_continue": {
    "duration": 56.284401655197144,
    "status": "PASSED"
   },
   "bbtests.BitbakeTests.test_dry_run": {
    "duration": 9.366446256637573,
    "status": "PASSED"
   },
   "bbtests.BitbakeTests.test_environment": {
    "duration": 3.4779305458068848,
    "status": "PASSED"
   },
   "bbtests.BitbakeTests.test_event_handler": {
    "duration": 47.47507619857788,
    "status": "PASSED"
   },
   "bbtests.BitbakeTests.test_force_task_1": {
    "duration": 93.6078896522522,
    "status": "PASSED"
   },
   "bbtests.BitbakeTests.test_force_task_2": {
    "duration": 64.15581393241882,
    "status": "PASSED"
   },
   "bbtests.BitbakeTests.test_git_patchtool": {
    "duration": 29.6983904838562,
    "status": "PASSED"
   },
   "bbtests.BitbakeTests.test_git_patchtool2": {
    "duration": 32.006962299346924,
    "status": "PASSED"
   },
   "bbtests.BitbakeTests.test_git_unpack_nonetwork": {
    "duration": 61.39614987373352,
    "status": "PASSED"
   },
   "bbtests.BitbakeTests.test_git_unpack_nonetwork_fail": {
    "duration": 18.866308450698853,
    "status": "PASSED"
   },
   "bbtests.BitbakeTests.test_image_manifest": {
    "duration": 5294.572680234909,
    "status": "PASSED"
   },
   "bbtests.BitbakeTests.test_invalid_patch": {
    "duration": 59.16551232337952,
    "status": "PASSED"
   },
   "bbtests.BitbakeTests.test_invalid_recipe_src_uri": {
    "duration": 6.18709659576416,
    "status": "PASSED"
   },
   "bbtests.BitbakeTests.test_just_parse": {
    "duration": 4.813340902328491,
    "status": "PASSED"
   },
   "bbtests.BitbakeTests.test_local_sstate": {
    "duration": 27.43402123451233,
    "status": "PASSED"
   },
   "bbtests.BitbakeTests.test_non_gplv3": {
    "duration": 1025.2783493995667,
    "status": "PASSED"
   },
   "bbtests.BitbakeTests.test_postfile": {
    "duration": 4.699775457382202,
    "status": "PASSED"
   },
   "bbtests.BitbakeTests.test_prefile": {
    "duration": 7.772891521453857,
    "status": "PASSED"
   },
   "bbtests.BitbakeTests.test_rename_downloaded_file": {
    "duration": 42.93058896064758,
    "status": "PASSED"
   },
   "bbtests.BitbakeTests.test_run_bitbake_from_dir_1": {
    "duration": 4.1972336769104,
    "status": "PASSED"
   },
   "bbtests.BitbakeTests.test_run_bitbake_from_dir_2": {
    "duration": 3.686297655105591,
    "status": "PASSED"
   },
   "bbtests.BitbakeTests.test_run_bitbake_from_dir_3": {
    "duration": 3.885864019393921,
    "status": "PASSED"
   },
   "bbtests.BitbakeTests.test_setscene_only": {
    "duration": 29.728713035583496,
    "status": "PASSED"
   },
   "bbtests.BitbakeTests.test_skip_setscene": {
    "duration": 57.680288553237915,
    "status": "PASSED"
   },
   "bbtests.BitbakeTests.test_unexpanded_variable_in_path": {
    "duration": 41.1975736618042,
    "status": "PASSED"
   },
   "bbtests.BitbakeTests.test_version": {
    "duration": 6.039897203445435,
    "status": "PASSED"
   },
   "bbtests.BitbakeTests.test_warnings_errors": {
    "duration": 1.1062047481536865,
    "status": "PASSED"
   },
   "buildhistory.BuildhistoryTests.test_buildhistory_basic": {
    "duration": 86.03154373168945,
    "status": "PASSED"
   },
   "buildhistory.BuildhistoryTests.test_buildhistory_buildtime_pr_backwards": {
    "duration": 95.07576036453247,
    "status": "PASSED"
   },
   "buildhistory.BuildhistoryTests.test_buildhistory_diff": {
    "duration": 97.75973510742188,
    "status": "PASSED"
   },
   "buildhistory.BuildhistoryTests.test_fileinfo": {
    "duration": 21.616374731063843,
    "status": "PASSED"
   },
   "buildoptions.ArchiverTest.test_arch_work_dir_and_export_source": {
    "duration": 69.49240374565125,
    "status": "PASSED"
   },
   "buildoptions.DiskMonTest.test_stoptask_behavior": {
    "duration": 150.52955436706543,
    "status": "PASSED"
   },
   "buildoptions.ImageOptionsTests.test_ccache_tool": {
    "duration": 199.67160296440125,
    "status": "PASSED"
   },
   "buildoptions.ImageOptionsTests.test_incremental_image_generation": {
    "duration": 5570.735961198807,
    "status": "PASSED"
   },
   "buildoptions.ImageOptionsTests.test_read_only_image": {
    "duration": 773.1090421676636,
    "status": "PASSED"
   },
   "buildoptions.Poisoning.test_poisoning": {
    "duration": 62.75311303138733,
    "status": "PASSED"
   },
   "buildoptions.SanityOptionsTest.test_layer_without_git_dir": {
    "duration": 42.65062952041626,
    "status": "PASSED"
   },
   "buildoptions.SanityOptionsTest.test_options_warnqa_errorqa_switch": {
    "duration": 124.82399702072144,
    "status": "PASSED"
   },
   "buildoptions.ToolchainOptions.test_toolchain_fortran": {
    "duration": 2891.4954245090485,
    "status": "PASSED"
   },
   "c_cpp.CMakeTests.test_cmake_qemu": {
    "duration": 56.41427421569824,
    "status": "PASSED"
   },
   "c_cpp.CMakeTests.test_cmake_qemu_failing": {
    "duration": 61.56915235519409,
    "status": "PASSED"
   },
   "c_cpp.MesonTests.test_meson_qemu": {
    "duration": 66.91223788261414,
    "status": "PASSED"
   },
   "c_cpp.MesonTests.test_meson_qemu_failing": {
    "duration": 71.44139194488525,
    "status": "PASSED"
   },
   "containerimage.ContainerImageTests.test_expected_files": {
    "duration": 5311.286693096161,
    "status": "PASSED"
   },
   "cve_check.CVECheck.test_convert_cve_version": {
    "duration": 0.013626575469970703,
    "status": "PASSED"
   },
   "cve_check.CVECheck.test_parse_cve_from_patch_contents": {
    "duration": 0.005690336227416992,
    "status": "PASSED"
   },
   "cve_check.CVECheck.test_parse_cve_from_patch_filename": {
    "duration": 0.005388498306274414,
    "status": "PASSED"
   },
   "cve_check.CVECheck.test_product_match": {
    "duration": 0.00516057014465332,
    "status": "PASSED"
   },
   "cve_check.CVECheck.test_version_compare": {
    "duration": 0.006621837615966797,
    "status": "PASSED"
   },
   "debuginfod.Debuginfod.test_debuginfod_native": {
    "duration": 82.82062220573425,
    "status": "PASSED"
   },
   "debuginfod.Debuginfod.test_debuginfod_qemu": {
    "duration": 5443.408975839615,
    "oetags": [
     "runqemu"
    ],
    "status": "PASSED"
   },
   "devtool.DevtoolAddTests.test_devtool_add": {
    "duration": 113.31968927383423,
    "status": "PASSED"
   },
   "devtool.DevtoolAddTests.test_devtool_add_binary": {
    "duration": 89.63053727149963,
    "status": "PASSED"
   },
   "devtool.DevtoolAddTests.test_devtool_add_fetch": {
    "duration": 87.38162779808044,
    "status": "PASSED"
   },
   "devtool.DevtoolAddTests.test_devtool_add_fetch_git": {
    "duration": 95.19188046455383,
    "status": "PASSED"
   },
   "devtool.DevtoolAddTests.test_devtool_add_fetch_simple": {
    "duration": 52.35500359535217,
    "status": "PASSED"
   },
   "devtool.DevtoolAddTests.test_devtool_add_git_local": {
    "duration": 61.45708250999451,
    "status": "PASSED"
   },
   "devtool.DevtoolAddTests.test_devtool_add_git_style1": {
    "duration": 59.88239240646362,
    "status": "PASSED"
   },
   "devtool.DevtoolAddTests.test_devtool_add_git_style2": {
    "duration": 62.73032069206238,
    "status": "PASSED"
   },
   "devtool.DevtoolAddTests.test_devtool_add_library": {
    "duration": 83.16755700111389,
    "status": "PASSED"
   },
   "devtool.DevtoolAddTests.test_devtool_add_npm": {
    "duration": 1.4500694274902344,
    "log": "Test needs meta-oe for nodejs\n",
    "status": "SKIPPED"
   },
   "devtool.DevtoolAddTests.test_devtool_add_python_egg_requires": {
    "duration": 51.756776094436646,
    "status": "PASSED"
   },
   "devtool.DevtoolBuildImageTests.test_devtool_build_image": {
    "duration": 5443.902434587479,
    "status": "PASSED"
   },
   "devtool.DevtoolDeployTargetTests.test_devtool_deploy_target": {
    "duration": 336.47061705589294,
    "oetags": [
     "runqemu"
    ],
    "status": "PASSED"
   },
   "devtool.DevtoolExtractTests.test_devtool_extract": {
    "duration": 89.32675957679749,
    "status": "PASSED"
   },
   "devtool.DevtoolExtractTests.test_devtool_extract_virtual": {
    "duration": 53.97747588157654,
    "status": "PASSED"
   },
   "devtool.DevtoolIdeSdkTests.test_devtool_ide_sdk_code_cmake": {
    "duration": 6053.475613832474,
    "oetags": [
     "runqemu"
    ],
    "status": "PASSED"
   },
   "devtool.DevtoolIdeSdkTests.test_devtool_ide_sdk_code_kernel_module": {
    "duration": 824.9575998783112,
    "oetags": [
     "runqemu"
    ],
    "status": "PASSED"
   },
   "devtool.DevtoolIdeSdkTests.test_devtool_ide_sdk_code_meson": {
    "duration": 283.3737518787384,
    "status": "PASSED"
   },
   "devtool.DevtoolIdeSdkTests.test_devtool_ide_sdk_none_qemu": {
    "duration": 683.484356880188,
    "oetags": [
     "runqemu"
    ],
    "status": "PASSED"
   },
   "devtool.DevtoolIdeSdkTests.test_devtool_ide_sdk_plugins": {
    "duration": 76.42710709571838,
    "status": "PASSED"
   },
   "devtool.DevtoolIdeSdkTests.test_devtool_ide_sdk_shared_sysroots": {
    "duration": 85.15684485435486,
    "status": "PASSED"
   },
   "devtool.DevtoolModifyTests.test_devtool_buildclean": {
    "duration": 798.5993275642395,
    "status": "PASSED"
   },
   "devtool.DevtoolModifyTests.test_devtool_modify": {
    "duration": 335.0376148223877,
    "status": "PASSED"
   },
   "devtool.DevtoolModifyTests.test_devtool_modify_git": {
    "duration": 140.51416325569153,
    "status": "PASSED"
   },
   "devtool.DevtoolModifyTests.test_devtool_modify_git_crates_subpath": {
    "duration": 151.82008600234985,
    "status": "PASSED"
   },
   "devtool.DevtoolModifyTests.test_devtool_modify_git_no_extract": {
    "duration": 43.3651704788208,
    "status": "PASSED"
   },
   "devtool.DevtoolModifyTests.test_devtool_modify_go": {
    "duration": 76.14047884941101,
    "status": "PASSED"
   },
   "devtool.DevtoolModifyTests.test_devtool_modify_invalid": {
    "duration": 194.23026394844055,
    "status": "PASSED"
   },
   "devtool.DevtoolModifyTests.test_devtool_modify_localfiles": {
    "duration": 225.420419216156,
    "status": "PASSED"
   },
   "devtool.DevtoolModifyTests.test_devtool_modify_localfiles_only": {
    "duration": 120.04265427589417,
    "status": "PASSED"
   },
   "devtool.DevtoolModifyTests.test_devtool_modify_multiple_sources": {
    "duration": 3009.0869665145874,
    "status": "PASSED"
   },
   "devtool.DevtoolModifyTests.test_devtool_modify_native": {
    "duration": 595.2201161384583,
    "status": "PASSED"
   },
   "devtool.DevtoolModifyTests.test_devtool_modify_nested_gitsm": {
    "duration": 68.18076062202454,
    "status": "PASSED"
   },
   "devtool.DevtoolModifyTests.test_devtool_modify_overrides": {
    "duration": 62.36393094062805,
    "status": "PASSED"
   },
   "devtool.DevtoolModifyTests.test_devtool_modify_virtual": {
    "duration": 60.118816614151,
    "status": "PASSED"
   },
   "devtool.DevtoolResetTests.test_devtool_reset_all": {
    "duration": 264.6974844932556,
    "status": "PASSED"
   },
   "devtool.DevtoolResetTests.test_devtool_reset_re_plus_plus": {
    "duration": 52.01907992362976,
    "status": "PASSED"
   },
   "devtool.DevtoolTests.test_create_workspace": {
    "duration": 8.145278215408325,
    "status": "PASSED"
   },
   "devtool.DevtoolUpdateTests.test_devtool_finish_modify_git_subdir": {
    "duration": 192.03211545944214,
    "status": "PASSED"
   },
   "devtool.DevtoolUpdateTests.test_devtool_git_submodules": {
    "duration": 267.9196045398712,
    "status": "PASSED"
   },
   "devtool.DevtoolUpdateTests.test_devtool_update_recipe": {
    "duration": 75.70214533805847,
    "status": "PASSED"
   },
   "devtool.DevtoolUpdateTests.test_devtool_update_recipe_append": {
    "duration": 158.80854964256287,
    "status": "PASSED"
   },
   "devtool.DevtoolUpdateTests.test_devtool_update_recipe_append_git": {
    "duration": 165.4033968448639,
    "status": "PASSED"
   },
   "devtool.DevtoolUpdateTests.test_devtool_update_recipe_git": {
    "duration": 89.78275036811829,
    "status": "PASSED"
   },
   "devtool.DevtoolUpdateTests.test_devtool_update_recipe_local_files": {
    "duration": 171.17191219329834,
    "status": "PASSED"
   },
   "devtool.DevtoolUpdateTests.test_devtool_update_recipe_local_files_3": {
    "duration": 76.44331073760986,
    "status": "PASSED"
   },
   "devtool.DevtoolUpdateTests.test_devtool_update_recipe_local_files_subdir": {
    "duration": 72.55768609046936,
    "status": "PASSED"
   },
   "devtool.DevtoolUpdateTests.test_devtool_update_recipe_local_patch_gz": {
    "duration": 72.9008424282074,
    "status": "PASSED"
   },
   "devtool.DevtoolUpdateTests.test_devtool_update_recipe_long_filename": {
    "duration": 88.9141252040863,
    "status": "PASSED"
   },
   "devtool.DevtoolUpdateTests.test_devtool_update_recipe_with_gitignore": {
    "duration": 90.73826265335083,
    "status": "PASSED"
   },
   "devtool.DevtoolUpgradeTests.test_devtool_finish_modify_origlayer": {
    "duration": 190.63827395439148,
    "status": "PASSED"
   },
   "devtool.DevtoolUpgradeTests.test_devtool_finish_modify_otherlayer": {
    "duration": 105.7442409992218,
    "status": "PASSED"
   },
   "devtool.DevtoolUpgradeTests.test_devtool_finish_update_patch": {
    "duration": 114.94468379020691,
    "status": "PASSED"
   },
   "devtool.DevtoolUpgradeTests.test_devtool_finish_upgrade_origlayer": {
    "duration": 142.91635370254517,
    "status": "PASSED"
   },
   "devtool.DevtoolUpgradeTests.test_devtool_finish_upgrade_otherlayer": {
    "duration": 143.13853287696838,
    "status": "PASSED"
   },
   "devtool.DevtoolUpgradeTests.test_devtool_layer_plugins": {
    "duration": 4.6476006507873535,
    "status": "PASSED"
   },
   "devtool.DevtoolUpgradeTests.test_devtool_load_plugin": {
    "duration": 12.92438817024231,
    "status": "PASSED"
   },
   "devtool.DevtoolUpgradeTests.test_devtool_rename": {
    "duration": 124.44710278511047,
    "status": "PASSED"
   },
   "devtool.DevtoolUpgradeTests.test_devtool_upgrade": {
    "duration": 130.34850764274597,
    "status": "PASSED"
   },
   "devtool.DevtoolUpgradeTests.test_devtool_upgrade_all_checksums": {
    "duration": 120.28377175331116,
    "status": "PASSED"
   },
   "devtool.DevtoolUpgradeTests.test_devtool_upgrade_drop_md5sum": {
    "duration": 120.29874205589294,
    "status": "PASSED"
   },
   "devtool.DevtoolUpgradeTests.test_devtool_upgrade_git": {
    "duration": 73.35451817512512,
    "status": "PASSED"
   },
   "devtool.DevtoolUpgradeTests.test_devtool_upgrade_gitsm": {
    "duration": 84.67721939086914,
    "status": "PASSED"
   },
   "devtool.DevtoolUpgradeTests.test_devtool_upgrade_recipe_upgrade_extra_tasks": {
    "duration": 135.5164020061493,
    "status": "PASSED"
   },
   "devtool.DevtoolUpgradeTests.test_devtool_virtual_kernel_modify": {
    "duration": 1484.1156373023987,
    "status": "PASSED"
   },
   "distrodata.Distrodata.test_checkpkg": {
    "duration": 0.002697467803955078,
    "log": "Skip by the command line argument \"distrodata.Distrodata.test_checkpkg\"\n",
    "status": "SKIPPED"
   },
   "distrodata.Distrodata.test_common_include_recipes": {
    "duration": 99.01559448242188,
    "status": "PASSED"
   },
   "distrodata.Distrodata.test_maintainers": {
    "duration": 141.32711386680603,
    "status": "PASSED"
   },
   "efibootpartition.GenericEFITest.test_boot_efi": {
    "duration": 0.0011138916015625,
    "log": "test is qemux86-64 specific currently\n",
    "status": "SKIPPED"
   },
   "esdk.oeSDKExtSelfTest.test_image_generation_binary_feeds": {
    "duration": 146.271723985672,
    "status": "PASSED"
   },
   "esdk.oeSDKExtSelfTest.test_install_libraries_headers": {
    "duration": 52.098692893981934,
    "status": "PASSED"
   },
   "externalsrc.ExternalSrc.test_externalsrc_srctree_hash_files": {
    "duration": 92.56617093086243,
    "status": "PASSED"
   },
   "fetch.Dependencies.test_dependencies": {
    "duration": 4.692972660064697,
    "status": "PASSED"
   },
   "fetch.Fetch.test_git_mirrors": {
    "duration": 141.23027300834656,
    "status": "PASSED"
   },
   "fitimage.FitImagePyTests.test_fitimage_py_conf_extra_mappings_unused_error": {
    "duration": 0.03236889839172363,
    "status": "PASSED"
   },
   "fitimage.FitImagePyTests.test_fitimage_py_conf_loadables": {
    "duration": 0.008105993270874023,
    "status": "PASSED"
   },
   "fitimage.FitImagePyTests.test_fitimage_py_conf_mappings": {
    "duration": 0.008083581924438477,
    "status": "PASSED"
   },
   "fitimage.FitImagePyTests.test_fitimage_py_conf_mappings_unused_error": {
    "duration": 0.006491661071777344,
    "status": "PASSED"
   },
   "fitimage.FitImagePyTests.test_fitimage_py_conf_mappings_with_alias": {
    "duration": 0.006918191909790039,
    "status": "PASSED"
   },
   "fitimage.FitImagePyTests.test_fitimage_py_default": {
    "duration": 0.00798344612121582,
    "status": "PASSED"
   },
   "fitimage.FitImagePyTests.test_fitimage_py_default_dtb": {
    "duration": 0.008151769638061523,
    "status": "PASSED"
   },
   "fitimage.KernelFitImageRecipeTests.test_fit_image": {
    "duration": 560.1315791606903,
    "status": "PASSED"
   },
   "fitimage.KernelFitImageRecipeTests.test_fit_image_ext_dtb_dtbo": {
    "duration": 171.6886956691742,
    "status": "PASSED"
   },
   "fitimage.KernelFitImageRecipeTests.test_fit_image_sign_initramfs": {
    "duration": 197.91993165016174,
    "status": "PASSED"
   },
   "fitimage.KernelFitImageRecipeTests.test_fit_image_sign_initramfs_bundle": {
    "duration": 194.16849303245544,
    "status": "PASSED"
   },
   "fitimage.KernelFitImageRecipeTests.test_get_compatible_from_dtb": {
    "duration": 75.90663552284241,
    "status": "PASSED"
   },
   "fitimage.KernelFitImageRecipeTests.test_sign_fit_image_configurations": {
    "duration": 205.53136324882507,
    "status": "PASSED"
   },
   "fitimage.KernelFitImageRecipeTests.test_sign_fit_image_individual": {
    "duration": 82.24423909187317,
    "status": "PASSED"
   },
   "fitimage.UBootFitImageTests.test_sign_cascaded_uboot_fit_image": {
    "duration": 633.1636028289795,
    "status": "PASSED"
   },
   "fitimage.UBootFitImageTests.test_sign_standalone_uboot_atf_tee_fit_image": {
    "duration": 127.1788477897644,
    "status": "PASSED"
   },
   "fitimage.UBootFitImageTests.test_sign_standalone_uboot_fit_image": {
    "duration": 125.09540152549744,
    "status": "PASSED"
   },
   "fitimage.UBootFitImageTests.test_sign_uboot_fit_image_without_spl": {
    "duration": 414.6232385635376,
    "status": "PASSED"
   },
   "fitimage.UBootFitImageTests.test_sign_uboot_kernel_individual": {
    "duration": 163.5069706439972,
    "status": "PASSED"
   },
   "fitimage.UBootFitImageTests.test_uboot_atf_tee_fit_image": {
    "duration": 124.18869018554688,
    "status": "PASSED"
   },
   "fitimage.UBootFitImageTests.test_uboot_fit_image": {
    "duration": 122.63848781585693,
    "status": "PASSED"
   },
   "gdbserver.GdbServerTest.test_gdb_server": {
    "duration": 172.2959656715393,
    "status": "PASSED"
   },
   "gitarchivetests.GitArchiveTests.test_create_first_test_tag": {
    "duration": 1.0680806636810303,
    "status": "PASSED"
   },
   "gitarchivetests.GitArchiveTests.test_create_second_test_tag": {
    "duration": 1.2346107959747314,
    "status": "PASSED"
   },
   "gitarchivetests.GitArchiveTests.test_get_revs_on_branch": {
    "duration": 0.7041678428649902,
    "status": "PASSED"
   },
   "gitarchivetests.GitArchiveTests.test_get_tags_with_only_local_tag": {
    "duration": 0.700819730758667,
    "status": "PASSED"
   },
   "gitarchivetests.GitArchiveTests.test_get_tags_without_valid_remote": {
    "duration": 0.9911129474639893,
    "status": "PASSED"
   },
   "gitarchivetests.GitArchiveTests.test_get_tags_without_valid_remote_and_wrong_url": {
    "duration": 0.5659666061401367,
    "status": "PASSED"
   },
   "gotoolchain.oeGoToolchainSelfTest.test_go_dep_build": {
    "duration": 2.712172031402588,
    "status": "PASSED"
   },
   "image_typedep.ImageTypeDepTests.test_conversion_typedep_added": {
    "duration": 49.897725105285645,
    "status": "PASSED"
   },
   "imagefeatures.ImageFeatures.test_all_users_can_connect_via_ssh_without_password": {
    "duration": 335.29611682891846,
    "oetags": [
     "runqemu"
    ],
    "status": "PASSED"
   },
   "imagefeatures.ImageFeatures.test_bmap": {
    "duration": 138.45391607284546,
    "status": "PASSED"
   },
   "imagefeatures.ImageFeatures.test_empty_image": {
    "duration": 80.83407664299011,
    "status": "PASSED"
   },
   "imagefeatures.ImageFeatures.test_hypervisor_fmts": {
    "duration": 160.19287276268005,
    "status": "PASSED"
   },
   "imagefeatures.ImageFeatures.test_image_fstypes": {
    "duration": 972.0169842243195,
    "status": "PASSED"
   },
   "imagefeatures.ImageFeatures.test_image_gen_debugfs": {
    "duration": 116.70456743240356,
    "status": "PASSED"
   },
   "imagefeatures.ImageFeatures.test_long_chain_conversion": {
    "duration": 97.35706567764282,
    "status": "PASSED"
   },
   "imagefeatures.ImageFeatures.test_mandb": {
    "duration": 3656.549979686737,
    "status": "PASSED"
   },
   "imagefeatures.ImageFeatures.test_no_busybox_base_utils": {
    "duration": 45.64795470237732,
    "status": "PASSED"
   },
   "imagefeatures.ImageFeatures.test_non_root_user_can_connect_via_ssh_without_password": {
    "duration": 116.59690523147583,
    "oetags": [
     "runqemu"
    ],
    "status": "PASSED"
   },
   "imagefeatures.ImageFeatures.test_useradd_static": {
    "duration": 369.16289043426514,
    "status": "PASSED"
   },
   "imagefeatures.ImageFeatures.test_wayland_support_in_image": {
    "duration": 144.99889016151428,
    "status": "PASSED"
   },
   "incompatible_lic.IncompatibleLicensePerImageTests.test_bash_and_license": {
    "duration": 182.16856241226196,
    "status": "PASSED"
   },
   "incompatible_lic.IncompatibleLicensePerImageTests.test_bash_default": {
    "duration": 111.10213112831116,
    "status": "PASSED"
   },
   "incompatible_lic.IncompatibleLicensePerImageTests.test_bash_license_exceptions": {
    "duration": 97.06576204299927,
    "status": "PASSED"
   },
   "incompatible_lic.IncompatibleLicensePerImageTests.test_bash_or_license": {
    "duration": 107.38214993476868,
    "status": "PASSED"
   },
   "incompatible_lic.IncompatibleLicenseTestObsolete.test_incompatible_alias_spdx_license": {
    "duration": 11.727868795394897,
    "status": "PASSED"
   },
   "incompatible_lic.IncompatibleLicenseTestObsolete.test_incompatible_alias_spdx_license_alias": {
    "duration": 10.958899974822998,
    "status": "PASSED"
   },
   "incompatible_lic.IncompatibleLicenseTestObsolete.test_incompatible_alias_spdx_license_alias_wildcard": {
    "duration": 12.125943183898926,
    "status": "PASSED"
   },
   "incompatible_lic.IncompatibleLicenseTestObsolete.test_incompatible_alias_spdx_license_wildcard": {
    "duration": 10.929761409759521,
    "status": "PASSED"
   },
   "incompatible_lic.IncompatibleLicenseTestObsolete.test_incompatible_all_licenses_wildcard": {
    "duration": 10.90461778640747,
    "status": "PASSED"
   },
   "incompatible_lic.IncompatibleLicenseTestObsolete.test_incompatible_spdx_license_alias_wildcard": {
    "duration": 11.110769987106323,
    "status": "PASSED"
   },
   "incompatible_lic.IncompatibleLicenseTestObsolete.test_incompatible_spdx_licenses_wildcard": {
    "duration": 11.69887089729309,
    "status": "PASSED"
   },
   "incompatible_lic.IncompatibleLicenseTests.test_incompatible_nonspdx_license": {
    "duration": 38.04037618637085,
    "status": "PASSED"
   },
   "incompatible_lic.IncompatibleLicenseTests.test_incompatible_spdx_license": {
    "duration": 37.428852796554565,
    "status": "PASSED"
   },
   "incompatible_lic.IncompatibleLicenseTests.test_incompatible_spdx_license_alias": {
    "duration": 6.343465805053711,
    "status": "PASSED"
   },
   "incompatible_lic.IncompatibleLicenseTests.test_incompatible_spdx_license_wildcard": {
    "duration": 37.836090087890625,
    "status": "PASSED"
   },
   "incompatible_lic.IncompatibleLicenseTests.test_incompatible_spdx_licenses": {
    "duration": 36.972076416015625,
    "status": "PASSED"
   },
   "incompatible_lic.NoGPL3InImagesTests.test_core_image_full_cmdline_weston": {
    "duration": 872.2508835792542,
    "log": "testtools.testresult.real._StringException: Traceback (most recent call last):\n  File \"/srv/pokybuild/yocto-worker/oe-selftest-armhost/build/layers/openembedded-core/meta/lib/oeqa/core/decorator/__init__.py\", line 35, in wrapped_f\n    return func(*args, **kwargs)\n           ^^^^^^^^^^^^^^^^^^^^^\n  File \"/srv/pokybuild/yocto-worker/oe-selftest-armhost/build/layers/openembedded-core/meta/lib/oeqa/selftest/cases/incompatible_lic.py\", line 156, in test_core_image_full_cmdline_weston\n    bitbake('-c testimage core-image-full-cmdline core-image-weston')\n  File \"/srv/pokybuild/yocto-worker/oe-selftest-armhost/build/layers/openembedded-core/meta/lib/oeqa/utils/commands.py\", line 236, in bitbake\n    return runCmd(cmd, ignore_status, timeout, output_log=output_log, **options)\n           ^^^^^^^^^^^^^^^^^^^^^^^^^^^^^^^^^^^^^^^^^^^^^^^^^^^^^^^^^^^^^^^^^^^^^\n  File \"/srv/pokybuild/yocto-worker/oe-selftest-armhost/build/layers/openembedded-core/meta/lib/oeqa/utils/commands.py\", line 214, in runCmd\n    raise AssertionError(\"Command '%s' returned non-zero exit status %d:\\n%s\" % (command, result.status, exc_output))\nAssertionError: Command 'bitbake  -c testimage core-image-full-cmdline core-image-weston' returned non-zero exit status 1:\nNOTE: Reconnecting to bitbake server...\nLoading cache...done.\nLoaded 2080 entries from dependency cache.\nNOTE: Resolving any missing task queue dependencies\n\nBuild Configuration:\nBB_VERSION           = \"2.19.0\"\nBUILD_SYS            = \"aarch64-linux\"\nNATIVELSBSTRING      = \"universal\"\nTARGET_SYS           = \"aarch64-poky-linux\"\nMACHINE              = \"qemuarm64\"\nSDKMACHINE           = \"aarch64\"\nDISTRO               = \"poky\"\nDISTRO_VERSION       = \"6.0.99+snapshot-10ace5cb9e4b9b323c3f713d3b15b6554681af2f\"\nTUNE_FEATURES        = \"aarch64 crc cortexa57\"\nmeta                 = \"mathieu/master-next:10ace5cb9e4b9b323c3f713d3b15b6554681af2f\"\nmeta-yocto-bsp       \nmeta-poky            = \"contrib/mathieu/master-next:366fa2f21bfb0d9c4de492e0204a0dd38ce241ab\"\nmeta-selftest        = \"master:370d774aa3f4477ca6f119991ddfd005f800d4e2\"\n\nInitialising tasks...Sstate summary: Wanted 138 Local 138 Mirrors 0 Missed 0 Current 307 (100% match, 100% complete)\ndone.\nNOTE: Executing Tasks\nNOTE: Setscene tasks completed\nNOTE: Running task 1518 of 1519 (/srv/pokybuild/yocto-worker/oe-selftest-armhost/build/layers/openembedded-core/meta/recipes-graphics/images/core-image-weston.bb:do_testimage)\nNOTE: Running task 1519 of 1519 (/srv/pokybuild/yocto-worker/oe-selftest-armhost/build/layers/openembedded-core/meta/recipes-extended/images/core-image-full-cmdline.bb:do_testimage)\nNOTE: recipe core-image-weston-1.0-r0: task do_testimage: Started\nNOTE: recipe core-image-full-cmdline-1.0-r0: task do_testimage: Started\nQMP Available for connection at /srv/pokybuild/yocto-worker/oe-selftest-armhost/build/build-st-3346236/tmp/.lz907uly\nQMP Available for connection at /srv/pokybuild/yocto-worker/oe-selftest-armhost/build/build-st-3346236/tmp/.e9r_muvi\nQMP connected to QEMU at 06/23/26 14:55:06 and took 0.61 seconds\nQMP released QEMU at 06/23/26 14:55:06 and took 0.09 seconds from connect\nQMP connected to QEMU at 06/23/26 14:55:07 and took 1.15 seconds\nQMP released QEMU at 06/23/26 14:55:07 and took 0.08 seconds from connect\nTest requires apt to be installed\nTest requires autoconf to be installed\nTest requires gtk+3 to be installed\nTest requires autoconf to be installed\nTest requires connman to be installed\nTest case connman.ConnmanTest.test_connmand_running depends on connman.ConnmanTest.test_connmand_help but it didn't pass/run.\nTest requires apt to be installed\nTest requires dnf to be installed\nTest case dnf.DnfBasicTest.test_dnf_history depends on dnf.DnfBasicTest.test_dnf_help but it didn't pass/run.\nTest case dnf.DnfBasicTest.test_dnf_info depends on dnf.DnfBasicTest.test_dnf_help but it didn't pass/run.\nTest case dnf.DnfBasicTest.test_dnf_search depends on dnf.DnfBasicTest.test_dnf_help but it didn't pass/run.\nTest case dnf.DnfBasicTest.test_dnf_version depends on dnf.DnfBasicTest.test_dnf_help but it didn't pass/run.\nTest case dnf.DnfRepoTest.test_dnf_makecache depends on dnf.DnfBasicTest.test_dnf_help but it didn't pass/run.\nTest case dnf.DnfRepoTest.test_dnf_exclude depends on dnf.DnfRepoTest.test_dnf_makecache but it didn't pass/run.\nTest case dnf.DnfRepoTest.test_dnf_install depends on dnf.DnfRepoTest.test_dnf_makecache but it didn't pass/run.\nTest case dnf.DnfRepoTest.test_dnf_install_dependency depends on dnf.DnfRepoTest.test_dnf_install but it didn't pass/run.\nTest case dnf.DnfRepoTest.test_dnf_install_from_disk depends on dnf.DnfRepoTest.test_dnf_install_dependency but it didn't pass/run.\nTest case dnf.DnfRepoTest.test_dnf_install_from_http depends on dnf.DnfRepoTest.test_dnf_install_from_disk but it didn't pass/run.\nTest case dnf.DnfRepoTest.test_dnf_installroot depends on dnf.DnfRepoTest.test_dnf_makecache but it didn't pass/run.\nTest run when enable usrmerge\nTest case dnf.DnfRepoTest.test_dnf_reinstall depends on dnf.DnfRepoTest.test_dnf_install but it didn't pass/run.\nTest case dnf.DnfRepoTest.test_dnf_repoinfo depends on dnf.DnfRepoTest.test_dnf_makecache but it didn't pass/run.\nTest requires gcc to be installed\nTest requires g++ to be installed\nTest requires g++ to be installed\nTest requires make to be installed\nTest requires python3-pygobject to be installed\nTest requires cgo-helloworld to be installed\nTest requires go-runtime-dev to be installed\nTest requires go-runtime-dev to be installed\nTest requires go-helloworld to be installed\nTest requires gcc to be installed\nTest requires ldd to be installed\nTest requires logrotate to be installed\nTest case logrotate.LogrotateTest.test_logrotate_newlog depends on logrotate.LogrotateTest.test_logrotate_wtmp but it didn't pass/run.\nTest requires autoconf to be installed\nTest requires gtk+3 to be installed\nTest requires autoconf to be installed\nTest requires connman to be installed\nTest case connman.ConnmanTest.test_connmand_running depends on connman.ConnmanTest.test_connmand_help but it didn't pass/run.\nTest requires dnf to be installed\nTest case dnf.DnfBasicTest.test_dnf_history depends on dnf.DnfBasicTest.test_dnf_help but it didn't pass/run.\nTest case dnf.DnfBasicTest.test_dnf_info depends on dnf.DnfBasicTest.test_dnf_help but it didn't pass/run.\nTest case dnf.DnfBasicTest.test_dnf_search depends on dnf.DnfBasicTest.test_dnf_help but it didn't pass/run.\nTest case dnf.DnfBasicTest.test_dnf_version depends on dnf.DnfBasicTest.test_dnf_help but it didn't pass/run.\nTest case dnf.DnfRepoTest.test_dnf_makecache depends on dnf.DnfBasicTest.test_dnf_help but it didn't pass/run.\nTest case dnf.DnfRepoTest.test_dnf_exclude depends on dnf.DnfRepoTest.test_dnf_makecache but it didn't pass/run.\nTest case dnf.DnfRepoTest.test_dnf_install depends on dnf.DnfRepoTest.test_dnf_makecache but it didn't pass/run.\nTest case dnf.DnfRepoTest.test_dnf_install_dependency depends on dnf.DnfRepoTest.test_dnf_install but it didn't pass/run.\nTest case dnf.DnfRepoTest.test_dnf_install_from_disk depends on dnf.DnfRepoTest.test_dnf_install_dependency but it didn't pass/run.\nTest case dnf.DnfRepoTest.test_dnf_install_from_http depends on dnf.DnfRepoTest.test_dnf_install_from_disk but it didn't pass/run.\nTest case dnf.DnfRepoTest.test_dnf_installroot depends on dnf.DnfRepoTest.test_dnf_makecache but it didn't pass/run.\nTest run when enable usrmerge\nTest case dnf.DnfRepoTest.test_dnf_reinstall depends on dnf.DnfRepoTest.test_dnf_install but it didn't pass/run.\nTest case dnf.DnfRepoTest.test_dnf_repoinfo depends on dnf.DnfRepoTest.test_dnf_makecache but it didn't pass/run.\nTest requires gcc to be installed\nTest requires g++ to be installed\nTest requires g++ to be installed\nTest requires make to be installed\nTest requires python3-pygobject to be installed\nTest requires cgo-helloworld to be installed\nTest requires go-runtime-dev to be installed\nTest requires go-runtime-dev to be installed\nTest requires go-helloworld to be installed\nTest requires gcc to be installed\nTest requires ldd to be installed\nNo syslog found to restart, ignoring\nTest requires busybox-syslog to be installed\nTest requires opkg to be installed\nTest requires pam to be in DISTRO_FEATURES\nTest requires perl to be installed\nTest requires ptest-runner to be installed\nTest requires ptest-runner to be installed\nTest requires python3-core to be installed\nTest requires opkg to be installed\nTest requires pam to be in DISTRO_FEATURES\nNo /var/lib/rpm on target\nTest case rpm.RpmBasicTest.test_rpm_query_nonroot depends on rpm.RpmBasicTest.test_rpm_query but it didn't pass/run.\nTest case rpm.RpmInstallRemoveTest.test_rpm_install depends on rpm.RpmBasicTest.test_rpm_query but it didn't pass/run.\nTest case rpm.RpmInstallRemoveTest.test_rpm_remove depends on rpm.RpmInstallRemoveTest.test_rpm_install but it didn't pass/run.\nTest case rpm.RpmInstallRemoveTest.test_check_rpm_install_removal_log_file_size depends on rpm.RpmInstallRemoveTest.test_rpm_remove but it didn't pass/run.\nTest requires rust-c-lib-example-bin to be installed\nTest requires cargo to be installed\nTest requires rust to be installed\nTest requires kernel-devsrc to be installed\nsystemd is not the init manager for this image\nTest case systemd.SystemdBasicTests.test_systemd_failed depends on systemd.SystemdBasicTests.test_systemd_basic but it didn't pass/run.\nTest case systemd.SystemdBasicTests.test_systemd_list depends on systemd.SystemdBasicTests.test_systemd_basic but it didn't pass/run.\nTest case systemd.SystemdJournalTests.test_systemd_boot_time depends on systemd.SystemdBasicTests.test_systemd_basic but it didn't pass/run.\nTest case systemd.SystemdJournalTests.test_systemd_journal depends on systemd.SystemdBasicTests.test_systemd_basic but it didn't pass/run.\nTest requires minidebuginfo to be in DISTRO_FEATURES\nTest case systemd.SystemdServiceTests.test_systemd_status depends on systemd.SystemdBasicTests.test_systemd_basic but it didn't pass/run.\nTest case systemd.SystemdServiceTests.test_systemd_disable_enable depends on systemd.SystemdServiceTests.test_systemd_status but it didn't pass/run.\nTest is only meant to run with read-only-rootfs in IMAGE_FEATURES\nTest case systemd.SystemdServiceTests.test_systemd_stop_start depends on systemd.SystemdServiceTests.test_systemd_status but it didn't pass/run.\nTest requires wayland-utils to be installed\nTest requires weston to be installed\nTest requires weston to be installed\nTest requires weston to be installed\nTest requires xserver-nodm-init to be installed\nTest requires perl to be installed\nTest requires ptest-runner to be installed\nTest requires ptest-runner to be installed\nTest requires python3-core to be installed\nNo /var/lib/rpm on target\nTest case rpm.RpmBasicTest.test_rpm_query_nonroot depends on rpm.RpmBasicTest.test_rpm_query but it didn't pass/run.\nTest case rpm.RpmInstallRemoveTest.test_rpm_install depends on rpm.RpmBasicTest.test_rpm_query but it didn't pass/run.\nTest case rpm.RpmInstallRemoveTest.test_rpm_remove depends on rpm.RpmInstallRemoveTest.test_rpm_install but it didn't pass/run.\nTest case rpm.RpmInstallRemoveTest.test_check_rpm_install_removal_log_file_size depends on rpm.RpmInstallRemoveTest.test_rpm_remove but it didn't pass/run.\nTest requires rust-c-lib-example-bin to be installed\nTest requires openssh-scp to be installed\nTest requires openssh-scp to be installed\nTest requires kernel-devsrc to be installed\nsystemd is not the init manager for this image\nTest case systemd.SystemdBasicTests.test_systemd_failed depends on systemd.SystemdBasicTests.test_systemd_basic but it didn't pass/run.\nTest case systemd.SystemdBasicTests.test_systemd_list depends on systemd.SystemdBasicTests.test_systemd_basic but it didn't pass/run.\nTest case systemd.SystemdJournalTests.test_systemd_boot_time depends on systemd.SystemdBasicTests.test_systemd_basic but it didn't pass/run.\nTest case systemd.SystemdJournalTests.test_systemd_journal depends on systemd.SystemdBasicTests.test_systemd_basic but it didn't pass/run.\nTest requires minidebuginfo to be in DISTRO_FEATURES\nTest case systemd.SystemdServiceTests.test_systemd_status depends on systemd.SystemdBasicTests.test_systemd_basic but it didn't pass/run.\nTest case systemd.SystemdServiceTests.test_systemd_disable_enable depends on systemd.SystemdServiceTests.test_systemd_status but it didn't pass/run.\nTest is only meant to run with read-only-rootfs in IMAGE_FEATURES\nTest case systemd.SystemdServiceTests.test_systemd_stop_start depends on systemd.SystemdServiceTests.test_systemd_status but it didn't pass/run.\nTraceback (most recent call last):\n  File \"/srv/pokybuild/yocto-worker/oe-selftest-armhost/build/layers/openembedded-core/meta/lib/oeqa/core/decorator/__init__.py\", line 35, in wrapped_f\n    return func(*args, **kwargs)\n           ^^^^^^^^^^^^^^^^^^^^^\n  File \"/srv/pokybuild/yocto-worker/oe-selftest-armhost/build/layers/openembedded-core/meta/lib/oeqa/runtime/cases/weston.py\", line 58, in test_wayland_info\n    status, output = self.target.run(command)\n                     ^^^^^^^^^^^^^^^^^^^^^^^^\n  File \"/srv/pokybuild/yocto-worker/oe-selftest-armhost/build/layers/openembedded-core/meta/lib/oeqa/core/target/ssh.py\", line 98, in run\n    status, output = self._run(sshCmd, processTimeout, ignore_status, raw, ignore_ssh_fails)\n                     ^^^^^^^^^^^^^^^^^^^^^^^^^^^^^^^^^^^^^^^^^^^^^^^^^^^^^^^^^^^^^^^^^^^^^^^\n  File \"/srv/pokybuild/yocto-worker/oe-selftest-armhost/build/layers/openembedded-core/meta/lib/oeqa/core/target/ssh.py\", line 70, in _run\n    raise AssertionError(\"ssh exited with status '255' for command \"\nAssertionError: ssh exited with status '255' for command '['ssh', '-l', 'root', '-o', 'ServerAliveCountMax=2', '-o', 'ServerAliveInterval=30', '-o', 'UserKnownHostsFile=/dev/null', '-o', 'StrictHostKeyChecking=no', '-o', 'LogLevel=ERROR', '192.168.7.4', 'export PATH=/usr/sbin:/sbin:/usr/bin:/bin; export XDG_RUNTIME_DIR=/run/user/`id -u user`; export WAYLAND_DISPLAY=wayland-1; wayland-info']': this is likely an SSH failure\nfailed to create display: No such file or directory\n\nTraceback (most recent call last):\n  File \"/srv/pokybuild/yocto-worker/oe-selftest-armhost/build/layers/openembedded-core/meta/lib/oeqa/core/decorator/__init__.py\", line 35, in wrapped_f\n    return func(*args, **kwargs)\n           ^^^^^^^^^^^^^^^^^^^^^\n  File \"/srv/pokybuild/yocto-worker/oe-selftest-armhost/build/layers/openembedded-core/meta/lib/oeqa/runtime/cases/weston.py\", line 63, in test_weston_can_initialize_new_wayland_compositor\n    existing_wl_processes = self.get_processes_of('weston-desktop-shell', 'existing')\n                            ^^^^^^^^^^^^^^^^^^^^^^^^^^^^^^^^^^^^^^^^^^^^^^^^^^^^^^^^^\n  File \"/srv/pokybuild/yocto-worker/oe-selftest-armhost/build/layers/openembedded-core/meta/lib/oeqa/runtime/cases/weston.py\", line 28, in get_processes_of\n    self.assertEqual(status, 0, msg='Retrieve %s (%s) processes error: %s' % (target, error_msg, output))\nAssertionError: 1 != 0 : Retrieve weston-desktop-shell (existing) processes error: \n\nTraceback (most recent call last):\n  File \"/srv/pokybuild/yocto-worker/oe-selftest-armhost/build/layers/openembedded-core/meta/lib/oeqa/core/decorator/__init__.py\", line 35, in wrapped_f\n    return func(*args, **kwargs)\n           ^^^^^^^^^^^^^^^^^^^^^\n  File \"/srv/pokybuild/yocto-worker/oe-selftest-armhost/build/layers/openembedded-core/meta/lib/oeqa/core/decorator/__init__.py\", line 35, in wrapped_f\n    return func(*args, **kwargs)\n           ^^^^^^^^^^^^^^^^^^^^^\n  File \"/srv/pokybuild/yocto-worker/oe-selftest-armhost/build/layers/openembedded-core/meta/lib/oeqa/runtime/cases/weston.py\", line 24, in test_weston_running\n    self.assertEqual(status, 0, msg=msg)\nAssertionError: 1 != 0 : Weston does not appear to be running   PID USER       VSZ STAT COMMAND\n    1 root      3392 S    init [5]\n    2 root         0 SW   [kthreadd]\n    3 root         0 SW   [pool_workqueue_]\n    4 root         0 IW<  [kworker/R-rcu_g]\n    5 root         0 IW<  [kworker/R-sync_]\n    6 root         0 IW<  [kworker/R-kvfre]\n    7 root         0 IW<  [kworker/R-slub_]\n    8 root         0 IW<  [kworker/R-netns]\n    9 root         0 IW   [kworker/0:0-rcu]\n   10 root         0 IW   [kworker/0:1-eve]\n   11 root         0 IW<  [kworker/0:0H-ev]\n   12 root         0 IW   [kworker/u16:0-e]\n   13 root         0 IW<  [kworker/R-mm_pe]\n   14 root         0 IW   [kworker/u16:1-e]\n   15 root         0 SW   [ksoftirqd/0]\n   16 root         0 IW   [rcu_preempt]\n   17 root         0 SW   [rcu_exp_par_gp_]\n   18 root         0 SW   [rcu_exp_gp_kthr]\n   19 root         0 SW   [migration/0]\n   20 root         0 SW   [cpuhp/0]\n   21 root         0 SW   [cpuhp/1]\n   22 root         0 SW   [migration/1]\n   23 root         0 SW   [ksoftirqd/1]\n   24 root         0 IW   [kworker/1:0-eve]\n   25 root         0 IW<  [kworker/1:0H-ev]\n   26 root         0 SW   [cpuhp/2]\n   27 root         0 SW   [migration/2]\n   28 root         0 SW   [ksoftirqd/2]\n   29 root         0 IW   [kworker/2:0-eve]\n   30 root         0 IW<  [kworker/2:0H-ev]\n   31 root         0 SW   [cpuhp/3]\n   32 root         0 SW   [migration/3]\n   33 root         0 SW   [ksoftirqd/3]\n   34 root         0 IW   [kworker/3:0-eve]\n   35 root         0 IW<  [kworker/3:0H-ev]\n   36 root         0 SW   [kdevtmpfs]\n   37 root         0 IW<  [kworker/R-inet_]\n   38 root         0 IW   [rcu_tasks_kthre]\n   39 root         0 IW   [rcu_tasks_rude_]\n   40 root         0 IW   [rcu_tasks_trace]\n   41 root         0 SW<  [pr/ttyAMA-1]\n   42 root         0 SW   [oom_reaper]\n   43 root         0 IW<  [kworker/R-write]\n   44 root         0 SW   [kcompactd0]\n   45 root         0 IW<  [kworker/R-kbloc]\n   46 root         0 IW<  [kworker/R-blkcg]\n   47 root         0 IW   [kworker/u16:2-e]\n   48 root         0 IW<  [kworker/R-md_bi]\n   49 root         0 IW   [kworker/2:1-eve]\n   50 root         0 IW<  [kworker/R-rpcio]\n   51 root         0 IW<  [kworker/R-xprti]\n   52 root         0 IW<  [kworker/2:1H-kb]\n   53 root         0 SW   [kswapd0]\n   54 root         0 IW<  [kworker/R-nfsio]\n   55 root         0 IW<  [kworker/R-cifsi]\n   56 root         0 IW<  [kworker/R-smb3d]\n   57 root         0 IW<  [kworker/R-cifsf]\n   58 root         0 IW<  [kworker/R-cifso]\n   59 root         0 IW<  [kworker/R-defer]\n   60 root         0 IW<  [kworker/R-serve]\n   61 root         0 IW<  [kworker/R-cfid_]\n   62 root         0 IW   [kworker/1:1]\n   63 root         0 SW   [hwrng]\n   64 root         0 SW   [khvcd]\n   65 root         0 IW   [kworker/1:2-eve]\n   66 root         0 IW<  [kworker/R-raid5]\n   67 root         0 IW<  [kworker/R-dm_bu]\n   68 root         0 IW<  [kworker/R-mld]\n   69 root         0 IW<  [kworker/R-ipv6_]\n   70 root         0 IW<  [kworker/u17:0]\n   81 root         0 IW   [kworker/3:1-eve]\n   82 root         0 IW<  [kworker/3:1H-kb]\n   83 root         0 SW   [jbd2/vda-8]\n   84 root         0 IW<  [kworker/R-ext4-]\n   88 root         0 IW   [kworker/2:2-pm]\n  124 root     10156 S    /sbin/udevd -d\n  127 root         0 IW<  [kworker/0:1H-kb]\n  130 root         0 IW<  [kworker/1:1H]\n  146 root         0 IW   [kworker/2:3-eve]\n  313 messageb  4688 S    /usr/bin/dbus-daemon --system\n  316 root      3268 S    seatd -g seat -n 1\n  330 root      4428 S    /usr/sbin/dropbear -r /etc/dropbear/dropbear_rsa_hos\n  338 rpc       4632 S    /usr/sbin/rpcbind\n  363 avahi     5516 S    avahi-daemon: running [qemuarm64.local]\n  364 avahi     5516 S    avahi-daemon: chroot helper\n  373 root      5516 S    {start_getty} /bin/sh /bin/start_getty 115200 ttyAMA\n  374 root      4236 S    {start_getty} /bin/sh /bin/start_getty 115200 hvc0 v\n  375 root      5132 S    /sbin/getty 38400 tty1\n  378 root      3856 S    -sh\n  379 root      3788 S    /sbin/getty -L 115200 hvc0 vt102\n  489 root      4364 S    /sbin/syslogd -n -O /var/log/messages\n  492 root      5388 S    /sbin/klogd -n\n  536 root      4112 R    /usr/sbin/dropbear -r /etc/dropbear/dropbear_rsa_hos\n  537 root      4112 R    ps\n\nOutput from runqemu:\nrunqemu - INFO - Received signal: 15\nrunqemu - INFO - Cleaning up\nrunqemu - INFO - Host uptime: 78516.68\n\nrunqemu - INFO - Removing /srv/pokybuild/yocto-worker/oe-selftest-armhost/build/build-st-3346236/tmp/deploy/images/qemuarm64/core-image-full-cmdline-qemuarm64.rootfs-20260623144153.ext4\nrunqemu - INFO - Removing /home/pokybuild/tmp/core-image-full-cmdline-qemuarm64.rootfs-20260623144153.ext4.428506\ntput: No value for $TERM and no -T specified\n\nTraceback (most recent call last):\n  File \"/srv/pokybuild/yocto-worker/oe-selftest-armhost/build/layers/openembedded-core/meta/lib/oeqa/core/decorator/__init__.py\", line 35, in wrapped_f\n    return func(*args, **kwargs)\n           ^^^^^^^^^^^^^^^^^^^^^\n  File \"/srv/pokybuild/yocto-worker/oe-selftest-armhost/build/layers/openembedded-core/meta/lib/oeqa/core/decorator/__init__.py\", line 35, in wrapped_f\n    return func(*args, **kwargs)\n           ^^^^^^^^^^^^^^^^^^^^^\n  File \"/srv/pokybuild/yocto-worker/oe-selftest-armhost/build/layers/openembedded-core/meta/lib/oeqa/runtime/cases/weston.py\", line 90, in test_weston_supports_xwayland\n    self.assertEqual(status, 0, msg=msg)\nAssertionError: 1 != 0 : xwayland does not appear to be running\n\nTest requires xserver-nodm-init to be installed\nRESULTS:\nRESULTS - date.DateTest.test_date: PASSED (2.20s)\nRESULTS - df.DfTest.test_df: PASSED (0.55s)\nRESULTS - logrotate.LogrotateTest.test_logrotate_newlog: PASSED (3.92s)\nRESULTS - logrotate.LogrotateTest.test_logrotate_wtmp: PASSED (2.51s)\nRESULTS - oe_syslog.SyslogTest.test_syslog_running: PASSED (0.56s)\nRESULTS - oe_syslog.SyslogTestConfig.test_syslog_logger: PASSED (1.91s)\nRESULTS - oe_syslog.SyslogTestConfig.test_syslog_restart: PASSED (1.63s)\nRESULTS - parselogs.ParseLogsTest.test_get_context: PASSED (0.00s)\nRESULTS - parselogs.ParseLogsTest.test_parselogs: PASSED (3.08s)\nRESULTS - ping.PingTest.test_ping: PASSED (0.02s)\nRESULTS - rpm.RpmBasicTest.test_rpm_help: PASSED (0.56s)\nRESULTS - scp.ScpTest.test_scp_file: PASSED (1.17s)\nRESULTS - ssh.SSHTest.test_ssh: PASSED (0.55s)\nRESULTS - apt.AptRepoTest.test_apt_install_from_repo: SKIPPED (0.00s)\nRESULTS - buildcpio.BuildCpioTest.test_cpio: SKIPPED (0.00s)\nRESULTS - buildgalculator.GalculatorTest.test_galculator: SKIPPED (0.00s)\nRESULTS - buildlzip.BuildLzipTest.test_lzip: SKIPPED (0.00s)\nRESULTS - connman.ConnmanTest.test_connmand_help: SKIPPED (0.00s)\nRESULTS - connman.ConnmanTest.test_connmand_running: SKIPPED (0.00s)\nRESULTS - dnf.DnfBasicTest.test_dnf_help: SKIPPED (0.00s)\nRESULTS - dnf.DnfBasicTest.test_dnf_history: SKIPPED (0.00s)\nRESULTS - dnf.DnfBasicTest.test_dnf_info: SKIPPED (0.00s)\nRESULTS - dnf.DnfBasicTest.test_dnf_search: SKIPPED (0.00s)\nRESULTS - dnf.DnfBasicTest.test_dnf_version: SKIPPED (0.00s)\nRESULTS - dnf.DnfRepoTest.test_dnf_exclude: SKIPPED (0.00s)\nRESULTS - dnf.DnfRepoTest.test_dnf_install: SKIPPED (0.00s)\nRESULTS - dnf.DnfRepoTest.test_dnf_install_dependency: SKIPPED (0.00s)\nRESULTS - dnf.DnfRepoTest.test_dnf_install_from_disk: SKIPPED (0.00s)\nRESULTS - dnf.DnfRepoTest.test_dnf_install_from_http: SKIPPED (0.00s)\nRESULTS - dnf.DnfRepoTest.test_dnf_installroot: SKIPPED (0.00s)\nRESULTS - dnf.DnfRepoTest.test_dnf_installroot_usrmerge: SKIPPED (0.00s)\nRESULTS - dnf.DnfRepoTest.test_dnf_makecache: SKIPPED (0.00s)\nRESULTS - dnf.DnfRepoTest.test_dnf_reinstall: SKIPPED (0.00s)\nRESULTS - dnf.DnfRepoTest.test_dnf_repoinfo: SKIPPED (0.00s)\nRESULTS - gcc.GccCompileTest.test_gcc_compile: SKIPPED (0.00s)\nRESULTS - gcc.GccCompileTest.test_gpp2_compile: SKIPPED (0.00s)\nRESULTS - gcc.GccCompileTest.test_gpp_compile: SKIPPED (0.00s)\nRESULTS - gcc.GccCompileTest.test_make: SKIPPED (0.00s)\nRESULTS - gi.GObjectIntrospectionTest.test_python: SKIPPED (0.00s)\nRESULTS - go.CgoHelloworldTest.test_cgohelloworld: SKIPPED (0.00s)\nRESULTS - go.GoCompileTest.test_go_compile: SKIPPED (0.00s)\nRESULTS - go.GoCompileTest.test_go_module: SKIPPED (0.00s)\nRESULTS - go.GoHelloworldTest.test_gohelloworld: SKIPPED (0.00s)\nRESULTS - kernelmodule.KernelModuleTest.test_kernel_module: SKIPPED (0.00s)\nRESULTS - ldd.LddTest.test_ldd: SKIPPED (0.00s)\nRESULTS - oe_syslog.SyslogTestConfig.test_syslog_startup_config: SKIPPED (0.00s)\nRESULTS - opkg.OpkgRepoTest.test_opkg_install_from_repo: SKIPPED (0.00s)\nRESULTS - pam.PamBasicTest.test_pam: SKIPPED (0.00s)\nRESULTS - perl.PerlTest.test_perl_works: SKIPPED (0.00s)\nRESULTS - ptest.PtestRunnerTest.test_ptestrunner_expectfail: SKIPPED (0.00s)\nRESULTS - ptest.PtestRunnerTest.test_ptestrunner_expectsuccess: SKIPPED (0.00s)\nRESULTS - python.PythonTest.test_python3: SKIPPED (0.00s)\nRESULTS - rpm.RpmBasicTest.test_rpm_query: SKIPPED (0.55s)\nRESULTS - rpm.RpmBasicTest.test_rpm_query_nonroot: SKIPPED (0.00s)\nRESULTS - rpm.RpmInstallRemoveTest.test_check_rpm_install_removal_log_file_size: SKIPPED (0.00s)\nRESULTS - rpm.RpmInstallRemoveTest.test_rpm_install: SKIPPED (0.00s)\nRESULTS - rpm.RpmInstallRemoveTest.test_rpm_remove: SKIPPED (0.00s)\nRESULTS - rust.RustCLibExampleTest.test_rust_c_lib_example: SKIPPED (0.00s)\nRESULTS - rust.RustCompileTest.test_cargo_compile: SKIPPED (0.00s)\nRESULTS - rust.RustCompileTest.test_rust_compile: SKIPPED (0.00s)\nRESULTS - stap.StapTest.test_stap: SKIPPED (0.00s)\nRESULTS - systemd.SystemdBasicTests.test_systemd_basic: SKIPPED (0.00s)\nRESULTS - systemd.SystemdBasicTests.test_systemd_failed: SKIPPED (0.00s)\nRESULTS - systemd.SystemdBasicTests.test_systemd_list: SKIPPED (0.00s)\nRESULTS - systemd.SystemdJournalTests.test_systemd_boot_time: SKIPPED (0.00s)\nRESULTS - systemd.SystemdJournalTests.test_systemd_journal: SKIPPED (0.00s)\nRESULTS - systemd.SystemdServiceTests.test_systemd_coredump_minidebuginfo: SKIPPED (0.00s)\nRESULTS - systemd.SystemdServiceTests.test_systemd_disable_enable: SKIPPED (0.00s)\nRESULTS - systemd.SystemdServiceTests.test_systemd_disable_enable_ro: SKIPPED (0.00s)\nRESULTS - systemd.SystemdServiceTests.test_systemd_status: SKIPPED (0.00s)\nRESULTS - systemd.SystemdServiceTests.test_systemd_stop_start: SKIPPED (0.00s)\nRESULTS - weston.WestonTest.test_wayland_info: SKIPPED (0.00s)\nRESULTS - weston.WestonTest.test_weston_can_initialize_new_wayland_compositor: SKIPPED (0.00s)\nRESULTS - weston.WestonTest.test_weston_running: SKIPPED (0.00s)\nRESULTS - weston.WestonTest.test_weston_supports_xwayland: SKIPPED (0.00s)\nRESULTS - xorg.XorgTest.test_xorg_running: SKIPPED (0.00s)\nSUMMARY:\ncore-image-full-cmdline () - Ran 76 tests in 19.283s\ncore-image-full-cmdline - OK - All required tests passed (successes=13, skipped=63, failures=0, errors=0)\nNOTE: recipe core-image-full-cmdline-1.0-r0: task do_testimage: Succeeded\nWARNING: core-image-weston-1.0-r0 do_testimage: Can not retrieve artifacts from test target: Error while fetching compressed artifacts\nOutput from runqemu:\nrunqemu - INFO - Received signal: 15\nrunqemu - INFO - Cleaning up\nrunqemu - INFO - Host uptime: 78526.11\n\nrunqemu - INFO - Removing /srv/pokybuild/yocto-worker/oe-selftest-armhost/build/build-st-3346236/tmp/deploy/images/qemuarm64/core-image-weston-qemuarm64.rootfs-20260623144153.ext4\nrunqemu - INFO - Removing /home/pokybuild/tmp/core-image-weston-qemuarm64.rootfs-20260623144153.ext4.428509\ntput: No value for $TERM and no -T specified\n\nRESULTS:\nRESULTS - date.DateTest.test_date: PASSED (2.19s)\nRESULTS - df.DfTest.test_df: PASSED (0.55s)\nRESULTS - oe_syslog.SyslogTest.test_syslog_running: PASSED (0.55s)\nRESULTS - oe_syslog.SyslogTestConfig.test_syslog_logger: PASSED (1.90s)\nRESULTS - oe_syslog.SyslogTestConfig.test_syslog_restart: PASSED (4.53s)\nRESULTS - oe_syslog.SyslogTestConfig.test_syslog_startup_config: PASSED (10.70s)\nRESULTS - parselogs.ParseLogsTest.test_get_context: PASSED (0.00s)\nRESULTS - parselogs.ParseLogsTest.test_parselogs: PASSED (2.40s)\nRESULTS - ping.PingTest.test_ping: PASSED (0.02s)\nRESULTS - rpm.RpmBasicTest.test_rpm_help: PASSED (0.56s)\nRESULTS - scp.ScpTest.test_scp_file: PASSED (1.15s)\nRESULTS - ssh.SSHTest.test_ssh: PASSED (0.55s)\nRESULTS - apt.AptRepoTest.test_apt_install_from_repo: SKIPPED (0.00s)\nRESULTS - buildcpio.BuildCpioTest.test_cpio: SKIPPED (0.00s)\nRESULTS - buildgalculator.GalculatorTest.test_galculator: SKIPPED (0.00s)\nRESULTS - buildlzip.BuildLzipTest.test_lzip: SKIPPED (0.00s)\nRESULTS - connman.ConnmanTest.test_connmand_help: SKIPPED (0.00s)\nRESULTS - connman.ConnmanTest.test_connmand_running: SKIPPED (0.00s)\nRESULTS - dnf.DnfBasicTest.test_dnf_help: SKIPPED (0.00s)\nRESULTS - dnf.DnfBasicTest.test_dnf_history: SKIPPED (0.00s)\nRESULTS - dnf.DnfBasicTest.test_dnf_info: SKIPPED (0.00s)\nRESULTS - dnf.DnfBasicTest.test_dnf_search: SKIPPED (0.00s)\nRESULTS - dnf.DnfBasicTest.test_dnf_version: SKIPPED (0.00s)\nRESULTS - dnf.DnfRepoTest.test_dnf_exclude: SKIPPED (0.00s)\nRESULTS - dnf.DnfRepoTest.test_dnf_install: SKIPPED (0.00s)\nRESULTS - dnf.DnfRepoTest.test_dnf_install_dependency: SKIPPED (0.00s)\nRESULTS - dnf.DnfRepoTest.test_dnf_install_from_disk: SKIPPED (0.00s)\nRESULTS - dnf.DnfRepoTest.test_dnf_install_from_http: SKIPPED (0.00s)\nRESULTS - dnf.DnfRepoTest.test_dnf_installroot: SKIPPED (0.00s)\nRESULTS - dnf.DnfRepoTest.test_dnf_installroot_usrmerge: SKIPPED (0.00s)\nRESULTS - dnf.DnfRepoTest.test_dnf_makecache: SKIPPED (0.00s)\nRESULTS - dnf.DnfRepoTest.test_dnf_reinstall: SKIPPED (0.00s)\nRESULTS - dnf.DnfRepoTest.test_dnf_repoinfo: SKIPPED (0.00s)\nRESULTS - gcc.GccCompileTest.test_gcc_compile: SKIPPED (0.00s)\nRESULTS - gcc.GccCompileTest.test_gpp2_compile: SKIPPED (0.00s)\nRESULTS - gcc.GccCompileTest.test_gpp_compile: SKIPPED (0.00s)\nRESULTS - gcc.GccCompileTest.test_make: SKIPPED (0.00s)\nRESULTS - gi.GObjectIntrospectionTest.test_python: SKIPPED (0.00s)\nRESULTS - go.CgoHelloworldTest.test_cgohelloworld: SKIPPED (0.00s)\nRESULTS - go.GoCompileTest.test_go_compile: SKIPPED (0.00s)\nRESULTS - go.GoCompileTest.test_go_module: SKIPPED (0.00s)\nRESULTS - go.GoHelloworldTest.test_gohelloworld: SKIPPED (0.00s)\nRESULTS - kernelmodule.KernelModuleTest.test_kernel_module: SKIPPED (0.00s)\nRESULTS - ldd.LddTest.test_ldd: SKIPPED (0.00s)\nRESULTS - logrotate.LogrotateTest.test_logrotate_newlog: SKIPPED (0.00s)\nRESULTS - logrotate.LogrotateTest.test_logrotate_wtmp: SKIPPED (0.00s)\nRESULTS - opkg.OpkgRepoTest.test_opkg_install_from_repo: SKIPPED (0.00s)\nRESULTS - pam.PamBasicTest.test_pam: SKIPPED (0.00s)\nRESULTS - perl.PerlTest.test_perl_works: SKIPPED (0.00s)\nRESULTS - ptest.PtestRunnerTest.test_ptestrunner_expectfail: SKIPPED (0.00s)\nRESULTS - ptest.PtestRunnerTest.test_ptestrunner_expectsuccess: SKIPPED (0.00s)\nRESULTS - python.PythonTest.test_python3: SKIPPED (0.00s)\nRESULTS - rpm.RpmBasicTest.test_rpm_query: SKIPPED (0.55s)\nRESULTS - rpm.RpmBasicTest.test_rpm_query_nonroot: SKIPPED (0.00s)\nRESULTS - rpm.RpmInstallRemoveTest.test_check_rpm_install_removal_log_file_size: SKIPPED (0.00s)\nRESULTS - rpm.RpmInstallRemoveTest.test_rpm_install: SKIPPED (0.00s)\nRESULTS - rpm.RpmInstallRemoveTest.test_rpm_remove: SKIPPED (0.00s)\nRESULTS - rust.RustCLibExampleTest.test_rust_c_lib_example: SKIPPED (0.00s)\nRESULTS - rust.RustCompileTest.test_cargo_compile: SKIPPED (0.00s)\nRESULTS - rust.RustCompileTest.test_rust_compile: SKIPPED (0.00s)\nRESULTS - stap.StapTest.test_stap: SKIPPED (0.00s)\nRESULTS - systemd.SystemdBasicTests.test_systemd_basic: SKIPPED (0.00s)\nRESULTS - systemd.SystemdBasicTests.test_systemd_failed: SKIPPED (0.00s)\nRESULTS - systemd.SystemdBasicTests.test_systemd_list: SKIPPED (0.00s)\nRESULTS - systemd.SystemdJournalTests.test_systemd_boot_time: SKIPPED (0.00s)\nRESULTS - systemd.SystemdJournalTests.test_systemd_journal: SKIPPED (0.00s)\nRESULTS - systemd.SystemdServiceTests.test_systemd_coredump_minidebuginfo: SKIPPED (0.00s)\nRESULTS - systemd.SystemdServiceTests.test_systemd_disable_enable: SKIPPED (0.00s)\nRESULTS - systemd.SystemdServiceTests.test_systemd_disable_enable_ro: SKIPPED (0.00s)\nRESULTS - systemd.SystemdServiceTests.test_systemd_status: SKIPPED (0.00s)\nRESULTS - systemd.SystemdServiceTests.test_systemd_stop_start: SKIPPED (0.00s)\nRESULTS - xorg.XorgTest.test_xorg_running: SKIPPED (0.00s)\nRESULTS - weston.WestonTest.test_wayland_info: FAILED (0.55s)\nRESULTS - weston.WestonTest.test_weston_can_initialize_new_wayland_compositor: FAILED (0.35s)\nRESULTS - weston.WestonTest.test_weston_running: FAILED (0.89s)\nRESULTS - weston.WestonTest.test_weston_supports_xwayland: FAILED (0.89s)\nSUMMARY:\ncore-image-weston () - Ran 76 tests in 28.407s\ncore-image-weston - FAIL - Required tests failed (successes=12, skipped=60, failures=4, errors=0)\ncore-image-weston - FAILED - Last lines of QEMU boot log:\n\nStarting bluetooth: bluetoothd.\n\nStarting syslogd/klogd: done\n\n * Starting Avahi mDNS/DNS-SD Daemon: avahi-daemon\n\n   ...done.\n\n\n\nPoky (Yocto Project Reference Distro) 6.0.99+snapshot-10ace5cb9e4b9b323c3f713d3b15b6554681af2f qemuarm64 /dev/hvc0\n\n\n\nType 'root' to login with superuser privileges (no password will be asked).\n\n\n\nqemuarm64 login: \nERROR: core-image-weston-1.0-r0 do_testimage: core-image-weston - FAILED - also check the logs in /srv/pokybuild/yocto-worker/oe-selftest-armhost/build/build-st-3346236/tmp/log\nNOTE: recipe core-image-weston-1.0-r0: task do_testimage: Succeeded\nNOTE: Tasks Summary: Attempted 1519 tasks of which 1517 didn't need to be rerun and all succeeded.\n\nSummary: There was 1 WARNING message.\nSummary: There was 1 ERROR message, returning a non-zero exit code.\n\n\nStderr:\n2026-06-23 12:52:05,334 - oe-selftest - INFO - Adding: \"include selftest.inc\" in /srv/pokybuild/yocto-worker/oe-selftest-armhost/build/build-st-3346236/conf/local.conf\n2026-06-23 12:52:05,335 - oe-selftest - INFO - Adding: \"include bblayers.inc\" in bblayers.conf\n/usr/lib/python3.12/unittest/case.py:580: RuntimeWarning: TestResult has no addDuration method\n  warnings.warn(\"TestResult has no addDuration method\",\n\n",
    "status": "FAILED"
   },
   "incompatible_lic.NoGPL3InImagesTests.test_core_image_minimal": {
    "duration": 81.75355982780457,
    "status": "PASSED"
   },
   "install.InstallTests.test_gstreamer_plugins": {
    "duration": 6725.200301170349,
    "status": "PASSED"
   },
   "install.InstallTests.test_linux_firmware": {
    "duration": 166.0054714679718,
    "status": "PASSED"
   },
   "install.InstallTests.test_linux_modules": {
    "duration": 97.86891150474548,
    "status": "PASSED"
   },
   "install.InstallTests.test_perl": {
    "duration": 102.1851794719696,
    "status": "PASSED"
   },
   "install.InstallTests.test_python": {
    "duration": 90.36050820350647,
    "status": "PASSED"
   },
   "intercept.GitCheck.test_git_intercept": {
    "duration": 25.96066117286682,
    "status": "PASSED"
   },
   "kerneldevelopment.KernelDev.test_apply_patches": {
    "duration": 219.46889734268188,
    "status": "PASSED"
   },
   "kernelmodulesplit.KernelModuleSplit.test_cross_recipe_module_dependency": {
    "duration": 615.5398709774017,
    "status": "PASSED"
   },
   "layerappend.LayerAppendTests.test_layer_appends": {
    "duration": 81.3311231136322,
    "status": "PASSED"
   },
   "liboe.CopyTreeTests.test_copy_hardlink_tree_count": {
    "duration": 0.026951074600219727,
    "status": "PASSED"
   },
   "liboe.CopyTreeTests.test_copy_tree_special": {
    "duration": 0.020531892776489258,
    "status": "PASSED"
   },
   "liboe.CopyTreeTests.test_copy_tree_xattr": {
    "duration": 61.316760540008545,
    "status": "PASSED"
   },
   "liboe.SubprocessTests.test_subprocess_tweak": {
    "duration": 0.014497756958007812,
    "status": "PASSED"
   },
   "lic_checksum.LicenseTests.test_checksum_with_space": {
    "duration": 46.96332001686096,
    "status": "PASSED"
   },
   "lic_checksum.LicenseTests.test_nonmatching_checksum": {
    "duration": 27.788957595825195,
    "status": "PASSED"
   },
   "locales.LocalesTest.test_locales_off": {
    "duration": 185.78545475006104,
    "status": "PASSED"
   },
   "locales.LocalesTest.test_locales_on": {
    "duration": 159.25253129005432,
    "status": "PASSED"
   },
   "manifest.VerifyManifest.test_SDK_manifest_entries": {
    "duration": 675.8973596096039,
    "status": "PASSED"
   },
   "manifest.VerifyManifest.test_image_manifest_entries": {
    "duration": 15.206246376037598,
    "status": "PASSED"
   },
   "minidebuginfo.Minidebuginfo.test_minidebuginfo": {
    "duration": 1917.211179971695,
    "status": "PASSED"
   },
   "minidebuginfo.Minidebuginfo.test_minidebuginfo_qemu": {
    "duration": 1673.56507730484,
    "oetags": [
     "runqemu"
    ],
    "status": "PASSED"
   },
   "multiconfig.MultiConfig.test_multiconfig": {
    "duration": 543.6634378433228,
    "status": "PASSED"
   },
   "multiconfig.MultiConfig.test_multiconfig_inlayer": {
    "duration": 85.66943216323853,
    "status": "PASSED"
   },
   "multiconfig.MultiConfig.test_multiconfig_reparse": {
    "duration": 162.59963130950928,
    "status": "PASSED"
   },
   "newlib.NewlibTest.test_newlib": {
    "duration": 158.3702094554901,
    "status": "PASSED"
   },
   "oelib.buildhistory.TestBlobParsing.test_blob_to_dict": {
    "duration": 1.5112812519073486,
    "status": "PASSED"
   },
   "oelib.buildhistory.TestBlobParsing.test_compare_dict_blobs": {
    "duration": 0.988915205001831,
    "status": "PASSED"
   },
   "oelib.buildhistory.TestBlobParsing.test_compare_dict_blobs_default": {
    "duration": 0.9411141872406006,
    "status": "PASSED"
   },
   "oelib.buildhistory.TestFileListCompare.test_compare_file_lists": {
    "duration": 0.15269923210144043,
    "status": "PASSED"
   },
   "oelib.elf.TestElf.test_machine_name": {
    "duration": 0.0009829998016357422,
    "status": "PASSED"
   },
   "oelib.license.TestComplexCombinations.test_tests": {
    "duration": 0.00536346435546875,
    "status": "PASSED"
   },
   "oelib.license.TestIsIncluded.test_tests": {
    "duration": 0.0034711360931396484,
    "status": "PASSED"
   },
   "oelib.license.TestSimpleCombinations.test_tests": {
    "duration": 0.0010530948638916016,
    "status": "PASSED"
   },
   "oelib.license.TestSingleLicense.test_invalid_licenses": {
    "duration": 0.001007080078125,
    "status": "PASSED"
   },
   "oelib.license.TestSingleLicense.test_single_licenses": {
    "duration": 0.0011060237884521484,
    "status": "PASSED"
   },
   "oelib.package.TestCopyDebugSources.test_copydebugsources_copies_files_and_dereferences_links": {
    "duration": 0.02820420265197754,
    "status": "PASSED"
   },
   "oelib.package.TestCopyDebugSources.test_copydebugsources_ignores_copy_failure": {
    "duration": 0.007108449935913086,
    "status": "PASSED"
   },
   "oelib.package.TestCopyDebugSources.test_copydebugsources_ignores_empty_externalsrc_relocation": {
    "duration": 0.01137232780456543,
    "status": "PASSED"
   },
   "oelib.package.TestCopyDebugSources.test_copydebugsources_moves_externalsrc_relocation": {
    "duration": 0.01591038703918457,
    "status": "PASSED"
   },
   "oelib.path.TestRealPath.test_loop": {
    "duration": 0.00441431999206543,
    "status": "PASSED"
   },
   "oelib.path.TestRealPath.test_norm": {
    "duration": 0.0033578872680664062,
    "status": "PASSED"
   },
   "oelib.path.TestRealPath.test_phys": {
    "duration": 0.0022916793823242188,
    "status": "PASSED"
   },
   "oelib.types.TestBooleanType.test_bool_equality": {
    "duration": 0.0008196830749511719,
    "status": "PASSED"
   },
   "oelib.types.TestBooleanType.test_false": {
    "duration": 0.0008976459503173828,
    "status": "PASSED"
   },
   "oelib.types.TestBooleanType.test_invalid": {
    "duration": 0.0010917186737060547,
    "status": "PASSED"
   },
   "oelib.types.TestBooleanType.test_true": {
    "duration": 0.0030083656311035156,
    "status": "PASSED"
   },
   "oelib.types.TestList.test_list_nosep": {
    "duration": 0.0008089542388916016,
    "status": "PASSED"
   },
   "oelib.types.TestList.test_list_usersep": {
    "duration": 0.0015947818756103516,
    "status": "PASSED"
   },
   "oelib.utils.TestDefaultFeatures.test_filter_default_features": {
    "duration": 0.003487825393676758,
    "status": "PASSED"
   },
   "oelib.utils.TestMultiprocessLaunch.test_multiprocesslaunch": {
    "duration": 0.03603816032409668,
    "status": "PASSED"
   },
   "oelib.utils.TestPackagesFilterOutSystem.test_filter": {
    "duration": 0.001462697982788086,
    "status": "PASSED"
   },
   "oelib.utils.TestTrimVersion.test_num_exception": {
    "duration": 0.0023109912872314453,
    "status": "PASSED"
   },
   "oelib.utils.TestTrimVersion.test_valid": {
    "duration": 0.002161264419555664,
    "status": "PASSED"
   },
   "oelib.utils.TestTrimVersion.test_version_exception": {
    "duration": 0.0022096633911132812,
    "status": "PASSED"
   },
   "oescripts.OEGitproxyTests.test_oegitproxy_help": {
    "duration": 1.4791817665100098,
    "status": "PASSED"
   },
   "oescripts.OEGitproxyTests.test_oegitproxy_proxy": {
    "duration": 0.4470081329345703,
    "status": "PASSED"
   },
   "oescripts.OEGitproxyTests.test_oegitproxy_proxy_dash": {
    "duration": 0.3214693069458008,
    "status": "PASSED"
   },
   "oescripts.OEListPackageconfigTests.test_packageconfig_flags_default": {
    "duration": 356.93229818344116,
    "status": "PASSED"
   },
   "oescripts.OEListPackageconfigTests.test_packageconfig_flags_help": {
    "duration": 0.41884398460388184,
    "status": "PASSED"
   },
   "oescripts.OEListPackageconfigTests.test_packageconfig_flags_option_all": {
    "duration": 395.84727239608765,
    "status": "PASSED"
   },
   "oescripts.OEListPackageconfigTests.test_packageconfig_flags_option_flags": {
    "duration": 453.92203664779663,
    "status": "PASSED"
   },
   "oescripts.OEListPackageconfigTests.test_packageconfig_flags_options_preferred_only": {
    "duration": 488.29240798950195,
    "status": "PASSED"
   },
   "oescripts.OEPybootchartguyTests.test_pybootchartguy_help": {
    "duration": 0.13073182106018066,
    "status": "PASSED"
   },
   "oescripts.OEPybootchartguyTests.test_pybootchartguy_to_generate_build_pdf_output": {
    "duration": 0.1512589454650879,
    "status": "PASSED"
   },
   "oescripts.OEPybootchartguyTests.test_pybootchartguy_to_generate_build_png_output": {
    "duration": 0.37558627128601074,
    "status": "PASSED"
   },
   "oescripts.OEPybootchartguyTests.test_pybootchartguy_to_generate_build_svg_output": {
    "duration": 0.14360785484313965,
    "status": "PASSED"
   },
   "oescripts.OeRunNativeTest.test_oe_run_native": {
    "duration": 38.6198296546936,
    "status": "PASSED"
   },
   "overlayfs.OverlayFSEtcRunTimeTests.test_all_required_variables_set": {
    "duration": 1199.5903968811035,
    "oetags": [
     "runqemu"
    ],
    "status": "PASSED"
   },
   "overlayfs.OverlayFSEtcRunTimeTests.test_image_feature_conflict": {
    "duration": 36.56704235076904,
    "oetags": [
     "runqemu"
    ],
    "status": "PASSED"
   },
   "overlayfs.OverlayFSEtcRunTimeTests.test_image_feature_is_missing": {
    "duration": 0.0034105777740478516,
    "log": "tests are qemux86-64 specific currently\n",
    "oetags": [
     "runqemu"
    ],
    "status": "SKIPPED"
   },
   "overlayfs.OverlayFSEtcRunTimeTests.test_lower_layer_access": {
    "duration": 0.003562450408935547,
    "log": "tests are qemux86-64 specific currently\n",
    "oetags": [
     "runqemu"
    ],
    "status": "SKIPPED"
   },
   "overlayfs.OverlayFSEtcRunTimeTests.test_postinst_on_target_for_read_only_rootfs": {
    "duration": 0.003682374954223633,
    "log": "tests are qemux86-64 specific currently\n",
    "oetags": [
     "runqemu"
    ],
    "status": "SKIPPED"
   },
   "overlayfs.OverlayFSEtcRunTimeTests.test_sbin_init_original": {
    "duration": 0.0037679672241210938,
    "log": "tests are qemux86-64 specific currently\n",
    "oetags": [
     "runqemu"
    ],
    "status": "SKIPPED"
   },
   "overlayfs.OverlayFSEtcRunTimeTests.test_sbin_init_preinit": {
    "duration": 0.0038666725158691406,
    "log": "tests are qemux86-64 specific currently\n",
    "oetags": [
     "runqemu"
    ],
    "status": "SKIPPED"
   },
   "overlayfs.OverlayFSEtcRunTimeTests.test_sbin_init_read_only": {
    "duration": 0.003922224044799805,
    "log": "tests are qemux86-64 specific currently\n",
    "oetags": [
     "runqemu"
    ],
    "status": "SKIPPED"
   },
   "overlayfs.OverlayFSTests.test_correct_image_fstab": {
    "duration": 810.2616801261902,
    "oetags": [
     "runqemu"
    ],
    "status": "PASSED"
   },
   "overlayfs.OverlayFSTests.test_correct_image_unit": {
    "duration": 110.57820868492126,
    "oetags": [
     "runqemu"
    ],
    "status": "PASSED"
   },
   "overlayfs.OverlayFSTests.test_distro_features_missing": {
    "duration": 41.27441167831421,
    "status": "PASSED"
   },
   "overlayfs.OverlayFSTests.test_mount_unit_not_set": {
    "duration": 20.668494701385498,
    "status": "PASSED"
   },
   "overlayfs.OverlayFSTests.test_not_all_units_installed": {
    "duration": 224.2140657901764,
    "status": "PASSED"
   },
   "overlayfs.OverlayFSTests.test_not_all_units_installed_but_qa_skipped": {
    "duration": 120.13139653205872,
    "status": "PASSED"
   },
   "overlayfs.OverlayFSTests.test_wrong_mount_unit_set": {
    "duration": 23.126461267471313,
    "status": "PASSED"
   },
   "package.PackageTests.test_gdb_hardlink_debug": {
    "duration": 117.77021670341492,
    "status": "PASSED"
   },
   "package.PackageTests.test_package_name_conflict": {
    "duration": 19.774109840393066,
    "status": "PASSED"
   },
   "package.PackageTests.test_preserve_ownership": {
    "duration": 109.07176280021667,
    "status": "PASSED"
   },
   "package.PackageTests.test_preserve_sparse_hardlinks": {
    "duration": 53.362390756607056,
    "status": "PASSED"
   },
   "package.VersionOrdering.test_dpkg": {
    "duration": 0.06762909889221191,
    "status": "PASSED"
   },
   "package.VersionOrdering.test_opkg": {
    "duration": 0.08205413818359375,
    "status": "PASSED"
   },
   "package.VersionOrdering.test_rpm": {
    "duration": 0.33641862869262695,
    "status": "PASSED"
   },
   "picolibc.PicolibcTest.test_picolibc": {
    "duration": 336.806001663208,
    "status": "PASSED"
   },
   "pkgdata.OePkgdataUtilTests.test_find_path": {
    "duration": 3.206979513168335,
    "status": "PASSED"
   },
   "pkgdata.OePkgdataUtilTests.test_glob": {
    "duration": 2.6999776363372803,
    "status": "PASSED"
   },
   "pkgdata.OePkgdataUtilTests.test_list_pkg_files": {
    "duration": 9.731266260147095,
    "status": "PASSED"
   },
   "pkgdata.OePkgdataUtilTests.test_list_pkgs": {
    "duration": 8.112948179244995,
    "status": "PASSED"
   },
   "pkgdata.OePkgdataUtilTests.test_lookup_pkg": {
    "duration": 5.941632509231567,
    "status": "PASSED"
   },
   "pkgdata.OePkgdataUtilTests.test_lookup_recipe": {
    "duration": 3.017639398574829,
    "status": "PASSED"
   },
   "pkgdata.OePkgdataUtilTests.test_multilib_variables": {
    "duration": 69.80759310722351,
    "status": "PASSED"
   },
   "pkgdata.OePkgdataUtilTests.test_no_param": {
    "duration": 0.1250622272491455,
    "status": "PASSED"
   },
   "pkgdata.OePkgdataUtilTests.test_read_value": {
    "duration": 3.086534023284912,
    "status": "PASSED"
   },
   "pkgdata.OePkgdataUtilTests.test_specify_pkgdatadir": {
    "duration": 1.1254346370697021,
    "status": "PASSED"
   },
   "pokybleeding.PokyBleeding.test_poky_bleeding_autorev": {
    "duration": 112.35381174087524,
    "status": "PASSED"
   },
   "prservice.BitbakePrTests.test_import_export_override_db": {
    "duration": 1368.2325670719147,
    "status": "PASSED"
   },
   "prservice.BitbakePrTests.test_import_export_replace_db": {
    "duration": 156.13451862335205,
    "status": "PASSED"
   },
   "prservice.BitbakePrTests.test_pr_service_deb_arch_dep": {
    "duration": 144.0542893409729,
    "status": "PASSED"
   },
   "prservice.BitbakePrTests.test_pr_service_deb_arch_indep": {
    "duration": 42.96610474586487,
    "status": "PASSED"
   },
   "prservice.BitbakePrTests.test_pr_service_ipk_arch_dep": {
    "duration": 142.7101526260376,
    "status": "PASSED"
   },
   "prservice.BitbakePrTests.test_pr_service_ipk_arch_indep": {
    "duration": 40.10042405128479,
    "status": "PASSED"
   },
   "prservice.BitbakePrTests.test_pr_service_rpm_arch_dep": {
    "duration": 76.2218976020813,
    "status": "PASSED"
   },
   "prservice.BitbakePrTests.test_pr_service_rpm_arch_indep": {
    "duration": 38.660807371139526,
    "status": "PASSED"
   },
   "prservice.BitbakePrTests.test_stopping_prservice_message": {
    "duration": 0.8770616054534912,
    "status": "PASSED"
   },
   "pseudo.Pseudo.test_pseudo_pyc_creation": {
    "duration": 16.593803644180298,
    "status": "PASSED"
   },
   "recipetool.RecipetoolAppendTests.test_recipetool_appendfile_add": {
    "duration": 83.4721188545227,
    "status": "PASSED"
   },
   "recipetool.RecipetoolAppendTests.test_recipetool_appendfile_add_bindir": {
    "duration": 38.814769983291626,
    "status": "PASSED"
   },
   "recipetool.RecipetoolAppendTests.test_recipetool_appendfile_add_machine": {
    "duration": 38.97119355201721,
    "status": "PASSED"
   },
   "recipetool.RecipetoolAppendTests.test_recipetool_appendfile_alternatives": {
    "duration": 34.8804395198822,
    "status": "PASSED"
   },
   "recipetool.RecipetoolAppendTests.test_recipetool_appendfile_basic": {
    "duration": 38.068591594696045,
    "status": "PASSED"
   },
   "recipetool.RecipetoolAppendTests.test_recipetool_appendfile_binary": {
    "duration": 28.20216679573059,
    "status": "PASSED"
   },
   "recipetool.RecipetoolAppendTests.test_recipetool_appendfile_extlayer": {
    "duration": 6.493361473083496,
    "status": "PASSED"
   },
   "recipetool.RecipetoolAppendTests.test_recipetool_appendfile_inst_func": {
    "duration": 38.725008964538574,
    "status": "PASSED"
   },
   "recipetool.RecipetoolAppendTests.test_recipetool_appendfile_inst_glob": {
    "duration": 37.543683767318726,
    "status": "PASSED"
   },
   "recipetool.RecipetoolAppendTests.test_recipetool_appendfile_inst_todir_glob": {
    "duration": 39.34374499320984,
    "status": "PASSED"
   },
   "recipetool.RecipetoolAppendTests.test_recipetool_appendfile_invalid": {
    "duration": 37.30154490470886,
    "status": "PASSED"
   },
   "recipetool.RecipetoolAppendTests.test_recipetool_appendfile_orig": {
    "duration": 38.84953999519348,
    "status": "PASSED"
   },
   "recipetool.RecipetoolAppendTests.test_recipetool_appendfile_patch": {
    "duration": 38.51988911628723,
    "status": "PASSED"
   },
   "recipetool.RecipetoolAppendTests.test_recipetool_appendfile_postinstall": {
    "duration": 43.61032223701477,
    "status": "PASSED"
   },
   "recipetool.RecipetoolAppendTests.test_recipetool_appendfile_renamed": {
    "duration": 37.98806715011597,
    "status": "PASSED"
   },
   "recipetool.RecipetoolAppendTests.test_recipetool_appendfile_script": {
    "duration": 38.68428039550781,
    "status": "PASSED"
   },
   "recipetool.RecipetoolAppendTests.test_recipetool_appendfile_subdir": {
    "duration": 37.72368907928467,
    "status": "PASSED"
   },
   "recipetool.RecipetoolAppendTests.test_recipetool_appendfile_todir": {
    "duration": 38.54669666290283,
    "status": "PASSED"
   },
   "recipetool.RecipetoolAppendTests.test_recipetool_appendfile_wildcard": {
    "duration": 14.313935995101929,
    "status": "PASSED"
   },
   "recipetool.RecipetoolAppendsrcTests.test_recipetool_appendsrcfile_basic": {
    "duration": 101.7864248752594,
    "status": "PASSED"
   },
   "recipetool.RecipetoolAppendsrcTests.test_recipetool_appendsrcfile_basic_wildcard": {
    "duration": 63.87755060195923,
    "status": "PASSED"
   },
   "recipetool.RecipetoolAppendsrcTests.test_recipetool_appendsrcfile_existing_in_src_uri": {
    "duration": 25.996270895004272,
    "status": "PASSED"
   },
   "recipetool.RecipetoolAppendsrcTests.test_recipetool_appendsrcfile_existing_in_src_uri_diff_params": {
    "duration": 26.596388339996338,
    "status": "PASSED"
   },
   "recipetool.RecipetoolAppendsrcTests.test_recipetool_appendsrcfile_machine": {
    "duration": 79.96043181419373,
    "status": "PASSED"
   },
   "recipetool.RecipetoolAppendsrcTests.test_recipetool_appendsrcfile_replace_file_srcdir": {
    "duration": 45.51416540145874,
    "status": "PASSED"
   },
   "recipetool.RecipetoolAppendsrcTests.test_recipetool_appendsrcfile_srcdir_basic": {
    "duration": 30.49228310585022,
    "status": "PASSED"
   },
   "recipetool.RecipetoolAppendsrcTests.test_recipetool_appendsrcfile_subdir_basic": {
    "duration": 54.1095986366272,
    "status": "PASSED"
   },
   "recipetool.RecipetoolAppendsrcTests.test_recipetool_appendsrcfile_subdir_basic_dirdest": {
    "duration": 53.79536581039429,
    "status": "PASSED"
   },
   "recipetool.RecipetoolAppendsrcTests.test_recipetool_appendsrcfile_update_recipe_basic": {
    "duration": 12.339359521865845,
    "status": "PASSED"
   },
   "recipetool.RecipetoolAppendsrcTests.test_recipetool_appendsrcfiles_basic": {
    "duration": 72.3762571811676,
    "status": "PASSED"
   },
   "recipetool.RecipetoolAppendsrcTests.test_recipetool_appendsrcfiles_basic_subdir": {
    "duration": 64.56169128417969,
    "status": "PASSED"
   },
   "recipetool.RecipetoolCreateTests.test_recipetool_create": {
    "duration": 49.53142309188843,
    "status": "PASSED"
   },
   "recipetool.RecipetoolCreateTests.test_recipetool_create_autotools": {
    "duration": 88.25659775733948,
    "status": "PASSED"
   },
   "recipetool.RecipetoolCreateTests.test_recipetool_create_cmake": {
    "duration": 48.39049220085144,
    "status": "PASSED"
   },
   "recipetool.RecipetoolCreateTests.test_recipetool_create_git_http": {
    "duration": 51.344058990478516,
    "status": "PASSED"
   },
   "recipetool.RecipetoolCreateTests.test_recipetool_create_git_srcbranch": {
    "duration": 49.133979082107544,
    "status": "PASSED"
   },
   "recipetool.RecipetoolCreateTests.test_recipetool_create_git_srcuri_branch": {
    "duration": 51.51111078262329,
    "status": "PASSED"
   },
   "recipetool.RecipetoolCreateTests.test_recipetool_create_git_srcuri_master": {
    "duration": 48.258460521698,
    "status": "PASSED"
   },
   "recipetool.RecipetoolCreateTests.test_recipetool_create_github": {
    "duration": 51.566240072250366,
    "status": "PASSED"
   },
   "recipetool.RecipetoolCreateTests.test_recipetool_create_github_tarball": {
    "duration": 47.54851770401001,
    "status": "PASSED"
   },
   "recipetool.RecipetoolCreateTests.test_recipetool_create_go": {
    "duration": 64.18878960609436,
    "status": "PASSED"
   },
   "recipetool.RecipetoolCreateTests.test_recipetool_create_npm": {
    "duration": 1.318458080291748,
    "log": "Test needs meta-oe for nodejs\n",
    "status": "SKIPPED"
   },
   "recipetool.RecipetoolCreateTests.test_recipetool_create_python3_pep517_flit_core_buildapi": {
    "duration": 48.02191877365112,
    "status": "PASSED"
   },
   "recipetool.RecipetoolCreateTests.test_recipetool_create_python3_pep517_hatchling": {
    "duration": 48.61159920692444,
    "status": "PASSED"
   },
   "recipetool.RecipetoolCreateTests.test_recipetool_create_python3_pep517_maturin": {
    "duration": 46.48379874229431,
    "status": "PASSED"
   },
   "recipetool.RecipetoolCreateTests.test_recipetool_create_python3_pep517_mesonpy": {
    "duration": 52.279112339019775,
    "status": "PASSED"
   },
   "recipetool.RecipetoolCreateTests.test_recipetool_create_python3_pep517_poetry_core_masonry_api": {
    "duration": 47.645050287246704,
    "status": "PASSED"
   },
   "recipetool.RecipetoolCreateTests.test_recipetool_create_python3_pep517_setuptools_build_meta": {
    "duration": 44.82768535614014,
    "status": "PASSED"
   },
   "recipetool.RecipetoolCreateTests.test_recipetool_create_python3_pep517_setuptools_build_meta_license_pep639": {
    "duration": 49.042407512664795,
    "status": "PASSED"
   },
   "recipetool.RecipetoolCreateTests.test_recipetool_create_python3_pep517_setuptools_build_meta_license_prepep639": {
    "duration": 44.378982067108154,
    "status": "PASSED"
   },
   "recipetool.RecipetoolCreateTests.test_recipetool_create_python3_setuptools": {
    "duration": 50.97145390510559,
    "status": "PASSED"
   },
   "recipetool.RecipetoolCreateTests.test_recipetool_create_python3_setuptools_pypi": {
    "duration": 81.19011449813843,
    "status": "PASSED"
   },
   "recipetool.RecipetoolCreateTests.test_recipetool_create_python3_setuptools_pypi_tarball": {
    "duration": 47.252665758132935,
    "status": "PASSED"
   },
   "recipetool.RecipetoolCreateTests.test_recipetool_create_simple": {
    "duration": 47.63687872886658,
    "status": "PASSED"
   },
   "recipetool.RecipetoolTests.test_recipetool_handle_license_vars": {
    "duration": 2.10741925239563,
    "status": "PASSED"
   },
   "recipetool.RecipetoolTests.test_recipetool_load_plugin": {
    "duration": 10.48996639251709,
    "status": "PASSED"
   },
   "recipetool.RecipetoolTests.test_recipetool_split_pkg_licenses": {
    "duration": 0.03997659683227539,
    "status": "PASSED"
   },
   "recipeutils.RecipeUtilsTests.test_patch_recipe_appends": {
    "duration": 0.15510892868041992,
    "status": "PASSED"
   },
   "recipeutils.RecipeUtilsTests.test_patch_recipe_singleappend": {
    "duration": 0.143890380859375,
    "status": "PASSED"
   },
   "recipeutils.RecipeUtilsTests.test_patch_recipe_varflag": {
    "duration": 0.1008296012878418,
    "status": "PASSED"
   },
   "recipeutils.RecipeUtilsTests.test_split_var_value": {
    "duration": 0.00827646255493164,
    "status": "PASSED"
   },
   "recipeutils.RecipeUtilsTests.test_validate_pn": {
    "duration": 0.005354881286621094,
    "status": "PASSED"
   },
   "reproducible.DiffoscopeTests.test_diffoscope": {
    "log": "Skip by the command line argument \"reproducible\"\n",
    "status": "SKIPPED"
   },
   "reproducible.ReproducibleTests.test_reproducible_builds": {
    "log": "Skip by the command line argument \"reproducible\"\n",
    "status": "SKIPPED"
   },
   "resulttooltests.ResultToolTests.test_can_compare_ltp_tests": {
    "duration": 0.007848262786865234,
    "status": "PASSED"
   },
   "resulttooltests.ResultToolTests.test_can_match_non_static_ptest_names": {
    "duration": 0.005634307861328125,
    "status": "PASSED"
   },
   "resulttooltests.ResultToolTests.test_can_not_compare_non_ltp_tests": {
    "duration": 0.005590200424194336,
    "status": "PASSED"
   },
   "resulttooltests.ResultToolTests.test_junit_empty_testresults": {
    "duration": 0.006430387496948242,
    "status": "PASSED"
   },
   "resulttooltests.ResultToolTests.test_junit_log_attached": {
    "duration": 0.007241725921630859,
    "status": "PASSED"
   },
   "resulttooltests.ResultToolTests.test_junit_log_inline": {
    "duration": 0.006639242172241211,
    "status": "PASSED"
   },
   "resulttooltests.ResultToolTests.test_junit_missing_image_tests": {
    "duration": 0.006433725357055664,
    "status": "PASSED"
   },
   "resulttooltests.ResultToolTests.test_junit_missing_ptests": {
    "duration": 0.006237506866455078,
    "status": "PASSED"
   },
   "resulttooltests.ResultToolTests.test_machine_matches": {
    "duration": 0.00573420524597168,
    "status": "PASSED"
   },
   "resulttooltests.ResultToolTests.test_machine_mismatches": {
    "duration": 0.0059244632720947266,
    "status": "PASSED"
   },
   "resulttooltests.ResultToolTests.test_merge_can_merged_results": {
    "duration": 0.005597114562988281,
    "status": "PASSED"
   },
   "resulttooltests.ResultToolTests.test_metadata_matching_is_only_checked_for_relevant_test_type": {
    "duration": 0.005597591400146484,
    "status": "PASSED"
   },
   "resulttooltests.ResultToolTests.test_regression_can_get_regression_base_target_pair": {
    "duration": 0.005644321441650391,
    "status": "PASSED"
   },
   "resulttooltests.ResultToolTests.test_regression_can_get_regression_result": {
    "duration": 0.006545305252075195,
    "status": "PASSED"
   },
   "resulttooltests.ResultToolTests.test_report_can_aggregate_test_result": {
    "duration": 0.005589962005615234,
    "status": "PASSED"
   },
   "resulttooltests.ResultToolTests.test_results_with_matching_metadata_can_be_compared": {
    "duration": 0.006566524505615234,
    "status": "PASSED"
   },
   "resulttooltests.ResultToolTests.test_results_with_mismatching_metadata_can_not_be_compared": {
    "duration": 0.005933523178100586,
    "status": "PASSED"
   },
   "resulttooltests.ResultToolTests.test_results_without_metadata_can_be_compared": {
    "duration": 0.005637407302856445,
    "status": "PASSED"
   },
   "resulttooltests.ResultToolTests.test_target_result_with_missing_metadata_can_not_be_compared": {
    "duration": 0.007010459899902344,
    "status": "PASSED"
   },
   "retain.Retain.test_retain_always": {
    "duration": 48.77220582962036,
    "status": "PASSED"
   },
   "retain.Retain.test_retain_failure": {
    "duration": 64.60648393630981,
    "status": "PASSED"
   },
   "retain.Retain.test_retain_global": {
    "duration": 73.96104145050049,
    "status": "PASSED"
   },
   "retain.Retain.test_retain_misc": {
    "duration": 105.80560231208801,
    "status": "PASSED"
   },
   "rootfspostcommandstests.ShadowUtilsTidyFiles.test_shadowutils_backup_files": {
    "duration": 36.96107220649719,
    "log": "Testcase skipped as 'tidy_shadowutils_files' rootfs post process command is not the set SORT_PASSWD_POSTPROCESS_COMMAND.\n",
    "status": "SKIPPED"
   },
   "rootfspostcommandstests.ShadowUtilsTidyFiles.test_shadowutils_sorted_files": {
    "duration": 7.171254396438599,
    "log": "Testcase skipped as 'tidy_shadowutils_files' rootfs post process command is not the set SORT_PASSWD_POSTPROCESS_COMMAND.\n",
    "status": "SKIPPED"
   },
   "rpmtests.BitbakeTests.test_rpm_filenames": {
    "duration": 24.952513456344604,
    "status": "PASSED"
   },
   "runcmd.RunCmdTests.test_list_not_found": {
    "duration": 0.011363506317138672,
    "status": "PASSED"
   },
   "runcmd.RunCmdTests.test_list_okay": {
    "duration": 0.027329206466674805,
    "status": "PASSED"
   },
   "runcmd.RunCmdTests.test_log": {
    "duration": 0.009282588958740234,
    "status": "PASSED"
   },
   "runcmd.RunCmdTests.test_log_split": {
    "duration": 0.007355213165283203,
    "status": "PASSED"
   },
   "runcmd.RunCmdTests.test_no_shell": {
    "duration": 0.006853818893432617,
    "status": "PASSED"
   },
   "runcmd.RunCmdTests.test_output": {
    "duration": 0.007358551025390625,
    "status": "PASSED"
   },
   "runcmd.RunCmdTests.test_output_split": {
    "duration": 0.0074346065521240234,
    "status": "PASSED"
   },
   "runcmd.RunCmdTests.test_result_assertion": {
    "duration": 0.026775836944580078,
    "status": "PASSED"
   },
   "runcmd.RunCmdTests.test_result_exception": {
    "duration": 0.01608753204345703,
    "status": "PASSED"
   },
   "runcmd.RunCmdTests.test_result_false": {
    "duration": 0.015167951583862305,
    "status": "PASSED"
   },
   "runcmd.RunCmdTests.test_result_okay": {
    "duration": 0.014353752136230469,
    "status": "PASSED"
   },
   "runcmd.RunCmdTests.test_shell": {
    "duration": 0.01414036750793457,
    "status": "PASSED"
   },
   "runcmd.RunCmdTests.test_stdin": {
    "duration": 0.009859323501586914,
    "status": "PASSED"
   },
   "runcmd.RunCmdTests.test_stdin_timeout": {
    "duration": 10.008156299591064,
    "status": "PASSED"
   },
   "runcmd.RunCmdTests.test_timeout": {
    "duration": 10.014620304107666,
    "status": "PASSED"
   },
   "runcmd.RunCmdTests.test_timeout_split": {
    "duration": 10.011141300201416,
    "status": "PASSED"
   },
   "runqemu.RunqemuTests.test_boot_compressed_wic_by_path": {
    "duration": 0.0016584396362304688,
    "log": "wic tests are qemux86-64 specific currently\n",
    "oetags": [
     "runqemu"
    ],
    "status": "SKIPPED"
   },
   "runqemu.RunqemuTests.test_boot_compressed_wic_by_recipe": {
    "duration": 0.001987457275390625,
    "log": "wic tests are qemux86-64 specific currently\n",
    "oetags": [
     "runqemu"
    ],
    "status": "SKIPPED"
   },
   "runqemu.RunqemuTests.test_boot_deploy": {
    "duration": 157.1847848892212,
    "oetags": [
     "runqemu"
    ],
    "status": "PASSED"
   },
   "runqemu.RunqemuTests.test_boot_deploy_hddimg": {
    "duration": 0.0007832050323486328,
    "log": "Test skipped on aarch64\n",
    "oetags": [
     "runqemu"
    ],
    "status": "SKIPPED"
   },
   "runqemu.RunqemuTests.test_boot_machine": {
    "duration": 26.455538272857666,
    "oetags": [
     "runqemu"
    ],
    "status": "PASSED"
   },
   "runqemu.RunqemuTests.test_boot_machine_ext4": {
    "duration": 27.13173770904541,
    "oetags": [
     "runqemu"
    ],
    "status": "PASSED"
   },
   "runqemu.RunqemuTests.test_boot_machine_iso": {
    "duration": 0.003967761993408203,
    "log": "Test skipped on aarch64\n",
    "oetags": [
     "runqemu"
    ],
    "status": "SKIPPED"
   },
   "runqemu.RunqemuTests.test_boot_machine_slirp": {
    "duration": 26.917590856552124,
    "oetags": [
     "runqemu"
    ],
    "status": "PASSED"
   },
   "runqemu.RunqemuTests.test_boot_machine_slirp_qcow2": {
    "duration": 0.0011074542999267578,
    "log": "tests are qemux86-64 specific currently\n",
    "oetags": [
     "runqemu"
    ],
    "status": "SKIPPED"
   },
   "runqemu.RunqemuTests.test_boot_qemu_boot": {
    "duration": 23.0759220123291,
    "oetags": [
     "runqemu"
    ],
    "status": "PASSED"
   },
   "runqemu.RunqemuTests.test_boot_recipe_image": {
    "duration": 34.20510959625244,
    "oetags": [
     "runqemu"
    ],
    "status": "PASSED"
   },
   "runqemu.RunqemuTests.test_boot_recipe_image_vdi": {
    "duration": 0.0031785964965820312,
    "log": "tests are qemux86-64 specific currently\n",
    "oetags": [
     "runqemu"
    ],
    "status": "SKIPPED"
   },
   "runqemu.RunqemuTests.test_boot_recipe_image_vmdk": {
    "duration": 0.0035293102264404297,
    "log": "tests are qemux86-64 specific currently\n",
    "oetags": [
     "runqemu"
    ],
    "status": "SKIPPED"
   },
   "runqemu.RunqemuTests.test_boot_rootfs": {
    "duration": 22.592631578445435,
    "oetags": [
     "runqemu"
    ],
    "status": "PASSED"
   },
   "runtime_test.Postinst.test_failing_postinst": {
    "duration": 256.2407796382904,
    "oetags": [
     "runqemu"
    ],
    "status": "PASSED"
   },
   "runtime_test.Postinst.test_postinst_rootfs_and_boot_systemd": {
    "duration": 703.0189123153687,
    "oetags": [
     "runqemu"
    ],
    "status": "PASSED"
   },
   "runtime_test.Postinst.test_postinst_rootfs_and_boot_sysvinit": {
    "duration": 339.4174954891205,
    "oetags": [
     "runqemu"
    ],
    "status": "PASSED"
   },
   "runtime_test.RustKernel.test_kernel_rust_sample": {
    "duration": 709.2670102119446,
    "oetags": [
     "runqemu"
    ],
    "status": "PASSED"
   },
   "runtime_test.SystemTap.test_crosstap_helloworld": {
    "duration": 633.4950432777405,
    "oetags": [
     "runqemu"
    ],
    "status": "PASSED"
   },
   "runtime_test.SystemTap.test_crosstap_pstree": {
    "duration": 49.1860728263855,
    "oetags": [
     "runqemu"
    ],
    "status": "PASSED"
   },
   "runtime_test.SystemTap.test_crosstap_syscalls_by_pid": {
    "duration": 47.60824942588806,
    "oetags": [
     "runqemu"
    ],
    "status": "PASSED"
   },
   "runtime_test.SystemTap.test_crosstap_syscalls_by_proc": {
    "duration": 47.82514834403992,
    "oetags": [
     "runqemu"
    ],
    "status": "PASSED"
   },
   "runtime_test.TestExport.test_testexport_basic": {
    "duration": 130.39321374893188,
    "oetags": [
     "runqemu"
    ],
    "status": "PASSED"
   },
   "runtime_test.TestExport.test_testexport_sdk": {
    "duration": 155.71444010734558,
    "status": "PASSED"
   },
   "runtime_test.TestImage.test_testimage_apt": {
    "duration": 264.45198607444763,
    "oetags": [
     "runqemu"
    ],
    "status": "PASSED"
   },
   "runtime_test.TestImage.test_testimage_dnf": {
    "duration": 1720.4764683246613,
    "log": "testtools.testresult.real._StringException: Traceback (most recent call last):\n  File \"/srv/pokybuild/yocto-worker/oe-selftest-armhost/build/layers/openembedded-core/meta/lib/oeqa/selftest/cases/runtime_test.py\", line 181, in test_testimage_dnf\n    bitbake('-c testimage core-image-full-cmdline')\n  File \"/srv/pokybuild/yocto-worker/oe-selftest-armhost/build/layers/openembedded-core/meta/lib/oeqa/utils/commands.py\", line 236, in bitbake\n    return runCmd(cmd, ignore_status, timeout, output_log=output_log, **options)\n           ^^^^^^^^^^^^^^^^^^^^^^^^^^^^^^^^^^^^^^^^^^^^^^^^^^^^^^^^^^^^^^^^^^^^^\n  File \"/srv/pokybuild/yocto-worker/oe-selftest-armhost/build/layers/openembedded-core/meta/lib/oeqa/utils/commands.py\", line 214, in runCmd\n    raise AssertionError(\"Command '%s' returned non-zero exit status %d:\\n%s\" % (command, result.status, exc_output))\nAssertionError: Command 'bitbake  -c testimage core-image-full-cmdline' returned non-zero exit status 1:\nNOTE: Reconnecting to bitbake server...\nLoading cache...done.\nLoaded 2080 entries from dependency cache.\nNOTE: Resolving any missing task queue dependencies\n\nBuild Configuration:\nBB_VERSION           = \"2.19.0\"\nBUILD_SYS            = \"aarch64-linux\"\nNATIVELSBSTRING      = \"universal\"\nTARGET_SYS           = \"aarch64-poky-linux\"\nMACHINE              = \"qemuarm64\"\nSDKMACHINE           = \"aarch64\"\nDISTRO               = \"poky\"\nDISTRO_VERSION       = \"6.0.99+snapshot-10ace5cb9e4b9b323c3f713d3b15b6554681af2f\"\nTUNE_FEATURES        = \"aarch64 crc cortexa57\"\nmeta                 = \"mathieu/master-next:10ace5cb9e4b9b323c3f713d3b15b6554681af2f\"\nmeta-yocto-bsp       \nmeta-poky            = \"contrib/mathieu/master-next:366fa2f21bfb0d9c4de492e0204a0dd38ce241ab\"\nmeta-selftest        = \"master:370d774aa3f4477ca6f119991ddfd005f800d4e2\"\n\nInitialising tasks...Sstate summary: Wanted 138 Local 138 Mirrors 0 Missed 0 Current 307 (100% match, 100% complete)\ndone.\nNOTE: Executing Tasks\nNOTE: Setscene tasks completed\nNOTE: Running task 1518 of 1518 (/srv/pokybuild/yocto-worker/oe-selftest-armhost/build/layers/openembedded-core/meta/recipes-extended/images/core-image-full-cmdline.bb:do_testimage)\nNOTE: recipe core-image-full-cmdline-1.0-r0: task do_testimage: Started\nQMP Available for connection at /srv/pokybuild/yocto-worker/oe-selftest-armhost/build/build-st-3346228/tmp/.9lw4a24s\nQMP connected to QEMU at 06/23/26 15:11:16 and took 1.13 seconds\nQMP released QEMU at 06/23/26 15:11:16 and took 0.09 seconds from connect\nBitbake still alive (no events for 600s). Active tasks:\n/srv/pokybuild/yocto-worker/oe-selftest-armhost/build/layers/openembedded-core/meta/recipes-extended/images/core-image-full-cmdline.bb:do_testimage\nBitbake still alive (no events for 1200s). Active tasks:\n/srv/pokybuild/yocto-worker/oe-selftest-armhost/build/layers/openembedded-core/meta/recipes-extended/images/core-image-full-cmdline.bb:do_testimage\nWARNING: core-image-full-cmdline-1.0-r0 do_testimage: Target didn't reach login banner in 1500 seconds (06/23/26 15:36:20)\nWARNING: core-image-full-cmdline-1.0-r0 do_testimage: Last 25 lines of login console (21779):\n[    0.972147] Key type encrypted registered\n[    0.974224] netconsole: network logging started\n[    0.994930] IP-Config: Complete:\n[    0.996289]      device=eth0, hwaddr=52:54:00:12:34:02, ipaddr=192.168.7.2, mask=255.255.255.0, gw=192.168.7.1\n[    0.996618]      host=192.168.7.2, domain=, nis-domain=(none)\n[    0.996738]      bootserver=255.255.255.255, rootserver=255.255.255.255, rootpath=\n[    0.996744]      nameserver0=8.8.8.8\n[    0.997099] clk: Disabling unused clocks\n[    0.997223] PM: genpd: Disabling unused power domains\n[    0.997409] md: Waiting for all devices to be available before autodetect\n[    0.997565] md: If you don't use raid, use raid=noautodetect\n[    0.997712] md: Autodetecting RAID arrays.\n[    0.997830] md: autorun ...\n[    0.997901] md: ... autorun DONE.\n[    1.030724] EXT4-fs (vda): mounted filesystem 47235635-3fa5-4b63-b419-cd12ec7698f3 r/w with ordered data mode. Quota mode: disabled.\n[    1.031190] VFS: Mounted root (ext4 filesystem) on device 253:0.\n[    1.032464] devtmpfs: mounted\n[    1.033860] Freeing unused kernel memory: 1856K\n[    1.034569] Run /sbin/init as init process\n[    1.182939] usb 1-1: new high-speed USB device number 2 using xhci_hcd\n[    1.339957] input: QEMU QEMU USB Tablet as /devices/platform/4010000000.pcie/pci0000:00/0000:00:04.0/usb1/1-1/1-1:1.0/0003:0627:0001.0001/input/input0\n[    1.340928] hid-generic 0003:0627:0001.0001: input: USB HID v0.01 Mouse [QEMU QEMU USB Tablet] on usb-0000:00:04.0-1/input0\n[    1.471006] usb 1-2: new high-speed USB device number 3 using xhci_hcd\n[    1.650069] input: QEMU QEMU USB Keyboard as /devices/platform/4010000000.pcie/pci0000:00/0000:00:04.0/usb1/1-2/1-2:1.0/0003:0627:0001.0002/input/input1\n[    1.707163] hid-generic 0003:0627:0001.0002: input: USB HID v1.11 Keyboard [QEMU QEMU USB Keyboard] on usb-0000:00:04.0-2/input0\nWARNING: core-image-full-cmdline-1.0-r0 do_testimage: Last 25 lines of all logging (25144):\n[    0.972147] Key type encrypted registered\n[    0.974224] netconsole: network logging started\n[    0.994930] IP-Config: Complete:\n[    0.996289]      device=eth0, hwaddr=52:54:00:12:34:02, ipaddr=192.168.7.2, mask=255.255.255.0, gw=192.168.7.1\n[    0.996618]      host=192.168.7.2, domain=, nis-domain=(none)\n[    0.996738]      bootserver=255.255.255.255, rootserver=255.255.255.255, rootpath=\n[    0.996744]      nameserver0=8.8.8.8\n[    0.997099] clk: Disabling unused clocks\n[    0.997223] PM: genpd: Disabling unused power domains\n[    0.997409] md: Waiting for all devices to be available before autodetect\n[    0.997565] md: If you don't use raid, use raid=noautodetect\n[    0.997712] md: Autodetecting RAID arrays.\n[    0.997830] md: autorun ...\n[    0.997901] md: ... autorun DONE.\n[    1.030724] EXT4-fs (vda): mounted filesystem 47235635-3fa5-4b63-b419-cd12ec7698f3 r/w with ordered data mode. Quota mode: disabled.\n[    1.031190] VFS: Mounted root (ext4 filesystem) on device 253:0.\n[    1.032464] devtmpfs: mounted\n[    1.033860] Freeing unused kernel memory: 1856K\n[    1.034569] Run /sbin/init as init process\n[    1.182939] usb 1-1: new high-speed USB device number 2 using xhci_hcd\n[    1.339957] input: QEMU QEMU USB Tablet as /devices/platform/4010000000.pcie/pci0000:00/0000:00:04.0/usb1/1-1/1-1:1.0/0003:0627:0001.0001/input/input0\n[    1.340928] hid-generic 0003:0627:0001.0001: input: USB HID v0.01 Mouse [QEMU QEMU USB Tablet] on usb-0000:00:04.0-1/input0\n[    1.471006] usb 1-2: new high-speed USB device number 3 using xhci_hcd\n[    1.650069] input: QEMU QEMU USB Keyboard as /devices/platform/4010000000.pcie/pci0000:00/0000:00:04.0/usb1/1-2/1-2:1.0/0003:0627:0001.0002/input/input1\n[    1.707163] hid-generic 0003:0627:0001.0002: input: USB HID v1.11 Keyboard [QEMU QEMU USB Keyboard] on usb-0000:00:04.0-2/input0\nWARNING: core-image-full-cmdline-1.0-r0 do_testimage: Check full boot log: /srv/pokybuild/yocto-worker/oe-selftest-armhost/build/build-st-3346228/tmp/work/qemuarm64-poky-linux/core-image-full-cmdline/1.0/testimage/qemu_boot_log.20260623151106\nOutput from runqemu:\nrunqemu - INFO - Received signal: 15\nrunqemu - INFO - Cleaning up\nrunqemu - INFO - Host uptime: 80961.80\n\nrunqemu - INFO - Removing /srv/pokybuild/yocto-worker/oe-selftest-armhost/build/build-st-3346228/tmp/deploy/images/qemuarm64/core-image-full-cmdline-qemuarm64.rootfs-20260623150848.ext4\nrunqemu - INFO - Removing /home/pokybuild/tmp/core-image-full-cmdline-qemuarm64.rootfs-20260623150848.ext4.2246295\ntput: No value for $TERM and no -T specified\n\nWARNING: core-image-full-cmdline-1.0-r0 do_testimage: Extra log data read: \n\nOutput from runqemu:\nrunqemu - INFO - Received signal: 15\nrunqemu - INFO - Cleaning up\nrunqemu - INFO - Host uptime: 80961.80\n\nrunqemu - INFO - Removing /srv/pokybuild/yocto-worker/oe-selftest-armhost/build/build-st-3346228/tmp/deploy/images/qemuarm64/core-image-full-cmdline-qemuarm64.rootfs-20260623150848.ext4\nrunqemu - INFO - Removing /home/pokybuild/tmp/core-image-full-cmdline-qemuarm64.rootfs-20260623150848.ext4.2246295\ntput: No value for $TERM and no -T specified\n\nOutput from runqemu:\nrunqemu - INFO - Received signal: 15\nrunqemu - INFO - Cleaning up\nrunqemu - INFO - Host uptime: 80961.80\n\nrunqemu - INFO - Removing /srv/pokybuild/yocto-worker/oe-selftest-armhost/build/build-st-3346228/tmp/deploy/images/qemuarm64/core-image-full-cmdline-qemuarm64.rootfs-20260623150848.ext4\nrunqemu - INFO - Removing /home/pokybuild/tmp/core-image-full-cmdline-qemuarm64.rootfs-20260623150848.ext4.2246295\ntput: No value for $TERM and no -T specified\n\nERROR: core-image-full-cmdline-1.0-r0 do_testimage: Error executing a python function in exec_func_python() autogenerated:\n\nThe stack trace of python calls that resulted in this exception/failure was:\nFile: 'exec_func_python() autogenerated', lineno: 2, function: <module>\n     0001:\n *** 0002:do_testimage(d)\n     0003:\nFile: '/srv/pokybuild/yocto-worker/oe-selftest-armhost/build/layers/openembedded-core/meta/classes-recipe/testimage.bbclass', lineno: 126, function: do_testimage\n     0122:    dump-guest-memory {\"paging\":false,\"protocol\":\"file:%s.img\"}\n     0123:}\n     0124:\n     0125:python do_testimage() {\n *** 0126:    testimage_main(d)\n     0127:}\n     0128:\n     0129:addtask testimage\n     0130:do_testimage[nostamp] = \"1\"\nFile: '/srv/pokybuild/yocto-worker/oe-selftest-armhost/build/layers/openembedded-core/meta/classes-recipe/testimage.bbclass', lineno: 379, function: testimage_main\n     0375:    orig_sigterm_handler = signal.signal(signal.SIGTERM, sigterm_exception)\n     0376:    try:\n     0377:        # We need to check if runqemu ends unexpectedly\n     0378:        # or if the worker send us a SIGTERM\n *** 0379:        tc.target.start(params=d.getVar(\"TEST_QEMUPARAMS\"), runqemuparams=d.getVar(\"TEST_RUNQEMUPARAMS\"))\n     0380:        import threading\n     0381:        try:\n     0382:            threading.Timer(int(d.getVar(\"TEST_OVERALL_TIMEOUT\")), handle_test_timeout, (int(d.getVar(\"TEST_OVERALL_TIMEOUT\")),)).start()\n     0383:        except ValueError:\nFile: '/srv/pokybuild/yocto-worker/oe-selftest-armhost/build/layers/openembedded-core/meta/lib/oeqa/core/target/qemu.py', lineno: 91, function: start\n     0087:            except (subprocess.CalledProcessError, subprocess.TimeoutExpired, FileNotFoundError) as err:\n     0088:                msg += \"Error running command: %s\\n%s\\n\" % (blcmd, err)\n     0089:            msg += \"\\n\\n===== end: snippet =====\\n\"\n     0090:\n *** 0091:            raise RuntimeError(\"FAILED to start qemu - check the task log and the boot log %s\" % (msg))\n     0092:\n     0093:    def stop(self):\n     0094:        self.runner.stop()\nException: RuntimeError: FAILED to start qemu - check the task log and the boot log \n\n===== start: snippet =====\n\n\n\n===== end: snippet =====\n\n===== start: snippet =====\n\nfile: /srv/pokybuild/yocto-worker/oe-selftest-armhost/build/build-st-3346228/tmp/work/qemuarm64-poky-linux/core-image-full-cmdline/1.0/testimage/qemu_boot_log.20260623151106\n\n[    0.972147] Key type encrypted registered\r\n[    0.974224] netconsole: network logging started\r\n[    0.994930] IP-Config: Complete:\r\n[    0.996289]      device=eth0, hwaddr=52:54:00:12:34:02, ipaddr=192.168.7.2, mask=255.255.255.0, gw=192.168.7.1\r\n[    0.996618]      host=192.168.7.2, domain=, nis-domain=(none)\r\n[    0.996738]      bootserver=255.255.255.255, rootserver=255.255.255.255, rootpath=\r\n[    0.996744]      nameserver0=8.8.8.8\r\n[    0.997099] clk: Disabling unused clocks\r\n[    0.997223] PM: genpd: Disabling unused power domains\r\n[    0.997409] md: Waiting for all devices to be available before autodetect\r\n[    0.997565] md: If you don't use raid, use raid=noautodetect\r\n[    0.997712] md: Autodetecting RAID arrays.\r\n[    0.997830] md: autorun ...\r\n[    0.997901] md: ... autorun DONE.\r\n[    1.030724] EXT4-fs (vda): mounted filesystem 47235635-3fa5-4b63-b419-cd12ec7698f3 r/w with ordered data mode. Quota mode: disabled.\r\n[    1.031190] VFS: Mounted root (ext4 filesystem) on device 253:0.\r\n[    1.032464] devtmpfs: mounted\r\n[    1.033860] Freeing unused kernel memory: 1856K\r\n[    1.034569] Run /sbin/init as init process\r\n\rINIT: version 3.14 booting\r\r\n\n\n===== end: snippet =====\n\n\nERROR: Logfile of failure stored in: /srv/pokybuild/yocto-worker/oe-selftest-armhost/build/build-st-3346228/tmp/work/qemuarm64-poky-linux/core-image-full-cmdline/1.0/temp/log.do_testimage.2244416\nNOTE: recipe core-image-full-cmdline-1.0-r0: task do_testimage: Failed\nERROR: Task (/srv/pokybuild/yocto-worker/oe-selftest-armhost/build/layers/openembedded-core/meta/recipes-extended/images/core-image-full-cmdline.bb:do_testimage) failed with exit code '1'\nNOTE: Tasks Summary: Attempted 1518 tasks of which 1517 didn't need to be rerun and 1 failed.\nNOTE: The errors for this build are stored in /srv/pokybuild/yocto-worker/oe-selftest-armhost/build/build-st-3346228/tmp/log/error-report/error_report_20260623151106.txt\nYou can send the errors to a reports server by running:\n  send-error-report /srv/pokybuild/yocto-worker/oe-selftest-armhost/build/build-st-3346228/tmp/log/error-report/error_report_20260623151106.txt [-s server]\nNOTE: The contents of these logs will be posted in public if you use the above command with the default server. Please ensure you remove any identifying or proprietary information when prompted before sending.\n\nSummary: 1 task failed:\n  /srv/pokybuild/yocto-worker/oe-selftest-armhost/build/layers/openembedded-core/meta/recipes-extended/images/core-image-full-cmdline.bb:do_testimage\n    log: /srv/pokybuild/yocto-worker/oe-selftest-armhost/build/build-st-3346228/tmp/work/qemuarm64-poky-linux/core-image-full-cmdline/1.0/temp/log.do_testimage.2244416\nSummary: There were 5 WARNING messages.\nSummary: There was 1 ERROR message, returning a non-zero exit code.\n\n\nStderr:\n2026-06-23 12:52:05,333 - oe-selftest - INFO - Adding: \"include selftest.inc\" in /srv/pokybuild/yocto-worker/oe-selftest-armhost/build/build-st-3346228/conf/local.conf\n2026-06-23 12:52:05,334 - oe-selftest - INFO - Adding: \"include bblayers.inc\" in bblayers.conf\nLoading cache...done.\nrootfs file: /srv/pokybuild/yocto-worker/oe-selftest-armhost/build/build-st-3346228/tmp/deploy/images/qemuarm64/core-image-minimal-qemuarm64.rootfs.ext4.zst\nQemu log file: /srv/pokybuild/yocto-worker/oe-selftest-armhost/build/build-st-3346228/tmp/work/qemuarm64-poky-linux/core-image-minimal/1.0/testimage/qemu_boot_log.20260623125206\nSSH log file: /srv/pokybuild/yocto-worker/oe-selftest-armhost/build/build-st-3346228/tmp/work/qemuarm64-poky-linux/core-image-minimal/1.0/testimage/ssh_target_log.20260623125206\nNot using kvm for runqemu\nQMP Available for connection at /srv/pokybuild/yocto-worker/oe-selftest-armhost/build/build-st-3346228/tmp/.vyyhv4p0\nCreated listening socket for qemu serial console on: 127.0.0.1:38847\nCreated listening socket for qemu serial console on: 127.0.0.1:52671\nlaunchcmd=runqemu snapshot nographic qemuarm64 /srv/pokybuild/yocto-worker/oe-selftest-armhost/build/build-st-3346228/tmp/deploy/images/qemuarm64/core-image-minimal-qemuarm64.rootfs.ext4.zst tcpserial=38847:52671 bootparams=\" printk.time=1\" qemuparams=\"-pidfile /srv/pokybuild/yocto-worker/oe-selftest-armhost/build/build-st-3346228/pidfile_3346228  -S -qmp unix:./.msu1m2yz,server,wait -qmp unix:./.vyyhv4p0,server,nowait\"\nrunqemu started, pid is 3375964\nwaiting at most 300 seconds for qemu pid (06/23/26 14:34:03)\nQMP Initializing to /srv/pokybuild/yocto-worker/oe-selftest-armhost/build/build-st-3346228/tmp/.msu1m2yz\nQMP Connecting to /srv/pokybuild/yocto-worker/oe-selftest-armhost/build/build-st-3346228/tmp/.msu1m2yz\nQMP connected to QEMU at 06/23/26 14:34:04 and took 0.56 seconds\nQMP released QEMU at 06/23/26 14:34:04 and took 0.09 seconds from connect\nqemu started in 0.65 seconds - qemu procces pid is 3376045 (06/23/26 14:34:04)\nTarget IP: None\nServer IP: None\nStarting logging thread\nStarting thread event loop\nConnection request received\nSetting connection established event\nOutput from runqemu:\nrunqemu - INFO - Decompressing /srv/pokybuild/yocto-worker/oe-selftest-armhost/build/build-st-3346228/tmp/deploy/images/qemuarm64/core-image-minimal-qemuarm64.rootfs.ext4.zst to /srv/pokybuild/yocto-worker/oe-selftest-armhost/build/build-st-3346228/tmp/deploy/images/qemuarm64/core-image-minimal-qemuarm64.rootfs-20260623125257.ext4\n/srv/pokybuild/yocto-worker/oe-selftest-armhost/build/build-st-3346228/tmp/deploy/images/qemuarm64/core-image-minimal-qemuarm64.rootfs-20260623125257.ext4.zst: 24147968 bytes \nrunqemu - INFO - Continuing with the following parameters:\nKERNEL: [/srv/pokybuild/yocto-worker/oe-selftest-armhost/build/build-st-3346228/tmp/deploy/images/qemuarm64/barebox-dt-2nd.img]\nMACHINE: [qemuarm64]\nFSTYPE: [ext4]\nROOTFS: [/srv/pokybuild/yocto-worker/oe-selftest-armhost/build/build-st-3346228/tmp/deploy/images/qemuarm64/core-image-minimal-qemuarm64.rootfs-20260623125257.ext4]\nSNAPSHOT: [Enabled. Changes on rootfs won't be kept after QEMU shutdown.]\nCONFFILE: [/srv/pokybuild/yocto-worker/oe-selftest-armhost/build/build-st-3346228/tmp/deploy/images/qemuarm64/core-image-minimal-qemuarm64.rootfs.qemuboot.conf]\n\nrunqemu - INFO - Using preconfigured tap device tap0\nrunqemu - INFO - If this is not intended, touch /tmp/qemu-tap-locks/tap0.skip to make runqemu skip tap0.\nrunqemu - INFO - Network configuration: ip=192.168.7.2::192.168.7.1:255.255.255.0::eth0:off:8.8.8.8 net.ifnames=0\nrunqemu - INFO - Copying rootfs to /home/pokybuild/tmp/core-image-minimal-qemuarm64.rootfs-20260623125257.ext4.3375965\nrunqemu - INFO - Copy done in 0.015306234359741211 seconds\nrunqemu - INFO - Running /srv/pokybuild/yocto-worker/oe-selftest-armhost/build/build-st-3346228/tmp/work/aarch64-linux/qemu-helper-native/1.0/recipe-sysroot-native/usr/bin/qemu-system-aarch64 -device virtio-net-pci,netdev=net0,mac=52:54:00:12:34:02 -netdev tap,id=net0,ifname=tap0,script=no,downscript=no -object rng-random,filename=/dev/urandom,id=rng0 -device virtio-rng-pci,rng=rng0 -drive id=disk0,file=/home/pokybuild/tmp/core-image-minimal-qemuarm64.rootfs-20260623125257.ext4.3375965,if=none,format=raw -device virtio-blk-pci,drive=disk0 -device qemu-xhci -device usb-tablet -device usb-kbd  -machine virt -cpu cortex-a57 -smp 4 -m 256 -device virtio-serial-pci -chardev socket,id=virtcon,port=38847,host=127.0.0.1,nodelay=on -device virtconsole,chardev=virtcon -serial tcp:127.0.0.1:52671,nodelay=on  -pidfile /srv/pokybuild/yocto-worker/oe-selftest-armhost/build/build-st-3346228/pidfile_3346228  -S -qmp unix:./.msu1m2yz,server,wait -qmp unix:./.vyyhv4p0,server,nowait -serial null -serial mon:stdio -nographic -device virtio-gpu-pci -kernel /srv/pokybuild/yocto-worker/oe-selftest-armhost/build/build-st-3346228/tmp/deploy/images/qemuarm64/barebox-dt-2nd.img -append 'root=/dev/vda rw  mem=256M ip=192.168.7.2::192.168.7.1:255.255.255.0::eth0:off:8.8.8.8 net.ifnames=0 console=ttyAMA0 console=hvc0 swiotlb=0  printk.time=1'\n\nrunqemu - INFO - Host uptime: 77219.88\n\nQEMU 11.0.1 monitor - type 'help' for more information\r\n(qemu) \nWaiting at most 1000 seconds for login banner (06/23/26 14:34:04)\nConnection from 127.0.0.1:53290\nReached login banner in 0.27 seconds (06/23/26 14:34:04)\nLogged in as root in serial console\nWARNING: /usr/lib/python3.12/unittest/case.py:580: RuntimeWarning: TestResult has no addDuration method\n  warnings.warn(\"TestResult has no addDuration method\",\n\nLoading cache...done.\nLoaded 2080 entries from dependency cache.\nWARNING: Duplicate inclusion for /srv/pokybuild/yocto-worker/oe-selftest-armhost/build/layers/meta-yocto/meta-poky/conf/distro/include/maintainers.inc in /srv/pokybuild/yocto-worker/oe-selftest-armhost/build/layers/openembedded-core/meta/conf/distro/defaultsetup.conf\nWARNING: Duplicate inclusion for /srv/pokybuild/yocto-worker/oe-selftest-armhost/build/build-st-3346228/conf/distro/include/maintainers.inc in /srv/pokybuild/yocto-worker/oe-selftest-armhost/build/layers/openembedded-core/meta/conf/distro/defaultsetup.conf\nWARNING: Duplicate inclusion for /srv/pokybuild/yocto-worker/oe-selftest-armhost/build/layers/openembedded-core/meta/conf/distro/include/maintainers.inc in /srv/pokybuild/yocto-worker/oe-selftest-armhost/build/layers/openembedded-core/meta/conf/distro/defaultsetup.conf\nLoading cache...done.\nLoaded 0 entries from dependency cache.\nParsing recipes...done.\nParsing of 1032 .bb files complete (0 cached, 1032 parsed). 2080 targets, 24 skipped, 0 masked, 0 errors.\n\nSummary: There were 3 WARNING messages.\n",
    "oetags": [
     "runqemu"
    ],
    "status": "FAILED"
   },
   "runtime_test.TestImage.test_testimage_install": {
    "duration": 189.2390651702881,
    "oetags": [
     "runqemu"
    ],
    "status": "PASSED"
   },
   "runtime_test.TestImage.test_testimage_slirp": {
    "duration": 138.26453018188477,
    "oetags": [
     "runqemu"
    ],
    "status": "PASSED"
   },
   "runtime_test.TestImage.test_testimage_virgl_gtk_sdl": {
    "duration": 0.0026264190673828125,
    "log": "test needs qemux86-64\n",
    "oetags": [
     "runqemu"
    ],
    "status": "SKIPPED"
   },
   "runtime_test.TestImage.test_testimage_virgl_headless": {
    "duration": 0.003161907196044922,
    "log": "test needs qemux86-64\n",
    "oetags": [
     "runqemu"
    ],
    "status": "SKIPPED"
   },
   "rust.RustStaticMuslTest.test_static_musl_linking": {
    "duration": 64.81023049354553,
    "status": "PASSED"
   },
   "sdk.SDKTests.test_sdk_manifests": {
    "duration": 462.5514883995056,
    "status": "PASSED"
   },
   "sdk.SDKTests.test_sdk_runqemu": {
    "duration": 486.37121391296387,
    "status": "PASSED"
   },
   "selftest.ExternalLayer.test_list_imported": {
    "duration": 0.012593269348144531,
    "status": "PASSED"
   },
   "signing.LockedSignatures.test_locked_signatures": {
    "duration": 188.21727895736694,
    "status": "PASSED"
   },
   "signing.Signing.test_signing_packages": {
    "duration": 3040.3766582012177,
    "status": "PASSED"
   },
   "signing.Signing.test_signing_sstate_archive": {
    "duration": 227.6009693145752,
    "status": "PASSED"
   },
   "spdx.SPDX30Check.test_baremetal_helloworld": {
    "duration": 83.89095711708069,
    "status": "PASSED"
   },
   "spdx.SPDX30Check.test_base_files": {
    "duration": 67.60803365707397,
    "status": "PASSED"
   },
   "spdx.SPDX30Check.test_core_image_minimal": {
    "duration": 86.88345980644226,
    "status": "PASSED"
   },
   "spdx.SPDX30Check.test_core_image_minimal_sdk": {
    "duration": 392.39223647117615,
    "status": "PASSED"
   },
   "spdx.SPDX30Check.test_custom_annotation_vars": {
    "duration": 46.90333890914917,
    "status": "PASSED"
   },
   "spdx.SPDX30Check.test_download_location_defensive_handling": {
    "duration": 17.58661437034607,
    "status": "PASSED"
   },
   "spdx.SPDX30Check.test_extra_opts": {
    "duration": 692.851033449173,
    "status": "PASSED"
   },
   "spdx.SPDX30Check.test_gcc_include_source": {
    "duration": 3046.708851337433,
    "status": "PASSED"
   },
   "spdx.SPDX30Check.test_kernel_config_spdx": {
    "duration": 48.07751774787903,
    "status": "PASSED"
   },
   "spdx.SPDX30Check.test_packageconfig_spdx": {
    "duration": 62.69957089424133,
    "status": "PASSED"
   },
   "spdx.SPDX30Check.test_version_extraction_patterns": {
    "duration": 15.468471050262451,
    "status": "PASSED"
   },
   "spdx.SPDX30Check.test_world_sbom": {
    "duration": 45.6024968624115,
    "status": "PASSED"
   },
   "sstatetests.SStateCacheManagement.test_sstate_cache_management_script_using_machine": {
    "duration": 208.14142107963562,
    "status": "PASSED"
   },
   "sstatetests.SStateCacheManagement.test_sstate_cache_management_script_using_pr_1": {
    "duration": 170.45259809494019,
    "status": "PASSED"
   },
   "sstatetests.SStateCacheManagement.test_sstate_cache_management_script_using_pr_2": {
    "duration": 201.35645627975464,
    "status": "PASSED"
   },
   "sstatetests.SStateCacheManagement.test_sstate_cache_management_script_using_pr_3": {
    "duration": 176.5191614627838,
    "status": "PASSED"
   },
   "sstatetests.SStateCleanup.test_cleansstate_task_distro_nonspecific": {
    "duration": 83.1202700138092,
    "status": "PASSED"
   },
   "sstatetests.SStateCleanup.test_cleansstate_task_distro_specific": {
    "duration": 84.10123419761658,
    "status": "PASSED"
   },
   "sstatetests.SStateCleanup.test_cleansstate_task_distro_specific_nonspecific": {
    "duration": 85.26808476448059,
    "status": "PASSED"
   },
   "sstatetests.SStateCreation.test_sstate_creation_distro_nonspecific": {
    "duration": 65.55941104888916,
    "status": "PASSED"
   },
   "sstatetests.SStateCreation.test_sstate_creation_distro_specific": {
    "duration": 56.79872417449951,
    "status": "PASSED"
   },
   "sstatetests.SStateDistroTests.test_rebuild_distro_specific_sstate_cross_native_targets": {
    "duration": 89.80626606941223,
    "status": "PASSED"
   },
   "sstatetests.SStateDistroTests.test_rebuild_distro_specific_sstate_cross_target": {
    "duration": 85.48261022567749,
    "status": "PASSED"
   },
   "sstatetests.SStateDistroTests.test_rebuild_distro_specific_sstate_native_target": {
    "duration": 85.03076887130737,
    "status": "PASSED"
   },
   "sstatetests.SStateFindSiginfo.test_sstate_compare_sigfiles_and_find_siginfo": {
    "duration": 523.9693186283112,
    "status": "PASSED"
   },
   "sstatetests.SStateHashSameSigs.test_sstate_32_64_same_hash": {
    "duration": 135.1679766178131,
    "status": "PASSED"
   },
   "sstatetests.SStateHashSameSigs.test_sstate_nativelsbstring_same_hash": {
    "duration": 158.59645462036133,
    "status": "PASSED"
   },
   "sstatetests.SStateHashSameSigs.test_sstate_sdk_arch_same_hash": {
    "duration": 155.52661156654358,
    "status": "PASSED"
   },
   "sstatetests.SStateHashSameSigs2.test_sstate_allarch_samesigs": {
    "duration": 158.37032675743103,
    "status": "PASSED"
   },
   "sstatetests.SStateHashSameSigs2.test_sstate_nativesdk_samesigs_multilib": {
    "duration": 208.60655689239502,
    "status": "PASSED"
   },
   "sstatetests.SStateHashSameSigs3.test_sstate_multilib_or_not_native_samesigs": {
    "duration": 131.5962951183319,
    "status": "PASSED"
   },
   "sstatetests.SStateHashSameSigs3.test_sstate_sametune_samesigs": {
    "duration": 299.3486125469208,
    "status": "PASSED"
   },
   "sstatetests.SStateHashSameSigs4.test_sstate_movelayer_samesigs": {
    "duration": 120.49180245399475,
    "status": "PASSED"
   },
   "sstatetests.SStateHashSameSigs4.test_sstate_noop_samesigs": {
    "duration": 201.01691675186157,
    "status": "PASSED"
   },
   "sstatetests.SStatePrintdiff.test_gcc_runtime_vs_gcc_source": {
    "duration": 850.0179586410522,
    "status": "PASSED"
   },
   "sstatetests.SStatePrintdiff.test_image_minimal_vs_base_do_configure": {
    "duration": 710.5588119029999,
    "status": "PASSED"
   },
   "sstatetests.SStatePrintdiff.test_image_minimal_vs_perlcross": {
    "duration": 409.61367988586426,
    "status": "PASSED"
   },
   "sstatetests.SStateTests.test_autorev_sstate_works": {
    "duration": 93.85033321380615,
    "status": "PASSED"
   },
   "sysroot.SysrootTests.test_sysroot_cleanup": {
    "duration": 94.45788145065308,
    "status": "PASSED"
   },
   "sysroot.SysrootTests.test_sysroot_la": {
    "duration": 62.24795603752136,
    "status": "PASSED"
   },
   "sysroot.SysrootTests.test_sysroot_max_shebang": {
    "duration": 15.131135702133179,
    "status": "PASSED"
   },
   "sysroot.SysrootTests.test_sysroot_pkgconfig": {
    "duration": 32.97793960571289,
    "status": "PASSED"
   },
   "systemd_boot.Systemdboot.test_efi_systemdboot_images_can_be_built": {
    "duration": 275.21015191078186,
    "status": "PASSED"
   },
   "tinfoil.TinfoilTests.test_datastore_operations": {
    "duration": 1.4088106155395508,
    "status": "PASSED"
   },
   "tinfoil.TinfoilTests.test_expand": {
    "duration": 0.7640187740325928,
    "status": "PASSED"
   },
   "tinfoil.TinfoilTests.test_getvar": {
    "duration": 1.0153553485870361,
    "status": "PASSED"
   },
   "tinfoil.TinfoilTests.test_getvar_bb_origenv": {
    "duration": 0.7615549564361572,
    "status": "PASSED"
   },
   "tinfoil.TinfoilTests.test_list_recipes": {
    "duration": 5.923563241958618,
    "status": "PASSED"
   },
   "tinfoil.TinfoilTests.test_parse_recipe": {
    "duration": 6.16852331161499,
    "status": "PASSED"
   },
   "tinfoil.TinfoilTests.test_parse_recipe_copy_expand": {
    "duration": 6.262157678604126,
    "status": "PASSED"
   },
   "tinfoil.TinfoilTests.test_parse_recipe_custom_data": {
    "duration": 5.365582227706909,
    "status": "PASSED"
   },
   "tinfoil.TinfoilTests.test_parse_virtual_recipe": {
    "duration": 5.424952268600464,
    "status": "PASSED"
   },
   "tinfoil.TinfoilTests.test_parse_virtual_recipe_custom_data": {
    "duration": 6.43277907371521,
    "status": "PASSED"
   },
   "tinfoil.TinfoilTests.test_setvariable_clean": {
    "duration": 3.030225992202759,
    "status": "PASSED"
   },
   "tinfoil.TinfoilTests.test_variable_history": {
    "duration": 5.454495191574097,
    "status": "PASSED"
   },
   "tinfoil.TinfoilTests.test_wait_event": {
    "duration": 2.0046775341033936,
    "status": "PASSED"
   },
   "toolchain.ToolchainTests.test_toolchain_switching": {
    "duration": 205.32247805595398,
    "status": "PASSED"
   },
   "uboot.UBootConfigTest.test_uboot_config_extract": {
    "duration": 36.231268882751465,
    "status": "PASSED"
   },
   "uboot.UBootConfigTest.test_uboot_config_extract_error_missing_config": {
    "duration": 32.37810945510864,
    "status": "PASSED"
   },
   "uboot.UBootConfigTest.test_uboot_config_extract_error_nothing_set": {
    "duration": 37.190141916275024,
    "status": "PASSED"
   },
   "uboot.UBootConfigTest.test_uboot_config_extract_error_set_both_config_and_machine": {
    "duration": 33.21675419807434,
    "status": "PASSED"
   },
   "uboot.UBootConfigTest.test_uboot_config_extract_error_set_uboot_config_binary": {
    "duration": 31.628509759902954,
    "status": "PASSED"
   },
   "uboot.UBootConfigTest.test_uboot_config_extract_error_set_uboot_config_fragments": {
    "duration": 29.98461890220642,
    "status": "PASSED"
   },
   "uboot.UBootConfigTest.test_uboot_config_extract_error_set_uboot_config_image_fstypes": {
    "duration": 30.78812074661255,
    "status": "PASSED"
   },
   "uboot.UBootConfigTest.test_uboot_config_extract_error_set_uboot_config_make_opts": {
    "duration": 31.0541090965271,
    "status": "PASSED"
   },
   "uboot.UBootConfigTest.test_uboot_config_extract_legacy": {
    "duration": 35.57296085357666,
    "status": "PASSED"
   },
   "uboot.UBootConfigTest.test_uboot_config_extract_single_config": {
    "duration": 34.85370898246765,
    "status": "PASSED"
   },
   "uboot.UBootTest.test_boot_uboot": {
    "duration": 90.96409225463867,
    "oetags": [
     "runqemu"
    ],
    "status": "PASSED"
   },
   "uboot.UBootTest.test_boot_uboot_kvm_to_full_target": {
    "duration": 251.61608147621155,
    "oetags": [
     "runqemu"
    ],
    "status": "PASSED"
   },
   "uboot.UBootTest.test_uboot_config_initial_env_binary": {
    "duration": 79.05811214447021,
    "status": "PASSED"
   },
   "uboot.UBootTest.test_uboot_initial_env_binary": {
    "duration": 70.66506743431091,
    "status": "PASSED"
   },
   "uki.UkiTest.test_uki_boot_systemd": {
    "duration": 0.010352134704589844,
    "log": "Test skipped on aarch64\n",
    "oetags": [
     "runqemu"
    ],
    "status": "SKIPPED"
   },
   "uki.UkiTest.test_uki_sysvinit": {
    "duration": 0.010602712631225586,
    "log": "Test skipped on aarch64\n",
    "oetags": [
     "runqemu"
    ],
    "status": "SKIPPED"
   },
   "usergrouptests.UserGroupTests.test_add_task_between_p_sysroot_and_package": {
    "duration": 50.596041679382324,
    "status": "PASSED"
   },
   "usergrouptests.UserGroupTests.test_group_from_dep_package": {
    "duration": 31.112565517425537,
    "status": "PASSED"
   },
   "usergrouptests.UserGroupTests.test_postinst_order": {
    "duration": 12.63908576965332,
    "status": "PASSED"
   },
   "usergrouptests.UserGroupTests.test_static_useradd_from_dynamic": {
    "duration": 181.4049255847931,
    "status": "PASSED"
   },
   "usergrouptests.UserGroupTests.test_useradd_depends_only": {
    "duration": 11.171107530593872,
    "status": "PASSED"
   },
   "wic.CLITests.test_createhelp": {
    "duration": 185.94595408439636,
    "status": "PASSED"
   },
   "wic.CLITests.test_help": {
    "duration": 4.9250171184539795,
    "status": "PASSED"
   },
   "wic.CLITests.test_help_create": {
    "duration": 5.2184553146362305,
    "status": "PASSED"
   },
   "wic.CLITests.test_help_kickstart": {
    "duration": 5.110915422439575,
    "status": "PASSED"
   },
   "wic.CLITests.test_help_list": {
    "duration": 5.500799179077148,
    "status": "PASSED"
   },
   "wic.CLITests.test_help_overview": {
    "duration": 5.115430116653442,
    "status": "PASSED"
   },
   "wic.CLITests.test_help_plugins": {
    "duration": 5.194976091384888,
    "status": "PASSED"
   },
   "wic.CLITests.test_list_images": {
    "duration": 7.899975776672363,
    "status": "PASSED"
   },
   "wic.CLITests.test_list_source_plugins": {
    "duration": 9.744069337844849,
    "status": "PASSED"
   },
   "wic.CLITests.test_listed_images_help": {
    "duration": 85.16108202934265,
    "status": "PASSED"
   },
   "wic.CLITests.test_listhelp": {
    "duration": 5.409701585769653,
    "status": "PASSED"
   },
   "wic.CLITests.test_no_command": {
    "duration": 4.370140790939331,
    "status": "PASSED"
   },
   "wic.CLITests.test_unsupported_subcommand": {
    "duration": 4.899193525314331,
    "status": "PASSED"
   },
   "wic.CLITests.test_version": {
    "duration": 5.156877279281616,
    "status": "PASSED"
   },
   "wic.ModifyTests.test_wic_cp": {
    "duration": 122.33677887916565,
    "status": "PASSED"
   },
   "wic.ModifyTests.test_wic_cp_ext": {
    "duration": 67.60633397102356,
    "status": "PASSED"
   },
   "wic.ModifyTests.test_wic_ls": {
    "duration": 44.86442422866821,
    "status": "PASSED"
   },
   "wic.ModifyTests.test_wic_ls_ext": {
    "duration": 41.10560941696167,
    "status": "PASSED"
   },
   "wic.ModifyTests.test_wic_rm": {
    "duration": 55.45928359031677,
    "status": "PASSED"
   },
   "wic.ModifyTests.test_wic_rm_ext": {
    "duration": 55.78172564506531,
    "status": "PASSED"
   },
   "wic.Wic.test_bootloader_config": {
    "duration": 0.0007305145263671875,
    "log": "Test skipped on aarch64\n",
    "status": "SKIPPED"
   },
   "wic.Wic.test_build_artifacts": {
    "duration": 0.0010387897491455078,
    "log": "Test skipped on aarch64\n",
    "status": "SKIPPED"
   },
   "wic.Wic.test_build_image_name": {
    "duration": 180.1197292804718,
    "status": "PASSED"
   },
   "wic.Wic.test_build_rootfs_long": {
    "duration": 55.61145544052124,
    "status": "PASSED"
   },
   "wic.Wic.test_build_rootfs_short": {
    "duration": 49.498332262039185,
    "status": "PASSED"
   },
   "wic.Wic.test_change_directory": {
    "duration": 40.55783271789551,
    "status": "PASSED"
   },
   "wic.Wic.test_change_directory_errors": {
    "duration": 64.87840676307678,
    "status": "PASSED"
   },
   "wic.Wic.test_compress_bzip2": {
    "duration": 36.00571966171265,
    "status": "PASSED"
   },
   "wic.Wic.test_compress_gzip": {
    "duration": 36.340962409973145,
    "status": "PASSED"
   },
   "wic.Wic.test_compress_xz": {
    "duration": 40.044851541519165,
    "status": "PASSED"
   },
   "wic.Wic.test_debug_long": {
    "duration": 35.49219751358032,
    "status": "PASSED"
   },
   "wic.Wic.test_debug_short": {
    "duration": 38.13833498954773,
    "status": "PASSED"
   },
   "wic.Wic.test_default_output_dir": {
    "duration": 0.005101203918457031,
    "log": "Test skipped on aarch64\n",
    "status": "SKIPPED"
   },
   "wic.Wic.test_efi_bootpart": {
    "duration": 86.55141949653625,
    "status": "PASSED"
   },
   "wic.Wic.test_exclude_path": {
    "duration": 49.21090817451477,
    "status": "PASSED"
   },
   "wic.Wic.test_exclude_path_errors": {
    "duration": 60.9432737827301,
    "status": "PASSED"
   },
   "wic.Wic.test_exclude_path_with_extra_space": {
    "duration": 134.73779964447021,
    "status": "PASSED"
   },
   "wic.Wic.test_extra_space": {
    "duration": 37.177098751068115,
    "status": "PASSED"
   },
   "wic.Wic.test_gpt_image": {
    "duration": 0.0015385150909423828,
    "log": "Test skipped on aarch64\n",
    "status": "SKIPPED"
   },
   "wic.Wic.test_grub_install_pcbios": {
    "duration": 0.0018160343170166016,
    "log": "Test skipped on aarch64\n",
    "status": "SKIPPED"
   },
   "wic.Wic.test_include_path": {
    "duration": 47.45515727996826,
    "status": "PASSED"
   },
   "wic.Wic.test_include_path_embeded": {
    "duration": 50.085710763931274,
    "status": "PASSED"
   },
   "wic.Wic.test_include_path_errors": {
    "duration": 108.25294780731201,
    "status": "PASSED"
   },
   "wic.Wic.test_iso_image": {
    "duration": 0.0021953582763671875,
    "log": "Test skipped on aarch64\n",
    "status": "SKIPPED"
   },
   "wic.Wic.test_kernel_install": {
    "duration": 49.91534495353699,
    "status": "PASSED"
   },
   "wic.Wic.test_mkefidisk": {
    "duration": 34.450746297836304,
    "status": "PASSED"
   },
   "wic.Wic.test_no_fstab_update": {
    "duration": 58.87377309799194,
    "status": "PASSED"
   },
   "wic.Wic.test_no_fstab_update_errors": {
    "duration": 57.916794776916504,
    "status": "PASSED"
   },
   "wic.Wic.test_no_table": {
    "duration": 35.476739168167114,
    "status": "PASSED"
   },
   "wic.Wic.test_partition_hidden_attributes": {
    "duration": 43.21815061569214,
    "status": "PASSED"
   },
   "wic.Wic.test_permissions": {
    "duration": 407.182284116745,
    "status": "PASSED"
   },
   "wic.Wic.test_qemux86_directdisk": {
    "duration": 0.002454042434692383,
    "log": "Test skipped on aarch64\n",
    "status": "SKIPPED"
   },
   "wic.Wic.test_rootfs_artifacts": {
    "duration": 0.0026886463165283203,
    "log": "Test skipped on aarch64\n",
    "status": "SKIPPED"
   },
   "wic.Wic.test_rootfs_indirect_recipes": {
    "duration": 0.002901792526245117,
    "log": "Test skipped on aarch64\n",
    "status": "SKIPPED"
   },
   "wic.Wic.test_sdimage_bootpart": {
    "duration": 76.94146609306335,
    "status": "PASSED"
   },
   "wic.Wic.test_skip_build_check_long": {
    "duration": 35.69562530517578,
    "status": "PASSED"
   },
   "wic.Wic.test_skip_build_check_short": {
    "duration": 36.11686372756958,
    "status": "PASSED"
   },
   "wic.Wic.test_skip_kernel_install": {
    "duration": 46.95109176635742,
    "status": "PASSED"
   },
   "wic.Wic.test_systemd_bootdisk": {
    "duration": 238.58921194076538,
    "status": "PASSED"
   },
   "wic.Wic.test_wic_sector_size_cli": {
    "duration": 100.25787568092346,
    "status": "PASSED"
   },
   "wic.Wic.test_wic_sector_size_env": {
    "duration": 102.32782173156738,
    "status": "PASSED"
   },
   "wic.Wic.test_wrong_compressor": {
    "duration": 5.681624889373779,
    "status": "PASSED"
   },
   "wic.Wic2.test_biosplusefi_plugin": {
    "duration": 0.0013697147369384766,
    "log": "Test skipped on aarch64\n",
    "status": "SKIPPED"
   },
   "wic.Wic2.test_biosplusefi_plugin_qemu": {
    "duration": 0.002210855484008789,
    "log": "Test skipped on aarch64\n",
    "oetags": [
     "runqemu"
    ],
    "status": "SKIPPED"
   },
   "wic.Wic2.test_bmap_long": {
    "duration": 132.04565405845642,
    "status": "PASSED"
   },
   "wic.Wic2.test_bmap_short": {
    "duration": 32.970874071121216,
    "status": "PASSED"
   },
   "wic.Wic2.test_diskid_on_gpt_partition": {
    "duration": 39.25039482116699,
    "status": "PASSED"
   },
   "wic.Wic2.test_diskid_on_msdos_partition": {
    "duration": 38.72040319442749,
    "status": "PASSED"
   },
   "wic.Wic2.test_efi_plugin_plain_systemd_boot_qemu_aarch64": {
    "duration": 634.821576833725,
    "oetags": [
     "runqemu"
    ],
    "status": "PASSED"
   },
   "wic.Wic2.test_efi_plugin_plain_systemd_boot_qemu_x86": {
    "duration": 0.002701282501220703,
    "log": "Test skipped on aarch64\n",
    "oetags": [
     "runqemu"
    ],
    "status": "SKIPPED"
   },
   "wic.Wic2.test_efi_plugin_unified_kernel_image_qemu": {
    "duration": 0.003692150115966797,
    "log": "Test skipped on aarch64\n",
    "oetags": [
     "runqemu"
    ],
    "status": "SKIPPED"
   },
   "wic.Wic2.test_empty_plugin": {
    "duration": 123.10155582427979,
    "status": "PASSED"
   },
   "wic.Wic2.test_empty_zeroize_plugin": {
    "duration": 59.591174602508545,
    "status": "PASSED"
   },
   "wic.Wic2.test_expand_mbr_image": {
    "duration": 0.0015995502471923828,
    "log": "Test skipped on aarch64\n",
    "oetags": [
     "runqemu"
    ],
    "status": "SKIPPED"
   },
   "wic.Wic2.test_extra_filesystem_space": {
    "duration": 37.095187187194824,
    "status": "PASSED"
   },
   "wic.Wic2.test_extra_partition_plugin": {
    "duration": 107.81841802597046,
    "status": "PASSED"
   },
   "wic.Wic2.test_extra_partition_space": {
    "duration": 44.982046365737915,
    "status": "PASSED"
   },
   "wic.Wic2.test_fixed_size": {
    "duration": 36.49767446517944,
    "status": "PASSED"
   },
   "wic.Wic2.test_fixed_size_error": {
    "duration": 32.93399977684021,
    "status": "PASSED"
   },
   "wic.Wic2.test_fs_types": {
    "duration": 33.60607600212097,
    "status": "PASSED"
   },
   "wic.Wic2.test_gpt_partition_name": {
    "duration": 105.52362060546875,
    "status": "PASSED"
   },
   "wic.Wic2.test_image_bootpart_globbed": {
    "duration": 70.8595359325409,
    "status": "PASSED"
   },
   "wic.Wic2.test_image_env": {
    "duration": 61.27127647399902,
    "status": "PASSED"
   },
   "wic.Wic2.test_image_vars_dir_long": {
    "duration": 11.338167667388916,
    "status": "PASSED"
   },
   "wic.Wic2.test_image_vars_dir_short": {
    "duration": 10.602906703948975,
    "status": "PASSED"
   },
   "wic.Wic2.test_kickstart_parser": {
    "duration": 32.93591332435608,
    "status": "PASSED"
   },
   "wic.Wic2.test_mkfs_extraopts": {
    "duration": 34.8669490814209,
    "status": "PASSED"
   },
   "wic.Wic2.test_offset": {
    "duration": 196.9635648727417,
    "status": "PASSED"
   },
   "wic.Wic2.test_qemu": {
    "duration": 0.0016832351684570312,
    "log": "Test skipped on aarch64\n",
    "oetags": [
     "runqemu"
    ],
    "status": "SKIPPED"
   },
   "wic.Wic2.test_qemu_efi": {
    "duration": 0.0023221969604492188,
    "log": "Test skipped on aarch64\n",
    "oetags": [
     "runqemu"
    ],
    "status": "SKIPPED"
   },
   "wic.Wic2.test_rawcopy_plugin": {
    "duration": 121.1485857963562,
    "status": "PASSED"
   },
   "wic.Wic2.test_rawcopy_plugin_qemu": {
    "duration": 0.0023224353790283203,
    "log": "Test skipped on aarch64\n",
    "oetags": [
     "runqemu"
    ],
    "status": "SKIPPED"
   },
   "wic.Wic2.test_rawcopy_plugin_unpack": {
    "duration": 122.8913471698761,
    "status": "PASSED"
   },
   "wic.Wic2.test_uefi_kernel": {
    "duration": 124.59087252616882,
    "status": "PASSED"
   },
   "wic.Wic2.test_wic_image_type": {
    "duration": 0.0020127296447753906,
    "log": "Test skipped on aarch64\n",
    "status": "SKIPPED"
   },
   "wrapper.WrapperTests.test_shebang_wrapper": {
    "duration": 58.12175464630127,
    "status": "PASSED"
   },
   "yoctotestresultsquerytests.TestResultsQueryTests.test_create_workdir": {
    "duration": 5.134108066558838,
    "status": "PASSED"
   },
   "yoctotestresultsquerytests.TestResultsQueryTests.test_get_sha1": {
    "duration": 0.0812687873840332,
    "status": "PASSED"
   }
  }
 }
}