{
 "oeselftest_opensuseleap-16.0_qemux86-64_20260623124904": {
  "configuration": {
   "HOST_DISTRO": "opensuseleap-16.0",
   "HOST_NAME": "opensuse160-vk-2",
   "LAYERS": {
    "meta": {
     "branch": "mathieu/master-next",
     "commit": "10ace5cb9e4b9b323c3f713d3b15b6554681af2f",
     "commit_count": 67575,
     "commit_time": 1782217450
    },
    "meta-poky": {
     "branch": "contrib/mathieu/master-next",
     "commit": "366fa2f21bfb0d9c4de492e0204a0dd38ce241ab",
     "commit_count": 1805,
     "commit_time": 1781777642
    },
    "meta-selftest": {
     "branch": "mathieu/master-next",
     "commit": "10ace5cb9e4b9b323c3f713d3b15b6554681af2f",
     "commit_count": 67575,
     "commit_time": 1782217450
    },
    "meta-yocto-bsp": {
     "branch": "contrib/mathieu/master-next",
     "commit": "366fa2f21bfb0d9c4de492e0204a0dd38ce241ab",
     "commit_count": 1805,
     "commit_time": 1781777642
    }
   },
   "MACHINE": "qemux86-64",
   "OESELFTEST_METADATA": {
    "exclude_tags": [
     "yocto-mirrors",
     "machine",
     "toolchain-user",
     "toolchain-system"
    ],
    "run_all_tests": true,
    "run_tests": null,
    "select_tags": null,
    "skips": [
     "distrodata.Distrodata.test_checkpkg",
     "reproducible"
    ]
   },
   "STARTTIME": "20260623124904",
   "TEST_TYPE": "oeselftest"
  },
  "result": {
   "archiver.Archiver.test_archiver_allows_to_filter_on_recipe_name": {
    "duration": 42.77844834327698,
    "status": "PASSED"
   },
   "archiver.Archiver.test_archiver_cleanup": {
    "duration": 81.65316319465637,
    "status": "PASSED"
   },
   "archiver.Archiver.test_archiver_filters_by_type": {
    "duration": 36.06489324569702,
    "status": "PASSED"
   },
   "archiver.Archiver.test_archiver_filters_by_type_and_name": {
    "duration": 41.366495847702026,
    "status": "PASSED"
   },
   "archiver.Archiver.test_archiver_mode_configured": {
    "duration": 41.630974769592285,
    "status": "PASSED"
   },
   "archiver.Archiver.test_archiver_mode_diff": {
    "duration": 36.46328806877136,
    "status": "PASSED"
   },
   "archiver.Archiver.test_archiver_mode_dumpdata": {
    "duration": 13.394998550415039,
    "status": "PASSED"
   },
   "archiver.Archiver.test_archiver_mode_mirror": {
    "duration": 36.358580350875854,
    "status": "PASSED"
   },
   "archiver.Archiver.test_archiver_mode_mirror_combined": {
    "duration": 43.29468584060669,
    "status": "PASSED"
   },
   "archiver.Archiver.test_archiver_mode_mirror_excludes": {
    "duration": 36.55134463310242,
    "status": "PASSED"
   },
   "archiver.Archiver.test_archiver_mode_mirror_gitsm": {
    "duration": 26.027782678604126,
    "status": "PASSED"
   },
   "archiver.Archiver.test_archiver_mode_mirror_gitsm_shallow": {
    "duration": 56.5181839466095,
    "status": "PASSED"
   },
   "archiver.Archiver.test_archiver_mode_original": {
    "duration": 38.62628722190857,
    "status": "PASSED"
   },
   "archiver.Archiver.test_archiver_mode_patched": {
    "duration": 14.399446249008179,
    "status": "PASSED"
   },
   "archiver.Archiver.test_archiver_mode_recipe": {
    "duration": 35.9963059425354,
    "status": "PASSED"
   },
   "archiver.Archiver.test_archiver_multiconfig_shared_unpack_and_patch": {
    "duration": 167.24955368041992,
    "status": "PASSED"
   },
   "archiver.Archiver.test_archiver_srpm_mode": {
    "duration": 118.39903974533081,
    "status": "PASSED"
   },
   "barebox.BareboxTest.test_boot_barebox": {
    "duration": 0.0040738582611083984,
    "log": "Test skipped on x86_64\n",
    "oetags": [
     "runqemu"
    ],
    "status": "SKIPPED"
   },
   "baremetal.BaremetalTest.test_baremetal": {
    "duration": 4707.196399927139,
    "status": "PASSED"
   },
   "bbclasses.Systemd.test_systemd_in_distro": {
    "duration": 97.78376078605652,
    "status": "PASSED"
   },
   "bbclasses.Systemd.test_sysvinit_in_distro": {
    "duration": 40.043883085250854,
    "status": "PASSED"
   },
   "bblayers.BitbakeConfigBuild.test_enable_disable_builtin_fragments": {
    "duration": 22.93066692352295,
    "status": "PASSED"
   },
   "bblayers.BitbakeConfigBuild.test_enable_disable_fragments": {
    "duration": 18.82045340538025,
    "status": "PASSED"
   },
   "bblayers.BitbakeConfigBuild.test_show_fragment": {
    "duration": 2.313258409500122,
    "status": "PASSED"
   },
   "bblayers.BitbakeLayers.test_bitbakelayers_add_remove": {
    "duration": 9.358100652694702,
    "status": "PASSED"
   },
   "bblayers.BitbakeLayers.test_bitbakelayers_createlayer": {
    "duration": 8.20191216468811,
    "status": "PASSED"
   },
   "bblayers.BitbakeLayers.test_bitbakelayers_flatten": {
    "duration": 35.60581421852112,
    "status": "PASSED"
   },
   "bblayers.BitbakeLayers.test_bitbakelayers_layerindexshowdepends": {
    "duration": 1.8710377216339111,
    "status": "PASSED"
   },
   "bblayers.BitbakeLayers.test_bitbakelayers_setup": {
    "duration": 48.58012771606445,
    "status": "PASSED"
   },
   "bblayers.BitbakeLayers.test_bitbakelayers_showappends": {
    "duration": 12.419089317321777,
    "status": "PASSED"
   },
   "bblayers.BitbakeLayers.test_bitbakelayers_showcrossdepends": {
    "duration": 33.19347286224365,
    "status": "PASSED"
   },
   "bblayers.BitbakeLayers.test_bitbakelayers_showlayers": {
    "duration": 1.067525863647461,
    "status": "PASSED"
   },
   "bblayers.BitbakeLayers.test_bitbakelayers_showoverlayed": {
    "duration": 6.527832984924316,
    "status": "PASSED"
   },
   "bblayers.BitbakeLayers.test_bitbakelayers_showrecipes": {
    "duration": 31.17342710494995,
    "status": "PASSED"
   },
   "bblayers.BitbakeLayers.test_bitbakelayers_updatelayer": {
    "duration": 7.50510573387146,
    "status": "PASSED"
   },
   "bblayers.BitbakeLayers.test_validate_bitbake_setup_default_registry": {
    "duration": 2.4115493297576904,
    "status": "PASSED"
   },
   "bblayers.BitbakeLayers.test_validate_examplelayersjson": {
    "duration": 0.2877078056335449,
    "status": "PASSED"
   },
   "bblock.BBLock.test_lock_architecture_specific": {
    "duration": 99.39278841018677,
    "status": "PASSED"
   },
   "bblock.BBLock.test_lock_multiple_recipe_single_task": {
    "duration": 851.1766247749329,
    "status": "PASSED"
   },
   "bblock.BBLock.test_lock_single_recipe_all_tasks": {
    "duration": 1025.1537263393402,
    "status": "PASSED"
   },
   "bblock.BBLock.test_lock_single_recipe_multiple_tasks": {
    "duration": 260.63482427597046,
    "status": "PASSED"
   },
   "bblock.BBLock.test_lock_single_recipe_single_task": {
    "duration": 146.12901782989502,
    "status": "PASSED"
   },
   "bblogging.BitBakeLogging.test_python_exec_func_python_loggingA": {
    "duration": 45.51051473617554,
    "status": "PASSED"
   },
   "bblogging.BitBakeLogging.test_python_exec_func_python_loggingB": {
    "duration": 34.731449604034424,
    "status": "PASSED"
   },
   "bblogging.BitBakeLogging.test_python_exec_func_python_loggingC": {
    "duration": 34.09115290641785,
    "status": "PASSED"
   },
   "bblogging.BitBakeLogging.test_python_exec_func_python_loggingD": {
    "duration": 13.852787494659424,
    "status": "PASSED"
   },
   "bblogging.BitBakeLogging.test_python_exec_func_shell_loggingA": {
    "duration": 17.60675597190857,
    "status": "PASSED"
   },
   "bblogging.BitBakeLogging.test_python_exec_func_shell_loggingB": {
    "duration": 14.255493879318237,
    "status": "PASSED"
   },
   "bblogging.BitBakeLogging.test_python_exec_func_shell_loggingC": {
    "duration": 18.771224975585938,
    "status": "PASSED"
   },
   "bblogging.BitBakeLogging.test_python_exec_func_shell_loggingD": {
    "duration": 16.875725984573364,
    "status": "PASSED"
   },
   "bblogging.BitBakeLogging.test_python_exit_loggingA": {
    "duration": 15.055775880813599,
    "status": "PASSED"
   },
   "bblogging.BitBakeLogging.test_python_exit_loggingB": {
    "duration": 17.248029708862305,
    "status": "PASSED"
   },
   "bblogging.BitBakeLogging.test_python_exit_loggingC": {
    "duration": 15.967363357543945,
    "status": "PASSED"
   },
   "bblogging.BitBakeLogging.test_python_exit_loggingD": {
    "duration": 17.508544206619263,
    "status": "PASSED"
   },
   "bblogging.BitBakeLogging.test_python_fatal_loggingA": {
    "duration": 15.449722290039062,
    "status": "PASSED"
   },
   "bblogging.BitBakeLogging.test_python_fatal_loggingB": {
    "duration": 15.39674973487854,
    "status": "PASSED"
   },
   "bblogging.BitBakeLogging.test_python_fatal_loggingC": {
    "duration": 15.857203006744385,
    "status": "PASSED"
   },
   "bblogging.BitBakeLogging.test_python_fatal_loggingD": {
    "duration": 15.359043836593628,
    "status": "PASSED"
   },
   "bblogging.BitBakeLogging.test_shell_loggingA": {
    "duration": 16.046398878097534,
    "status": "PASSED"
   },
   "bblogging.BitBakeLogging.test_shell_loggingB": {
    "duration": 14.88733720779419,
    "status": "PASSED"
   },
   "bblogging.BitBakeLogging.test_shell_loggingC": {
    "duration": 15.820730686187744,
    "status": "PASSED"
   },
   "bblogging.BitBakeLogging.test_shell_loggingD": {
    "duration": 16.49311637878418,
    "status": "PASSED"
   },
   "bbtests.BitbakeTests.test_bb_env_bb_getvar_equality": {
    "duration": 4.014441251754761,
    "status": "PASSED"
   },
   "bbtests.BitbakeTests.test_bbappend_order": {
    "duration": 38.727065563201904,
    "status": "PASSED"
   },
   "bbtests.BitbakeTests.test_bitbake_g": {
    "duration": 6.550708770751953,
    "status": "PASSED"
   },
   "bbtests.BitbakeTests.test_bitbake_invalid_recipe": {
    "duration": 2.401144027709961,
    "status": "PASSED"
   },
   "bbtests.BitbakeTests.test_bitbake_invalid_target": {
    "duration": 6.9285759925842285,
    "status": "PASSED"
   },
   "bbtests.BitbakeTests.test_checkuri": {
    "duration": 12.681532859802246,
    "status": "PASSED"
   },
   "bbtests.BitbakeTests.test_continue": {
    "duration": 45.25701665878296,
    "status": "PASSED"
   },
   "bbtests.BitbakeTests.test_dry_run": {
    "duration": 9.182541608810425,
    "status": "PASSED"
   },
   "bbtests.BitbakeTests.test_environment": {
    "duration": 3.526503086090088,
    "status": "PASSED"
   },
   "bbtests.BitbakeTests.test_event_handler": {
    "duration": 33.839271545410156,
    "status": "PASSED"
   },
   "bbtests.BitbakeTests.test_force_task_1": {
    "duration": 109.71156358718872,
    "status": "PASSED"
   },
   "bbtests.BitbakeTests.test_force_task_2": {
    "duration": 66.75471663475037,
    "status": "PASSED"
   },
   "bbtests.BitbakeTests.test_git_patchtool": {
    "duration": 26.93186616897583,
    "status": "PASSED"
   },
   "bbtests.BitbakeTests.test_git_patchtool2": {
    "duration": 32.28047561645508,
    "status": "PASSED"
   },
   "bbtests.BitbakeTests.test_git_unpack_nonetwork": {
    "duration": 47.010154724121094,
    "status": "PASSED"
   },
   "bbtests.BitbakeTests.test_git_unpack_nonetwork_fail": {
    "duration": 19.036702871322632,
    "status": "PASSED"
   },
   "bbtests.BitbakeTests.test_image_manifest": {
    "duration": 3873.412454843521,
    "status": "PASSED"
   },
   "bbtests.BitbakeTests.test_invalid_patch": {
    "duration": 34.272237062454224,
    "status": "PASSED"
   },
   "bbtests.BitbakeTests.test_invalid_recipe_src_uri": {
    "duration": 3.186941146850586,
    "status": "PASSED"
   },
   "bbtests.BitbakeTests.test_just_parse": {
    "duration": 2.5048112869262695,
    "status": "PASSED"
   },
   "bbtests.BitbakeTests.test_local_sstate": {
    "duration": 23.028197050094604,
    "status": "PASSED"
   },
   "bbtests.BitbakeTests.test_non_gplv3": {
    "duration": 392.5546016693115,
    "status": "PASSED"
   },
   "bbtests.BitbakeTests.test_postfile": {
    "duration": 4.583231449127197,
    "status": "PASSED"
   },
   "bbtests.BitbakeTests.test_prefile": {
    "duration": 5.796698808670044,
    "status": "PASSED"
   },
   "bbtests.BitbakeTests.test_rename_downloaded_file": {
    "duration": 27.037192821502686,
    "status": "PASSED"
   },
   "bbtests.BitbakeTests.test_run_bitbake_from_dir_1": {
    "duration": 3.0499942302703857,
    "status": "PASSED"
   },
   "bbtests.BitbakeTests.test_run_bitbake_from_dir_2": {
    "duration": 3.2876241207122803,
    "status": "PASSED"
   },
   "bbtests.BitbakeTests.test_run_bitbake_from_dir_3": {
    "duration": 3.1110899448394775,
    "status": "PASSED"
   },
   "bbtests.BitbakeTests.test_setscene_only": {
    "duration": 24.695412635803223,
    "status": "PASSED"
   },
   "bbtests.BitbakeTests.test_skip_setscene": {
    "duration": 48.10335612297058,
    "status": "PASSED"
   },
   "bbtests.BitbakeTests.test_unexpanded_variable_in_path": {
    "duration": 26.32165002822876,
    "status": "PASSED"
   },
   "bbtests.BitbakeTests.test_version": {
    "duration": 5.027190446853638,
    "status": "PASSED"
   },
   "bbtests.BitbakeTests.test_warnings_errors": {
    "duration": 0.9841909408569336,
    "status": "PASSED"
   },
   "buildhistory.BuildhistoryTests.test_buildhistory_basic": {
    "duration": 68.80874705314636,
    "status": "PASSED"
   },
   "buildhistory.BuildhistoryTests.test_buildhistory_buildtime_pr_backwards": {
    "duration": 84.5124192237854,
    "status": "PASSED"
   },
   "buildhistory.BuildhistoryTests.test_buildhistory_diff": {
    "duration": 95.56296277046204,
    "status": "PASSED"
   },
   "buildhistory.BuildhistoryTests.test_fileinfo": {
    "duration": 25.899574995040894,
    "status": "PASSED"
   },
   "buildoptions.ArchiverTest.test_arch_work_dir_and_export_source": {
    "duration": 55.40512752532959,
    "status": "PASSED"
   },
   "buildoptions.DiskMonTest.test_stoptask_behavior": {
    "duration": 111.88906788825989,
    "status": "PASSED"
   },
   "buildoptions.ImageOptionsTests.test_ccache_tool": {
    "duration": 132.5622477531433,
    "status": "PASSED"
   },
   "buildoptions.ImageOptionsTests.test_incremental_image_generation": {
    "duration": 4565.625567913055,
    "status": "PASSED"
   },
   "buildoptions.ImageOptionsTests.test_read_only_image": {
    "duration": 225.56582140922546,
    "status": "PASSED"
   },
   "buildoptions.Poisoning.test_poisoning": {
    "duration": 46.104570627212524,
    "status": "PASSED"
   },
   "buildoptions.SanityOptionsTest.test_layer_without_git_dir": {
    "duration": 30.711631059646606,
    "status": "PASSED"
   },
   "buildoptions.SanityOptionsTest.test_options_warnqa_errorqa_switch": {
    "duration": 111.96126294136047,
    "status": "PASSED"
   },
   "buildoptions.ToolchainOptions.test_toolchain_fortran": {
    "duration": 2308.3255586624146,
    "status": "PASSED"
   },
   "c_cpp.CMakeTests.test_cmake_qemu": {
    "duration": 69.31622910499573,
    "status": "PASSED"
   },
   "c_cpp.CMakeTests.test_cmake_qemu_failing": {
    "duration": 49.37935996055603,
    "status": "PASSED"
   },
   "c_cpp.MesonTests.test_meson_qemu": {
    "duration": 45.99537253379822,
    "status": "PASSED"
   },
   "c_cpp.MesonTests.test_meson_qemu_failing": {
    "duration": 47.40339636802673,
    "status": "PASSED"
   },
   "containerimage.ContainerImageTests.test_expected_files": {
    "duration": 4508.402138948441,
    "status": "PASSED"
   },
   "cve_check.CVECheck.test_convert_cve_version": {
    "duration": 0.011009693145751953,
    "status": "PASSED"
   },
   "cve_check.CVECheck.test_parse_cve_from_patch_contents": {
    "duration": 0.0076138973236083984,
    "status": "PASSED"
   },
   "cve_check.CVECheck.test_parse_cve_from_patch_filename": {
    "duration": 0.008126974105834961,
    "status": "PASSED"
   },
   "cve_check.CVECheck.test_product_match": {
    "duration": 0.010435819625854492,
    "status": "PASSED"
   },
   "cve_check.CVECheck.test_version_compare": {
    "duration": 0.010364294052124023,
    "status": "PASSED"
   },
   "debuginfod.Debuginfod.test_debuginfod_native": {
    "duration": 72.50600361824036,
    "status": "PASSED"
   },
   "debuginfod.Debuginfod.test_debuginfod_qemu": {
    "duration": 4085.260999917984,
    "oetags": [
     "runqemu"
    ],
    "status": "PASSED"
   },
   "devtool.DevtoolAddTests.test_devtool_add": {
    "duration": 116.75220847129822,
    "status": "PASSED"
   },
   "devtool.DevtoolAddTests.test_devtool_add_binary": {
    "duration": 68.09932088851929,
    "status": "PASSED"
   },
   "devtool.DevtoolAddTests.test_devtool_add_fetch": {
    "duration": 73.08837175369263,
    "status": "PASSED"
   },
   "devtool.DevtoolAddTests.test_devtool_add_fetch_git": {
    "duration": 77.14132809638977,
    "status": "PASSED"
   },
   "devtool.DevtoolAddTests.test_devtool_add_fetch_simple": {
    "duration": 39.10708951950073,
    "status": "PASSED"
   },
   "devtool.DevtoolAddTests.test_devtool_add_git_local": {
    "duration": 48.87602233886719,
    "status": "PASSED"
   },
   "devtool.DevtoolAddTests.test_devtool_add_git_style1": {
    "duration": 46.37060332298279,
    "status": "PASSED"
   },
   "devtool.DevtoolAddTests.test_devtool_add_git_style2": {
    "duration": 45.255990505218506,
    "status": "PASSED"
   },
   "devtool.DevtoolAddTests.test_devtool_add_library": {
    "duration": 66.88448572158813,
    "status": "PASSED"
   },
   "devtool.DevtoolAddTests.test_devtool_add_npm": {
    "duration": 1.0410726070404053,
    "log": "Test needs meta-oe for nodejs\n",
    "status": "SKIPPED"
   },
   "devtool.DevtoolAddTests.test_devtool_add_python_egg_requires": {
    "duration": 35.22053098678589,
    "status": "PASSED"
   },
   "devtool.DevtoolBuildImageTests.test_devtool_build_image": {
    "duration": 3539.7017369270325,
    "status": "PASSED"
   },
   "devtool.DevtoolDeployTargetTests.test_devtool_deploy_target": {
    "duration": 279.85990142822266,
    "oetags": [
     "runqemu"
    ],
    "status": "PASSED"
   },
   "devtool.DevtoolExtractTests.test_devtool_extract": {
    "duration": 66.48565793037415,
    "status": "PASSED"
   },
   "devtool.DevtoolExtractTests.test_devtool_extract_virtual": {
    "duration": 45.01020312309265,
    "status": "PASSED"
   },
   "devtool.DevtoolIdeSdkTests.test_devtool_ide_sdk_code_cmake": {
    "duration": 4798.102402687073,
    "oetags": [
     "runqemu"
    ],
    "status": "PASSED"
   },
   "devtool.DevtoolIdeSdkTests.test_devtool_ide_sdk_code_kernel_module": {
    "duration": 212.70112371444702,
    "oetags": [
     "runqemu"
    ],
    "status": "PASSED"
   },
   "devtool.DevtoolIdeSdkTests.test_devtool_ide_sdk_code_meson": {
    "duration": 230.92123317718506,
    "status": "PASSED"
   },
   "devtool.DevtoolIdeSdkTests.test_devtool_ide_sdk_none_qemu": {
    "duration": 639.5947785377502,
    "oetags": [
     "runqemu"
    ],
    "status": "PASSED"
   },
   "devtool.DevtoolIdeSdkTests.test_devtool_ide_sdk_plugins": {
    "duration": 61.65554451942444,
    "status": "PASSED"
   },
   "devtool.DevtoolIdeSdkTests.test_devtool_ide_sdk_shared_sysroots": {
    "duration": 78.77424597740173,
    "status": "PASSED"
   },
   "devtool.DevtoolModifyTests.test_devtool_buildclean": {
    "duration": 638.7652809619904,
    "status": "PASSED"
   },
   "devtool.DevtoolModifyTests.test_devtool_modify": {
    "duration": 261.40191555023193,
    "status": "PASSED"
   },
   "devtool.DevtoolModifyTests.test_devtool_modify_git": {
    "duration": 110.80495357513428,
    "status": "PASSED"
   },
   "devtool.DevtoolModifyTests.test_devtool_modify_git_crates_subpath": {
    "duration": 119.55992221832275,
    "status": "PASSED"
   },
   "devtool.DevtoolModifyTests.test_devtool_modify_git_no_extract": {
    "duration": 38.10385870933533,
    "status": "PASSED"
   },
   "devtool.DevtoolModifyTests.test_devtool_modify_go": {
    "duration": 58.1782386302948,
    "status": "PASSED"
   },
   "devtool.DevtoolModifyTests.test_devtool_modify_invalid": {
    "duration": 167.82418537139893,
    "status": "PASSED"
   },
   "devtool.DevtoolModifyTests.test_devtool_modify_localfiles": {
    "duration": 171.00583624839783,
    "status": "PASSED"
   },
   "devtool.DevtoolModifyTests.test_devtool_modify_localfiles_only": {
    "duration": 96.63472056388855,
    "status": "PASSED"
   },
   "devtool.DevtoolModifyTests.test_devtool_modify_multiple_sources": {
    "duration": 2201.228840827942,
    "status": "PASSED"
   },
   "devtool.DevtoolModifyTests.test_devtool_modify_native": {
    "duration": 443.1982169151306,
    "status": "PASSED"
   },
   "devtool.DevtoolModifyTests.test_devtool_modify_nested_gitsm": {
    "duration": 39.500691175460815,
    "status": "PASSED"
   },
   "devtool.DevtoolModifyTests.test_devtool_modify_overrides": {
    "duration": 32.59436893463135,
    "status": "PASSED"
   },
   "devtool.DevtoolModifyTests.test_devtool_modify_virtual": {
    "duration": 31.6366708278656,
    "status": "PASSED"
   },
   "devtool.DevtoolResetTests.test_devtool_reset_all": {
    "duration": 173.13248014450073,
    "status": "PASSED"
   },
   "devtool.DevtoolResetTests.test_devtool_reset_re_plus_plus": {
    "duration": 36.64934587478638,
    "status": "PASSED"
   },
   "devtool.DevtoolTests.test_create_workspace": {
    "duration": 8.763901948928833,
    "status": "PASSED"
   },
   "devtool.DevtoolUpdateTests.test_devtool_finish_modify_git_subdir": {
    "duration": 149.3574149608612,
    "status": "PASSED"
   },
   "devtool.DevtoolUpdateTests.test_devtool_git_submodules": {
    "duration": 231.45877361297607,
    "status": "PASSED"
   },
   "devtool.DevtoolUpdateTests.test_devtool_update_recipe": {
    "duration": 62.729177474975586,
    "status": "PASSED"
   },
   "devtool.DevtoolUpdateTests.test_devtool_update_recipe_append": {
    "duration": 118.26327276229858,
    "status": "PASSED"
   },
   "devtool.DevtoolUpdateTests.test_devtool_update_recipe_append_git": {
    "duration": 120.21982049942017,
    "status": "PASSED"
   },
   "devtool.DevtoolUpdateTests.test_devtool_update_recipe_git": {
    "duration": 65.87979483604431,
    "status": "PASSED"
   },
   "devtool.DevtoolUpdateTests.test_devtool_update_recipe_local_files": {
    "duration": 128.88985657691956,
    "status": "PASSED"
   },
   "devtool.DevtoolUpdateTests.test_devtool_update_recipe_local_files_3": {
    "duration": 58.01268815994263,
    "status": "PASSED"
   },
   "devtool.DevtoolUpdateTests.test_devtool_update_recipe_local_files_subdir": {
    "duration": 54.04613280296326,
    "status": "PASSED"
   },
   "devtool.DevtoolUpdateTests.test_devtool_update_recipe_local_patch_gz": {
    "duration": 59.216946840286255,
    "status": "PASSED"
   },
   "devtool.DevtoolUpdateTests.test_devtool_update_recipe_long_filename": {
    "duration": 67.87290716171265,
    "status": "PASSED"
   },
   "devtool.DevtoolUpdateTests.test_devtool_update_recipe_with_gitignore": {
    "duration": 69.76091408729553,
    "status": "PASSED"
   },
   "devtool.DevtoolUpgradeTests.test_devtool_finish_modify_origlayer": {
    "duration": 115.69736647605896,
    "status": "PASSED"
   },
   "devtool.DevtoolUpgradeTests.test_devtool_finish_modify_otherlayer": {
    "duration": 76.48042416572571,
    "status": "PASSED"
   },
   "devtool.DevtoolUpgradeTests.test_devtool_finish_update_patch": {
    "duration": 77.74046325683594,
    "status": "PASSED"
   },
   "devtool.DevtoolUpgradeTests.test_devtool_finish_upgrade_origlayer": {
    "duration": 87.06504678726196,
    "status": "PASSED"
   },
   "devtool.DevtoolUpgradeTests.test_devtool_finish_upgrade_otherlayer": {
    "duration": 94.56561827659607,
    "status": "PASSED"
   },
   "devtool.DevtoolUpgradeTests.test_devtool_layer_plugins": {
    "duration": 3.669919490814209,
    "status": "PASSED"
   },
   "devtool.DevtoolUpgradeTests.test_devtool_load_plugin": {
    "duration": 13.600299596786499,
    "status": "PASSED"
   },
   "devtool.DevtoolUpgradeTests.test_devtool_rename": {
    "duration": 89.25903916358948,
    "status": "PASSED"
   },
   "devtool.DevtoolUpgradeTests.test_devtool_upgrade": {
    "duration": 78.92307996749878,
    "status": "PASSED"
   },
   "devtool.DevtoolUpgradeTests.test_devtool_upgrade_all_checksums": {
    "duration": 75.43210482597351,
    "status": "PASSED"
   },
   "devtool.DevtoolUpgradeTests.test_devtool_upgrade_drop_md5sum": {
    "duration": 74.11261749267578,
    "status": "PASSED"
   },
   "devtool.DevtoolUpgradeTests.test_devtool_upgrade_git": {
    "duration": 48.42181706428528,
    "status": "PASSED"
   },
   "devtool.DevtoolUpgradeTests.test_devtool_upgrade_gitsm": {
    "duration": 54.549020290374756,
    "status": "PASSED"
   },
   "devtool.DevtoolUpgradeTests.test_devtool_upgrade_recipe_upgrade_extra_tasks": {
    "duration": 74.46919512748718,
    "status": "PASSED"
   },
   "devtool.DevtoolUpgradeTests.test_devtool_virtual_kernel_modify": {
    "duration": 1362.3823263645172,
    "status": "PASSED"
   },
   "distrodata.Distrodata.test_checkpkg": {
    "duration": 0.0006363391876220703,
    "log": "Skip by the command line argument \"distrodata.Distrodata.test_checkpkg\"\n",
    "status": "SKIPPED"
   },
   "distrodata.Distrodata.test_common_include_recipes": {
    "duration": 102.75408625602722,
    "status": "PASSED"
   },
   "distrodata.Distrodata.test_maintainers": {
    "duration": 112.03558373451233,
    "status": "PASSED"
   },
   "efibootpartition.GenericEFITest.test_boot_efi": {
    "duration": 213.6949872970581,
    "status": "PASSED"
   },
   "esdk.oeSDKExtSelfTest.test_image_generation_binary_feeds": {
    "duration": 109.62101697921753,
    "status": "PASSED"
   },
   "esdk.oeSDKExtSelfTest.test_install_libraries_headers": {
    "duration": 47.22822165489197,
    "status": "PASSED"
   },
   "externalsrc.ExternalSrc.test_externalsrc_srctree_hash_files": {
    "duration": 72.0170214176178,
    "status": "PASSED"
   },
   "fetch.Dependencies.test_dependencies": {
    "duration": 2.6833670139312744,
    "status": "PASSED"
   },
   "fetch.Fetch.test_git_mirrors": {
    "duration": 93.36190414428711,
    "status": "PASSED"
   },
   "fitimage.FitImagePyTests.test_fitimage_py_conf_extra_mappings_unused_error": {
    "duration": 0.021348953247070312,
    "status": "PASSED"
   },
   "fitimage.FitImagePyTests.test_fitimage_py_conf_loadables": {
    "duration": 0.008782625198364258,
    "status": "PASSED"
   },
   "fitimage.FitImagePyTests.test_fitimage_py_conf_mappings": {
    "duration": 0.00671076774597168,
    "status": "PASSED"
   },
   "fitimage.FitImagePyTests.test_fitimage_py_conf_mappings_unused_error": {
    "duration": 0.0057392120361328125,
    "status": "PASSED"
   },
   "fitimage.FitImagePyTests.test_fitimage_py_conf_mappings_with_alias": {
    "duration": 0.0062825679779052734,
    "status": "PASSED"
   },
   "fitimage.FitImagePyTests.test_fitimage_py_default": {
    "duration": 0.006075620651245117,
    "status": "PASSED"
   },
   "fitimage.FitImagePyTests.test_fitimage_py_default_dtb": {
    "duration": 0.006217002868652344,
    "status": "PASSED"
   },
   "fitimage.KernelFitImageRecipeTests.test_fit_image": {
    "duration": 774.516624212265,
    "status": "PASSED"
   },
   "fitimage.KernelFitImageRecipeTests.test_fit_image_ext_dtb_dtbo": {
    "duration": 205.11942195892334,
    "status": "PASSED"
   },
   "fitimage.KernelFitImageRecipeTests.test_fit_image_sign_initramfs": {
    "duration": 190.94259071350098,
    "status": "PASSED"
   },
   "fitimage.KernelFitImageRecipeTests.test_fit_image_sign_initramfs_bundle": {
    "duration": 192.68690729141235,
    "status": "PASSED"
   },
   "fitimage.KernelFitImageRecipeTests.test_get_compatible_from_dtb": {
    "duration": 67.34659481048584,
    "status": "PASSED"
   },
   "fitimage.KernelFitImageRecipeTests.test_sign_fit_image_configurations": {
    "duration": 61.576419830322266,
    "status": "PASSED"
   },
   "fitimage.KernelFitImageRecipeTests.test_sign_fit_image_individual": {
    "duration": 65.01961374282837,
    "status": "PASSED"
   },
   "fitimage.UBootFitImageTests.test_sign_cascaded_uboot_fit_image": {
    "duration": 1.2796568870544434,
    "log": "MACHINE=qemux86-64 does not provide capability _cap_spl_dtb\n",
    "status": "SKIPPED"
   },
   "fitimage.UBootFitImageTests.test_sign_standalone_uboot_atf_tee_fit_image": {
    "duration": 0.7669954299926758,
    "log": "MACHINE=qemux86-64 does not provide capability _cap_spl_dtb\n",
    "status": "SKIPPED"
   },
   "fitimage.UBootFitImageTests.test_sign_standalone_uboot_fit_image": {
    "duration": 0.7604899406433105,
    "log": "MACHINE=qemux86-64 does not provide capability _cap_spl_dtb\n",
    "status": "SKIPPED"
   },
   "fitimage.UBootFitImageTests.test_sign_uboot_fit_image_without_spl": {
    "duration": 417.0237991809845,
    "status": "PASSED"
   },
   "fitimage.UBootFitImageTests.test_sign_uboot_kernel_individual": {
    "duration": 102.20431303977966,
    "status": "PASSED"
   },
   "fitimage.UBootFitImageTests.test_uboot_atf_tee_fit_image": {
    "duration": 1.2146201133728027,
    "log": "MACHINE=qemux86-64 does not provide capability _cap_atf_tee\n",
    "status": "SKIPPED"
   },
   "fitimage.UBootFitImageTests.test_uboot_fit_image": {
    "duration": 63.7257297039032,
    "status": "PASSED"
   },
   "gdbserver.GdbServerTest.test_gdb_server": {
    "duration": 157.69868564605713,
    "status": "PASSED"
   },
   "gitarchivetests.GitArchiveTests.test_create_first_test_tag": {
    "duration": 1.3279008865356445,
    "status": "PASSED"
   },
   "gitarchivetests.GitArchiveTests.test_create_second_test_tag": {
    "duration": 1.6314339637756348,
    "status": "PASSED"
   },
   "gitarchivetests.GitArchiveTests.test_get_revs_on_branch": {
    "duration": 0.8934729099273682,
    "status": "PASSED"
   },
   "gitarchivetests.GitArchiveTests.test_get_tags_with_only_local_tag": {
    "duration": 0.4956831932067871,
    "status": "PASSED"
   },
   "gitarchivetests.GitArchiveTests.test_get_tags_without_valid_remote": {
    "duration": 0.9870538711547852,
    "status": "PASSED"
   },
   "gitarchivetests.GitArchiveTests.test_get_tags_without_valid_remote_and_wrong_url": {
    "duration": 0.36145639419555664,
    "status": "PASSED"
   },
   "gotoolchain.oeGoToolchainSelfTest.test_go_dep_build": {
    "duration": 3.162518262863159,
    "status": "PASSED"
   },
   "image_typedep.ImageTypeDepTests.test_conversion_typedep_added": {
    "duration": 37.76178002357483,
    "status": "PASSED"
   },
   "imagefeatures.ImageFeatures.test_all_users_can_connect_via_ssh_without_password": {
    "duration": 313.38194036483765,
    "oetags": [
     "runqemu"
    ],
    "status": "PASSED"
   },
   "imagefeatures.ImageFeatures.test_bmap": {
    "duration": 111.35058856010437,
    "status": "PASSED"
   },
   "imagefeatures.ImageFeatures.test_empty_image": {
    "duration": 70.19129943847656,
    "status": "PASSED"
   },
   "imagefeatures.ImageFeatures.test_hypervisor_fmts": {
    "duration": 130.13024520874023,
    "status": "PASSED"
   },
   "imagefeatures.ImageFeatures.test_image_fstypes": {
    "duration": 182.9656856060028,
    "status": "PASSED"
   },
   "imagefeatures.ImageFeatures.test_image_gen_debugfs": {
    "duration": 100.8686740398407,
    "status": "PASSED"
   },
   "imagefeatures.ImageFeatures.test_long_chain_conversion": {
    "duration": 78.59722661972046,
    "status": "PASSED"
   },
   "imagefeatures.ImageFeatures.test_mandb": {
    "duration": 2391.0987725257874,
    "status": "PASSED"
   },
   "imagefeatures.ImageFeatures.test_no_busybox_base_utils": {
    "duration": 32.02210855484009,
    "status": "PASSED"
   },
   "imagefeatures.ImageFeatures.test_non_root_user_can_connect_via_ssh_without_password": {
    "duration": 100.14384174346924,
    "oetags": [
     "runqemu"
    ],
    "status": "PASSED"
   },
   "imagefeatures.ImageFeatures.test_useradd_static": {
    "duration": 198.18241500854492,
    "status": "PASSED"
   },
   "imagefeatures.ImageFeatures.test_wayland_support_in_image": {
    "duration": 159.69027042388916,
    "status": "PASSED"
   },
   "incompatible_lic.IncompatibleLicensePerImageTests.test_bash_and_license": {
    "duration": 158.97370839118958,
    "status": "PASSED"
   },
   "incompatible_lic.IncompatibleLicensePerImageTests.test_bash_default": {
    "duration": 75.97553300857544,
    "status": "PASSED"
   },
   "incompatible_lic.IncompatibleLicensePerImageTests.test_bash_license_exceptions": {
    "duration": 108.14816737174988,
    "status": "PASSED"
   },
   "incompatible_lic.IncompatibleLicensePerImageTests.test_bash_or_license": {
    "duration": 65.76598238945007,
    "status": "PASSED"
   },
   "incompatible_lic.IncompatibleLicenseTestObsolete.test_incompatible_alias_spdx_license": {
    "duration": 13.579803705215454,
    "status": "PASSED"
   },
   "incompatible_lic.IncompatibleLicenseTestObsolete.test_incompatible_alias_spdx_license_alias": {
    "duration": 11.845909357070923,
    "status": "PASSED"
   },
   "incompatible_lic.IncompatibleLicenseTestObsolete.test_incompatible_alias_spdx_license_alias_wildcard": {
    "duration": 11.67629861831665,
    "status": "PASSED"
   },
   "incompatible_lic.IncompatibleLicenseTestObsolete.test_incompatible_alias_spdx_license_wildcard": {
    "duration": 10.895681858062744,
    "status": "PASSED"
   },
   "incompatible_lic.IncompatibleLicenseTestObsolete.test_incompatible_all_licenses_wildcard": {
    "duration": 10.589466094970703,
    "status": "PASSED"
   },
   "incompatible_lic.IncompatibleLicenseTestObsolete.test_incompatible_spdx_license_alias_wildcard": {
    "duration": 10.664285898208618,
    "status": "PASSED"
   },
   "incompatible_lic.IncompatibleLicenseTestObsolete.test_incompatible_spdx_licenses_wildcard": {
    "duration": 11.424323320388794,
    "status": "PASSED"
   },
   "incompatible_lic.IncompatibleLicenseTests.test_incompatible_nonspdx_license": {
    "duration": 19.209551334381104,
    "status": "PASSED"
   },
   "incompatible_lic.IncompatibleLicenseTests.test_incompatible_spdx_license": {
    "duration": 19.763286590576172,
    "status": "PASSED"
   },
   "incompatible_lic.IncompatibleLicenseTests.test_incompatible_spdx_license_alias": {
    "duration": 5.2030558586120605,
    "status": "PASSED"
   },
   "incompatible_lic.IncompatibleLicenseTests.test_incompatible_spdx_license_wildcard": {
    "duration": 20.201875925064087,
    "status": "PASSED"
   },
   "incompatible_lic.IncompatibleLicenseTests.test_incompatible_spdx_licenses": {
    "duration": 22.602880716323853,
    "status": "PASSED"
   },
   "incompatible_lic.NoGPL3InImagesTests.test_core_image_full_cmdline_weston": {
    "duration": 580.6217181682587,
    "log": "testtools.testresult.real._StringException: Traceback (most recent call last):\n  File \"/srv/pokybuild/yocto-worker/oe-selftest-fedora/build/layers/openembedded-core/meta/lib/oeqa/core/decorator/__init__.py\", line 35, in wrapped_f\n    return func(*args, **kwargs)\n  File \"/srv/pokybuild/yocto-worker/oe-selftest-fedora/build/layers/openembedded-core/meta/lib/oeqa/selftest/cases/incompatible_lic.py\", line 156, in test_core_image_full_cmdline_weston\n    bitbake('-c testimage core-image-full-cmdline core-image-weston')\n    ~~~~~~~^^^^^^^^^^^^^^^^^^^^^^^^^^^^^^^^^^^^^^^^^^^^^^^^^^^^^^^^^^\n  File \"/srv/pokybuild/yocto-worker/oe-selftest-fedora/build/layers/openembedded-core/meta/lib/oeqa/utils/commands.py\", line 236, in bitbake\n    return runCmd(cmd, ignore_status, timeout, output_log=output_log, **options)\n  File \"/srv/pokybuild/yocto-worker/oe-selftest-fedora/build/layers/openembedded-core/meta/lib/oeqa/utils/commands.py\", line 214, in runCmd\n    raise AssertionError(\"Command '%s' returned non-zero exit status %d:\\n%s\" % (command, result.status, exc_output))\nAssertionError: Command 'bitbake  -c testimage core-image-full-cmdline core-image-weston' returned non-zero exit status 1:\nNOTE: Reconnecting to bitbake server...\nLoading cache...done.\nLoaded 2080 entries from dependency cache.\nNOTE: Resolving any missing task queue dependencies\n\nBuild Configuration:\nBB_VERSION           = \"2.19.0\"\nBUILD_SYS            = \"x86_64-linux\"\nNATIVELSBSTRING      = \"universal\"\nTARGET_SYS           = \"x86_64-poky-linux\"\nMACHINE              = \"qemux86-64\"\nSDKMACHINE           = \"x86_64\"\nDISTRO               = \"poky\"\nDISTRO_VERSION       = \"6.0.99+snapshot-10ace5cb9e4b9b323c3f713d3b15b6554681af2f\"\nTUNE_FEATURES        = \"m64 x86-64-v3\"\nmeta                 = \"mathieu/master-next:10ace5cb9e4b9b323c3f713d3b15b6554681af2f\"\nmeta-yocto-bsp       \nmeta-poky            = \"contrib/mathieu/master-next:366fa2f21bfb0d9c4de492e0204a0dd38ce241ab\"\nmeta-selftest        = \"master:fa69865645bfa660a201697077d926f62ec367f7\"\n\nInitialising tasks...NOTE: The /proc/pressure files can't be read. Continuing build without monitoring pressure\nSstate summary: Wanted 139 Local 139 Mirrors 0 Missed 0 Current 306 (100% match, 100% complete)\ndone.\nNOTE: Executing Tasks\nNOTE: Setscene tasks completed\nNOTE: Running task 1518 of 1519 (/srv/pokybuild/yocto-worker/oe-selftest-fedora/build/layers/openembedded-core/meta/recipes-graphics/images/core-image-weston.bb:do_testimage)\nNOTE: Running task 1519 of 1519 (/srv/pokybuild/yocto-worker/oe-selftest-fedora/build/layers/openembedded-core/meta/recipes-extended/images/core-image-full-cmdline.bb:do_testimage)\nNOTE: recipe core-image-weston-1.0-r0: task do_testimage: Started\nNOTE: recipe core-image-full-cmdline-1.0-r0: task do_testimage: Started\nQMP Available for connection at /srv/pokybuild/yocto-worker/oe-selftest-fedora/build/build-st-3264468/tmp/.88altjx8\nQMP Available for connection at /srv/pokybuild/yocto-worker/oe-selftest-fedora/build/build-st-3264468/tmp/.j6aigx5t\nQMP connected to QEMU at 06/23/26 14:26:37 and took 1.02 seconds\nQMP connected to QEMU at 06/23/26 14:26:37 and took 1.10 seconds\nQMP released QEMU at 06/23/26 14:26:37 and took 0.12 seconds from connect\nQMP released QEMU at 06/23/26 14:26:37 and took 0.12 seconds from connect\nTest requires apt to be installed\nTest requires autoconf to be installed\nTest requires gtk+3 to be installed\nTest requires autoconf to be installed\nTest requires connman to be installed\nTest case connman.ConnmanTest.test_connmand_running depends on connman.ConnmanTest.test_connmand_help but it didn't pass/run.\nTest requires dnf to be installed\nTest case dnf.DnfBasicTest.test_dnf_history depends on dnf.DnfBasicTest.test_dnf_help but it didn't pass/run.\nTest case dnf.DnfBasicTest.test_dnf_info depends on dnf.DnfBasicTest.test_dnf_help but it didn't pass/run.\nTest case dnf.DnfBasicTest.test_dnf_search depends on dnf.DnfBasicTest.test_dnf_help but it didn't pass/run.\nTest case dnf.DnfBasicTest.test_dnf_version depends on dnf.DnfBasicTest.test_dnf_help but it didn't pass/run.\nTest case dnf.DnfRepoTest.test_dnf_makecache depends on dnf.DnfBasicTest.test_dnf_help but it didn't pass/run.\nTest case dnf.DnfRepoTest.test_dnf_exclude depends on dnf.DnfRepoTest.test_dnf_makecache but it didn't pass/run.\nTest case dnf.DnfRepoTest.test_dnf_install depends on dnf.DnfRepoTest.test_dnf_makecache but it didn't pass/run.\nTest case dnf.DnfRepoTest.test_dnf_install_dependency depends on dnf.DnfRepoTest.test_dnf_install but it didn't pass/run.\nTest case dnf.DnfRepoTest.test_dnf_install_from_disk depends on dnf.DnfRepoTest.test_dnf_install_dependency but it didn't pass/run.\nTest case dnf.DnfRepoTest.test_dnf_install_from_http depends on dnf.DnfRepoTest.test_dnf_install_from_disk but it didn't pass/run.\nTest case dnf.DnfRepoTest.test_dnf_installroot depends on dnf.DnfRepoTest.test_dnf_makecache but it didn't pass/run.\nTest run when enable usrmerge\nTest case dnf.DnfRepoTest.test_dnf_reinstall depends on dnf.DnfRepoTest.test_dnf_install but it didn't pass/run.\nTest case dnf.DnfRepoTest.test_dnf_repoinfo depends on dnf.DnfRepoTest.test_dnf_makecache but it didn't pass/run.\nTest requires gcc to be installed\nTest requires g++ to be installed\nTest requires g++ to be installed\nTest requires make to be installed\nTest requires python3-pygobject to be installed\nTest requires cgo-helloworld to be installed\nTest requires go-runtime-dev to be installed\nTest requires go-runtime-dev to be installed\nTest requires go-helloworld to be installed\nTest requires gcc to be installed\nTest requires ldd to be installed\nTest requires logrotate to be installed\nTest case logrotate.LogrotateTest.test_logrotate_newlog depends on logrotate.LogrotateTest.test_logrotate_wtmp but it didn't pass/run.\nTest requires apt to be installed\nTest requires autoconf to be installed\nTest requires gtk+3 to be installed\nTest requires autoconf to be installed\nTest requires connman to be installed\nTest case connman.ConnmanTest.test_connmand_running depends on connman.ConnmanTest.test_connmand_help but it didn't pass/run.\nTest requires dnf to be installed\nTest case dnf.DnfBasicTest.test_dnf_history depends on dnf.DnfBasicTest.test_dnf_help but it didn't pass/run.\nTest case dnf.DnfBasicTest.test_dnf_info depends on dnf.DnfBasicTest.test_dnf_help but it didn't pass/run.\nTest case dnf.DnfBasicTest.test_dnf_search depends on dnf.DnfBasicTest.test_dnf_help but it didn't pass/run.\nTest case dnf.DnfBasicTest.test_dnf_version depends on dnf.DnfBasicTest.test_dnf_help but it didn't pass/run.\nTest case dnf.DnfRepoTest.test_dnf_makecache depends on dnf.DnfBasicTest.test_dnf_help but it didn't pass/run.\nTest case dnf.DnfRepoTest.test_dnf_exclude depends on dnf.DnfRepoTest.test_dnf_makecache but it didn't pass/run.\nTest case dnf.DnfRepoTest.test_dnf_install depends on dnf.DnfRepoTest.test_dnf_makecache but it didn't pass/run.\nTest case dnf.DnfRepoTest.test_dnf_install_dependency depends on dnf.DnfRepoTest.test_dnf_install but it didn't pass/run.\nTest case dnf.DnfRepoTest.test_dnf_install_from_disk depends on dnf.DnfRepoTest.test_dnf_install_dependency but it didn't pass/run.\nTest case dnf.DnfRepoTest.test_dnf_install_from_http depends on dnf.DnfRepoTest.test_dnf_install_from_disk but it didn't pass/run.\nTest case dnf.DnfRepoTest.test_dnf_installroot depends on dnf.DnfRepoTest.test_dnf_makecache but it didn't pass/run.\nTest run when enable usrmerge\nTest case dnf.DnfRepoTest.test_dnf_reinstall depends on dnf.DnfRepoTest.test_dnf_install but it didn't pass/run.\nTest case dnf.DnfRepoTest.test_dnf_repoinfo depends on dnf.DnfRepoTest.test_dnf_makecache but it didn't pass/run.\nTest requires gcc to be installed\nTest requires g++ to be installed\nTest requires g++ to be installed\nTest requires make to be installed\nTest requires python3-pygobject to be installed\nTest requires cgo-helloworld to be installed\nTest requires go-runtime-dev to be installed\nTest requires go-runtime-dev to be installed\nTest requires go-helloworld to be installed\nTest requires gcc to be installed\nTest requires ldd to be installed\nTest requires opkg to be installed\nTest requires pam to be in DISTRO_FEATURES\nNo syslog found to restart, ignoring\nTest requires busybox-syslog to be installed\nTest requires opkg to be installed\nTest requires pam to be in DISTRO_FEATURES\nTest requires perl to be installed\nTest requires ptest-runner to be installed\nTest requires ptest-runner to be installed\nTest requires python3-core to be installed\nNo /var/lib/rpm on target\nTest case rpm.RpmBasicTest.test_rpm_query_nonroot depends on rpm.RpmBasicTest.test_rpm_query but it didn't pass/run.\nTest case rpm.RpmInstallRemoveTest.test_rpm_install depends on rpm.RpmBasicTest.test_rpm_query but it didn't pass/run.\nTest case rpm.RpmInstallRemoveTest.test_rpm_remove depends on rpm.RpmInstallRemoveTest.test_rpm_install but it didn't pass/run.\nTest case rpm.RpmInstallRemoveTest.test_check_rpm_install_removal_log_file_size depends on rpm.RpmInstallRemoveTest.test_rpm_remove but it didn't pass/run.\nTest requires rust-c-lib-example-bin to be installed\nTest requires openssh-scp to be installed\nTest requires openssh-scp to be installed\nTest requires kernel-devsrc to be installed\nsystemd is not the init manager for this image\nTest case systemd.SystemdBasicTests.test_systemd_failed depends on systemd.SystemdBasicTests.test_systemd_basic but it didn't pass/run.\nTest case systemd.SystemdBasicTests.test_systemd_list depends on systemd.SystemdBasicTests.test_systemd_basic but it didn't pass/run.\nTest case systemd.SystemdJournalTests.test_systemd_boot_time depends on systemd.SystemdBasicTests.test_systemd_basic but it didn't pass/run.\nTest case systemd.SystemdJournalTests.test_systemd_journal depends on systemd.SystemdBasicTests.test_systemd_basic but it didn't pass/run.\nTest requires minidebuginfo to be in DISTRO_FEATURES\nTest case systemd.SystemdServiceTests.test_systemd_status depends on systemd.SystemdBasicTests.test_systemd_basic but it didn't pass/run.\nTest case systemd.SystemdServiceTests.test_systemd_disable_enable depends on systemd.SystemdServiceTests.test_systemd_status but it didn't pass/run.\nTest is only meant to run with read-only-rootfs in IMAGE_FEATURES\nTest case systemd.SystemdServiceTests.test_systemd_stop_start depends on systemd.SystemdServiceTests.test_systemd_status but it didn't pass/run.\nTraceback (most recent call last):\n  File \"/srv/pokybuild/yocto-worker/oe-selftest-fedora/build/layers/openembedded-core/meta/lib/oeqa/core/decorator/__init__.py\", line 35, in wrapped_f\n    return func(*args, **kwargs)\n  File \"/srv/pokybuild/yocto-worker/oe-selftest-fedora/build/layers/openembedded-core/meta/lib/oeqa/runtime/cases/weston.py\", line 58, in test_wayland_info\n    status, output = self.target.run(command)\n                     ~~~~~~~~~~~~~~~^^^^^^^^^\n  File \"/srv/pokybuild/yocto-worker/oe-selftest-fedora/build/layers/openembedded-core/meta/lib/oeqa/core/target/ssh.py\", line 98, in run\n    status, output = self._run(sshCmd, processTimeout, ignore_status, raw, ignore_ssh_fails)\n                     ~~~~~~~~~^^^^^^^^^^^^^^^^^^^^^^^^^^^^^^^^^^^^^^^^^^^^^^^^^^^^^^^^^^^^^^\n  File \"/srv/pokybuild/yocto-worker/oe-selftest-fedora/build/layers/openembedded-core/meta/lib/oeqa/core/target/ssh.py\", line 70, in _run\n    raise AssertionError(\"ssh exited with status '255' for command \"\n                         \"'%s': this is likely an SSH failure\\n%s\"\n                         % (command, output))\nAssertionError: ssh exited with status '255' for command '['ssh', '-l', 'root', '-o', 'ServerAliveCountMax=2', '-o', 'ServerAliveInterval=30', '-o', 'UserKnownHostsFile=/dev/null', '-o', 'StrictHostKeyChecking=no', '-o', 'LogLevel=ERROR', '192.168.7.38', 'export PATH=/usr/sbin:/sbin:/usr/bin:/bin; export XDG_RUNTIME_DIR=/run/user/`id -u user`; export WAYLAND_DISPLAY=wayland-1; wayland-info']': this is likely an SSH failure\nfailed to create display: No such file or directory\n\nTest requires perl to be installed\nTest requires ptest-runner to be installed\nTest requires ptest-runner to be installed\nTest requires python3-core to be installed\nTraceback (most recent call last):\n  File \"/srv/pokybuild/yocto-worker/oe-selftest-fedora/build/layers/openembedded-core/meta/lib/oeqa/core/decorator/__init__.py\", line 35, in wrapped_f\n    return func(*args, **kwargs)\n  File \"/srv/pokybuild/yocto-worker/oe-selftest-fedora/build/layers/openembedded-core/meta/lib/oeqa/runtime/cases/weston.py\", line 63, in test_weston_can_initialize_new_wayland_compositor\n    existing_wl_processes = self.get_processes_of('weston-desktop-shell', 'existing')\n  File \"/srv/pokybuild/yocto-worker/oe-selftest-fedora/build/layers/openembedded-core/meta/lib/oeqa/runtime/cases/weston.py\", line 28, in get_processes_of\n    self.assertEqual(status, 0, msg='Retrieve %s (%s) processes error: %s' % (target, error_msg, output))\n    ~~~~~~~~~~~~~~~~^^^^^^^^^^^^^^^^^^^^^^^^^^^^^^^^^^^^^^^^^^^^^^^^^^^^^^^^^^^^^^^^^^^^^^^^^^^^^^^^^^^^^\nAssertionError: 1 != 0 : Retrieve weston-desktop-shell (existing) processes error: \n\nNo /var/lib/rpm on target\nTest case rpm.RpmBasicTest.test_rpm_query_nonroot depends on rpm.RpmBasicTest.test_rpm_query but it didn't pass/run.\nTest case rpm.RpmInstallRemoveTest.test_rpm_install depends on rpm.RpmBasicTest.test_rpm_query but it didn't pass/run.\nTest case rpm.RpmInstallRemoveTest.test_rpm_remove depends on rpm.RpmInstallRemoveTest.test_rpm_install but it didn't pass/run.\nTest case rpm.RpmInstallRemoveTest.test_check_rpm_install_removal_log_file_size depends on rpm.RpmInstallRemoveTest.test_rpm_remove but it didn't pass/run.\nTest requires rust-c-lib-example-bin to be installed\nTest requires cargo to be installed\nTest requires rust to be installed\nTraceback (most recent call last):\n  File \"/srv/pokybuild/yocto-worker/oe-selftest-fedora/build/layers/openembedded-core/meta/lib/oeqa/core/decorator/__init__.py\", line 35, in wrapped_f\n    return func(*args, **kwargs)\n  File \"/srv/pokybuild/yocto-worker/oe-selftest-fedora/build/layers/openembedded-core/meta/lib/oeqa/core/decorator/__init__.py\", line 35, in wrapped_f\n    return func(*args, **kwargs)\n  File \"/srv/pokybuild/yocto-worker/oe-selftest-fedora/build/layers/openembedded-core/meta/lib/oeqa/runtime/cases/weston.py\", line 24, in test_weston_running\n    self.assertEqual(status, 0, msg=msg)\n    ~~~~~~~~~~~~~~~~^^^^^^^^^^^^^^^^^^^^\nAssertionError: 1 != 0 : Weston does not appear to be running   PID USER       VSZ STAT COMMAND\n    1 root      2664 S    init [5]\n    2 root         0 SW   [kthreadd]\n    3 root         0 SW   [pool_workqueue_]\n    4 root         0 IW<  [kworker/R-rcu_g]\n    5 root         0 IW<  [kworker/R-sync_]\n    6 root         0 IW<  [kworker/R-kvfre]\n    7 root         0 IW<  [kworker/R-slub_]\n    8 root         0 IW<  [kworker/R-netns]\n    9 root         0 IW   [kworker/0:0-pm]\n   10 root         0 IW   [kworker/0:1-eve]\n   11 root         0 IW<  [kworker/0:0H-ev]\n   12 root         0 IW   [kworker/u16:0-e]\n   13 root         0 IW   [kworker/u16:1-e]\n   14 root         0 IW<  [kworker/R-mm_pe]\n   15 root         0 SW   [ksoftirqd/0]\n   16 root         0 IW   [rcu_preempt]\n   17 root         0 SW   [rcu_exp_par_gp_]\n   18 root         0 SW   [rcu_exp_gp_kthr]\n   19 root         0 SW   [migration/0]\n   20 root         0 SW   [cpuhp/0]\n   21 root         0 SW   [cpuhp/1]\n   22 root         0 SW   [migration/1]\n   23 root         0 SW   [ksoftirqd/1]\n   24 root         0 IW   [kworker/1:0-mm_]\n   25 root         0 IW<  [kworker/1:0H-ev]\n   26 root         0 SW   [cpuhp/2]\n   27 root         0 SW   [migration/2]\n   28 root         0 SW   [ksoftirqd/2]\n   29 root         0 IW   [kworker/2:0-eve]\n   30 root         0 IW<  [kworker/2:0H-ev]\n   31 root         0 SW   [cpuhp/3]\n   32 root         0 SW   [migration/3]\n   33 root         0 SW   [ksoftirqd/3]\n   34 root         0 IW   [kworker/3:0-slu]\n   35 root         0 IW<  [kworker/3:0H-kb]\n   36 root         0 SW   [kdevtmpfs]\n   37 root         0 IW<  [kworker/R-inet_]\n   38 root         0 IW   [rcu_tasks_kthre]\n   39 root         0 IW   [rcu_tasks_rude_]\n   40 root         0 IW   [rcu_tasks_trace]\n   41 root         0 SW   [oom_reaper]\n   42 root         0 IW   [kworker/u16:2-a]\n   43 root         0 IW<  [kworker/R-write]\n   44 root         0 SW   [kcompactd0]\n   45 root         0 IW<  [kworker/R-kbloc]\n   46 root         0 IW<  [kworker/R-blkcg]\n   47 root         0 SW   [irq/9-acpi]\n   48 root         0 IW   [kworker/1:1-mm_]\n   49 root         0 IW   [kworker/3:1-eve]\n   50 root         0 IW<  [kworker/R-ata_s]\n   51 root         0 IW<  [kworker/R-md_bi]\n   52 root         0 IW   [kworker/2:1-eve]\n   53 root         0 IW<  [kworker/1:1H-kb]\n   54 root         0 IW<  [kworker/R-rpcio]\n   55 root         0 IW<  [kworker/R-xprti]\n   56 root         0 SW   [kswapd0]\n   57 root         0 IW<  [kworker/R-nfsio]\n   58 root         0 IW<  [kworker/R-cifsi]\n   59 root         0 IW<  [kworker/R-smb3d]\n   60 root         0 IW<  [kworker/R-cifsf]\n   61 root         0 IW<  [kworker/R-cifso]\n   62 root         0 IW<  [kworker/R-defer]\n   63 root         0 IW<  [kworker/R-serve]\n   64 root         0 IW<  [kworker/R-cfid_]\n   65 root         0 IW<  [kworker/R-acpi_]\n   66 root         0 SW   [hwrng]\n   67 root         0 IW<  [kworker/R-nvme-]\n   68 root         0 IW<  [kworker/R-nvme-]\n   69 root         0 IW<  [kworker/R-nvme-]\n   70 root         0 SW   [scsi_eh_0]\n   71 root         0 IW<  [kworker/R-scsi_]\n   72 root         0 SW   [scsi_eh_1]\n   73 root         0 IW<  [kworker/R-scsi_]\n   74 root         0 SW   [scsi_eh_2]\n   75 root         0 IW<  [kworker/R-scsi_]\n   76 root         0 SW   [scsi_eh_3]\n   77 root         0 IW<  [kworker/R-scsi_]\n   78 root         0 SW   [scsi_eh_4]\n   79 root         0 IW<  [kworker/R-scsi_]\n   80 root         0 SW   [scsi_eh_5]\n   81 root         0 IW<  [kworker/R-scsi_]\n   82 root         0 IW   [kworker/u16:3-a]\n   83 root         0 IW   [kworker/u16:4-w]\n   84 root         0 IW   [kworker/u16:5-e]\n   85 root         0 IW   [kworker/u16:6-e]\n   86 root         0 IW   [kworker/u16:7-e]\n   87 root         0 IW<  [kworker/R-raid5]\n   88 root         0 IW<  [kworker/R-dm_bu]\n   89 root         0 IW<  [kworker/R-mld]\n   90 root         0 IW<  [kworker/0:1H-kb]\n   91 root         0 IW<  [kworker/R-ipv6_]\n   92 root         0 IW   [kworker/0:2]\n   93 root         0 IW   [kworker/0:3-eve]\n   94 root         0 IW<  [kworker/u17:0]\n  105 root         0 SW   [jbd2/vda-8]\n  106 root         0 IW<  [kworker/R-ext4-]\n  107 root         0 IW<  [kworker/3:1H-kb]\n  150 root     10796 S    /sbin/udevd -d\n  157 root         0 IW<  [kworker/2:1H-kb]\n  175 root         0 IW   [kworker/1:2]\n  176 root         0 IW   [kworker/2:2-eve]\n  348 messageb  4572 S    /usr/bin/dbus-daemon --system\n  351 root      2708 S    seatd -g seat -n 1\n  364 root      3424 S    /usr/sbin/dropbear -r /etc/dropbear/dropbear_rsa_hos\n  373 rpc       2856 S    /usr/sbin/rpcbind\n  381 root      6648 S    /usr/libexec/bluetooth/bluetoothd\n  396 avahi     3952 S    avahi-daemon: running [qemux86-64.local]\n  397 avahi     3768 S    avahi-daemon: chroot helper\n  401 root      8060 S    /usr/sbin/ofonod\n  411 root      4284 S    {start_getty} /bin/sh /bin/start_getty 115200 ttyS0 \n  412 root      4284 S    {start_getty} /bin/sh /bin/start_getty 115200 ttyS1 \n  413 root      4284 S    /sbin/getty 38400 tty1\n  416 root      4284 S    /sbin/getty -L 115200 ttyS0 vt102\n  417 root      4328 S    -sh\n  527 root      4284 S    /sbin/syslogd -n -O /var/log/messages\n  530 root      4284 S    /sbin/klogd -n\n  574 root      3468 S    /usr/sbin/dropbear -r /etc/dropbear/dropbear_rsa_hos\n  575 root      4332 R    ps\n\nTraceback (most recent call last):\n  File \"/srv/pokybuild/yocto-worker/oe-selftest-fedora/build/layers/openembedded-core/meta/lib/oeqa/core/decorator/__init__.py\", line 35, in wrapped_f\n    return func(*args, **kwargs)\n  File \"/srv/pokybuild/yocto-worker/oe-selftest-fedora/build/layers/openembedded-core/meta/lib/oeqa/core/decorator/__init__.py\", line 35, in wrapped_f\n    return func(*args, **kwargs)\n  File \"/srv/pokybuild/yocto-worker/oe-selftest-fedora/build/layers/openembedded-core/meta/lib/oeqa/runtime/cases/weston.py\", line 90, in test_weston_supports_xwayland\n    self.assertEqual(status, 0, msg=msg)\n    ~~~~~~~~~~~~~~~~^^^^^^^^^^^^^^^^^^^^\nAssertionError: 1 != 0 : xwayland does not appear to be running\n\nTest requires xserver-nodm-init to be installed\nTest requires kernel-devsrc to be installed\nsystemd is not the init manager for this image\nTest case systemd.SystemdBasicTests.test_systemd_failed depends on systemd.SystemdBasicTests.test_systemd_basic but it didn't pass/run.\nTest case systemd.SystemdBasicTests.test_systemd_list depends on systemd.SystemdBasicTests.test_systemd_basic but it didn't pass/run.\nTest case systemd.SystemdJournalTests.test_systemd_boot_time depends on systemd.SystemdBasicTests.test_systemd_basic but it didn't pass/run.\nTest case systemd.SystemdJournalTests.test_systemd_journal depends on systemd.SystemdBasicTests.test_systemd_basic but it didn't pass/run.\nTest requires minidebuginfo to be in DISTRO_FEATURES\nTest case systemd.SystemdServiceTests.test_systemd_status depends on systemd.SystemdBasicTests.test_systemd_basic but it didn't pass/run.\nTest case systemd.SystemdServiceTests.test_systemd_disable_enable depends on systemd.SystemdServiceTests.test_systemd_status but it didn't pass/run.\nTest is only meant to run with read-only-rootfs in IMAGE_FEATURES\nTest case systemd.SystemdServiceTests.test_systemd_stop_start depends on systemd.SystemdServiceTests.test_systemd_status but it didn't pass/run.\nTest requires wayland-utils to be installed\nTest requires weston to be installed\nTest requires weston to be installed\nTest requires weston to be installed\nTest requires xserver-nodm-init to be installed\nWARNING: core-image-weston-1.0-r0 do_testimage: Can not retrieve artifacts from test target: Error while fetching compressed artifacts\nOutput from runqemu:\nrunqemu - INFO - Received signal: 15\nrunqemu - INFO - Cleaning up\nrunqemu - INFO - Host uptime: 331103.45\n\nrunqemu - INFO - Removing /srv/pokybuild/yocto-worker/oe-selftest-fedora/build/build-st-3264468/tmp/deploy/images/qemux86-64/core-image-full-cmdline-qemux86-64.rootfs-20260623141807.ext4\nrunqemu - INFO - Removing /home/pokybuild/tmp/core-image-full-cmdline-qemux86-64.rootfs-20260623141807.ext4.1683117\ntput: No value for $TERM and no -T specified\n\nRESULTS:\nRESULTS - date.DateTest.test_date: PASSED (2.38s)\nRESULTS - df.DfTest.test_df: PASSED (0.57s)\nRESULTS - logrotate.LogrotateTest.test_logrotate_newlog: PASSED (4.13s)\nRESULTS - logrotate.LogrotateTest.test_logrotate_wtmp: PASSED (2.78s)\nRESULTS - oe_syslog.SyslogTest.test_syslog_running: PASSED (0.58s)\nRESULTS - oe_syslog.SyslogTestConfig.test_syslog_logger: PASSED (1.93s)\nRESULTS - oe_syslog.SyslogTestConfig.test_syslog_restart: PASSED (1.67s)\nRESULTS - parselogs.ParseLogsTest.test_get_context: PASSED (0.00s)\nRESULTS - parselogs.ParseLogsTest.test_parselogs: PASSED (3.25s)\nRESULTS - ping.PingTest.test_ping: PASSED (0.03s)\nRESULTS - rpm.RpmBasicTest.test_rpm_help: PASSED (0.58s)\nRESULTS - scp.ScpTest.test_scp_file: PASSED (1.54s)\nRESULTS - ssh.SSHTest.test_ssh: PASSED (0.62s)\nRESULTS - apt.AptRepoTest.test_apt_install_from_repo: SKIPPED (0.00s)\nRESULTS - buildcpio.BuildCpioTest.test_cpio: SKIPPED (0.00s)\nRESULTS - buildgalculator.GalculatorTest.test_galculator: SKIPPED (0.00s)\nRESULTS - buildlzip.BuildLzipTest.test_lzip: SKIPPED (0.00s)\nRESULTS - connman.ConnmanTest.test_connmand_help: SKIPPED (0.00s)\nRESULTS - connman.ConnmanTest.test_connmand_running: SKIPPED (0.00s)\nRESULTS - dnf.DnfBasicTest.test_dnf_help: SKIPPED (0.00s)\nRESULTS - dnf.DnfBasicTest.test_dnf_history: SKIPPED (0.00s)\nRESULTS - dnf.DnfBasicTest.test_dnf_info: SKIPPED (0.00s)\nRESULTS - dnf.DnfBasicTest.test_dnf_search: SKIPPED (0.00s)\nRESULTS - dnf.DnfBasicTest.test_dnf_version: SKIPPED (0.00s)\nRESULTS - dnf.DnfRepoTest.test_dnf_exclude: SKIPPED (0.00s)\nRESULTS - dnf.DnfRepoTest.test_dnf_install: SKIPPED (0.00s)\nRESULTS - dnf.DnfRepoTest.test_dnf_install_dependency: SKIPPED (0.00s)\nRESULTS - dnf.DnfRepoTest.test_dnf_install_from_disk: SKIPPED (0.00s)\nRESULTS - dnf.DnfRepoTest.test_dnf_install_from_http: SKIPPED (0.00s)\nRESULTS - dnf.DnfRepoTest.test_dnf_installroot: SKIPPED (0.00s)\nRESULTS - dnf.DnfRepoTest.test_dnf_installroot_usrmerge: SKIPPED (0.00s)\nRESULTS - dnf.DnfRepoTest.test_dnf_makecache: SKIPPED (0.00s)\nRESULTS - dnf.DnfRepoTest.test_dnf_reinstall: SKIPPED (0.00s)\nRESULTS - dnf.DnfRepoTest.test_dnf_repoinfo: SKIPPED (0.00s)\nRESULTS - gcc.GccCompileTest.test_gcc_compile: SKIPPED (0.00s)\nRESULTS - gcc.GccCompileTest.test_gpp2_compile: SKIPPED (0.00s)\nRESULTS - gcc.GccCompileTest.test_gpp_compile: SKIPPED (0.00s)\nRESULTS - gcc.GccCompileTest.test_make: SKIPPED (0.00s)\nRESULTS - gi.GObjectIntrospectionTest.test_python: SKIPPED (0.00s)\nRESULTS - go.CgoHelloworldTest.test_cgohelloworld: SKIPPED (0.00s)\nRESULTS - go.GoCompileTest.test_go_compile: SKIPPED (0.00s)\nRESULTS - go.GoCompileTest.test_go_module: SKIPPED (0.00s)\nRESULTS - go.GoHelloworldTest.test_gohelloworld: SKIPPED (0.00s)\nRESULTS - kernelmodule.KernelModuleTest.test_kernel_module: SKIPPED (0.00s)\nRESULTS - ldd.LddTest.test_ldd: SKIPPED (0.00s)\nRESULTS - oe_syslog.SyslogTestConfig.test_syslog_startup_config: SKIPPED (0.00s)\nRESULTS - opkg.OpkgRepoTest.test_opkg_install_from_repo: SKIPPED (0.00s)\nRESULTS - pam.PamBasicTest.test_pam: SKIPPED (0.00s)\nRESULTS - perl.PerlTest.test_perl_works: SKIPPED (0.00s)\nRESULTS - ptest.PtestRunnerTest.test_ptestrunner_expectfail: SKIPPED (0.00s)\nRESULTS - ptest.PtestRunnerTest.test_ptestrunner_expectsuccess: SKIPPED (0.00s)\nRESULTS - python.PythonTest.test_python3: SKIPPED (0.00s)\nRESULTS - rpm.RpmBasicTest.test_rpm_query: SKIPPED (0.55s)\nRESULTS - rpm.RpmBasicTest.test_rpm_query_nonroot: SKIPPED (0.00s)\nRESULTS - rpm.RpmInstallRemoveTest.test_check_rpm_install_removal_log_file_size: SKIPPED (0.00s)\nRESULTS - rpm.RpmInstallRemoveTest.test_rpm_install: SKIPPED (0.00s)\nRESULTS - rpm.RpmInstallRemoveTest.test_rpm_remove: SKIPPED (0.00s)\nRESULTS - rust.RustCLibExampleTest.test_rust_c_lib_example: SKIPPED (0.00s)\nRESULTS - rust.RustCompileTest.test_cargo_compile: SKIPPED (0.00s)\nRESULTS - rust.RustCompileTest.test_rust_compile: SKIPPED (0.00s)\nRESULTS - stap.StapTest.test_stap: SKIPPED (0.00s)\nRESULTS - systemd.SystemdBasicTests.test_systemd_basic: SKIPPED (0.00s)\nRESULTS - systemd.SystemdBasicTests.test_systemd_failed: SKIPPED (0.00s)\nRESULTS - systemd.SystemdBasicTests.test_systemd_list: SKIPPED (0.00s)\nRESULTS - systemd.SystemdJournalTests.test_systemd_boot_time: SKIPPED (0.00s)\nRESULTS - systemd.SystemdJournalTests.test_systemd_journal: SKIPPED (0.00s)\nRESULTS - systemd.SystemdServiceTests.test_systemd_coredump_minidebuginfo: SKIPPED (0.00s)\nRESULTS - systemd.SystemdServiceTests.test_systemd_disable_enable: SKIPPED (0.00s)\nRESULTS - systemd.SystemdServiceTests.test_systemd_disable_enable_ro: SKIPPED (0.00s)\nRESULTS - systemd.SystemdServiceTests.test_systemd_status: SKIPPED (0.00s)\nRESULTS - systemd.SystemdServiceTests.test_systemd_stop_start: SKIPPED (0.00s)\nRESULTS - weston.WestonTest.test_wayland_info: SKIPPED (0.00s)\nRESULTS - weston.WestonTest.test_weston_can_initialize_new_wayland_compositor: SKIPPED (0.00s)\nRESULTS - weston.WestonTest.test_weston_running: SKIPPED (0.00s)\nRESULTS - weston.WestonTest.test_weston_supports_xwayland: SKIPPED (0.00s)\nRESULTS - xorg.XorgTest.test_xorg_running: SKIPPED (0.00s)\nSUMMARY:\ncore-image-full-cmdline () - Ran 76 tests in 20.652s\ncore-image-full-cmdline - OK - All required tests passed (successes=13, skipped=63, failures=0, errors=0)\nNOTE: recipe core-image-full-cmdline-1.0-r0: task do_testimage: Succeeded\nOutput from runqemu:\nrunqemu - INFO - Received signal: 15\nrunqemu - INFO - Cleaning up\nrunqemu - INFO - Host uptime: 331106.56\n\nrunqemu - INFO - Removing /srv/pokybuild/yocto-worker/oe-selftest-fedora/build/build-st-3264468/tmp/deploy/images/qemux86-64/core-image-weston-qemux86-64.rootfs-20260623141807.ext4\nrunqemu - INFO - Removing /home/pokybuild/tmp/core-image-weston-qemux86-64.rootfs-20260623141807.ext4.1682875\ntput: No value for $TERM and no -T specified\n\nRESULTS:\nRESULTS - date.DateTest.test_date: PASSED (2.23s)\nRESULTS - df.DfTest.test_df: PASSED (0.56s)\nRESULTS - oe_syslog.SyslogTest.test_syslog_running: PASSED (0.58s)\nRESULTS - oe_syslog.SyslogTestConfig.test_syslog_logger: PASSED (1.92s)\nRESULTS - oe_syslog.SyslogTestConfig.test_syslog_restart: PASSED (4.89s)\nRESULTS - oe_syslog.SyslogTestConfig.test_syslog_startup_config: PASSED (11.21s)\nRESULTS - parselogs.ParseLogsTest.test_get_context: PASSED (0.00s)\nRESULTS - parselogs.ParseLogsTest.test_parselogs: PASSED (2.55s)\nRESULTS - ping.PingTest.test_ping: PASSED (0.02s)\nRESULTS - rpm.RpmBasicTest.test_rpm_help: PASSED (0.58s)\nRESULTS - scp.ScpTest.test_scp_file: PASSED (1.13s)\nRESULTS - ssh.SSHTest.test_ssh: PASSED (0.57s)\nRESULTS - apt.AptRepoTest.test_apt_install_from_repo: SKIPPED (0.00s)\nRESULTS - buildcpio.BuildCpioTest.test_cpio: SKIPPED (0.00s)\nRESULTS - buildgalculator.GalculatorTest.test_galculator: SKIPPED (0.00s)\nRESULTS - buildlzip.BuildLzipTest.test_lzip: SKIPPED (0.00s)\nRESULTS - connman.ConnmanTest.test_connmand_help: SKIPPED (0.00s)\nRESULTS - connman.ConnmanTest.test_connmand_running: SKIPPED (0.00s)\nRESULTS - dnf.DnfBasicTest.test_dnf_help: SKIPPED (0.00s)\nRESULTS - dnf.DnfBasicTest.test_dnf_history: SKIPPED (0.00s)\nRESULTS - dnf.DnfBasicTest.test_dnf_info: SKIPPED (0.00s)\nRESULTS - dnf.DnfBasicTest.test_dnf_search: SKIPPED (0.00s)\nRESULTS - dnf.DnfBasicTest.test_dnf_version: SKIPPED (0.00s)\nRESULTS - dnf.DnfRepoTest.test_dnf_exclude: SKIPPED (0.00s)\nRESULTS - dnf.DnfRepoTest.test_dnf_install: SKIPPED (0.00s)\nRESULTS - dnf.DnfRepoTest.test_dnf_install_dependency: SKIPPED (0.00s)\nRESULTS - dnf.DnfRepoTest.test_dnf_install_from_disk: SKIPPED (0.00s)\nRESULTS - dnf.DnfRepoTest.test_dnf_install_from_http: SKIPPED (0.00s)\nRESULTS - dnf.DnfRepoTest.test_dnf_installroot: SKIPPED (0.00s)\nRESULTS - dnf.DnfRepoTest.test_dnf_installroot_usrmerge: SKIPPED (0.00s)\nRESULTS - dnf.DnfRepoTest.test_dnf_makecache: SKIPPED (0.00s)\nRESULTS - dnf.DnfRepoTest.test_dnf_reinstall: SKIPPED (0.00s)\nRESULTS - dnf.DnfRepoTest.test_dnf_repoinfo: SKIPPED (0.00s)\nRESULTS - gcc.GccCompileTest.test_gcc_compile: SKIPPED (0.00s)\nRESULTS - gcc.GccCompileTest.test_gpp2_compile: SKIPPED (0.00s)\nRESULTS - gcc.GccCompileTest.test_gpp_compile: SKIPPED (0.00s)\nRESULTS - gcc.GccCompileTest.test_make: SKIPPED (0.00s)\nRESULTS - gi.GObjectIntrospectionTest.test_python: SKIPPED (0.00s)\nRESULTS - go.CgoHelloworldTest.test_cgohelloworld: SKIPPED (0.00s)\nRESULTS - go.GoCompileTest.test_go_compile: SKIPPED (0.00s)\nRESULTS - go.GoCompileTest.test_go_module: SKIPPED (0.00s)\nRESULTS - go.GoHelloworldTest.test_gohelloworld: SKIPPED (0.00s)\nRESULTS - kernelmodule.KernelModuleTest.test_kernel_module: SKIPPED (0.00s)\nRESULTS - ldd.LddTest.test_ldd: SKIPPED (0.00s)\nRESULTS - logrotate.LogrotateTest.test_logrotate_newlog: SKIPPED (0.00s)\nRESULTS - logrotate.LogrotateTest.test_logrotate_wtmp: SKIPPED (0.00s)\nRESULTS - opkg.OpkgRepoTest.test_opkg_install_from_repo: SKIPPED (0.00s)\nRESULTS - pam.PamBasicTest.test_pam: SKIPPED (0.00s)\nRESULTS - perl.PerlTest.test_perl_works: SKIPPED (0.00s)\nRESULTS - ptest.PtestRunnerTest.test_ptestrunner_expectfail: SKIPPED (0.00s)\nRESULTS - ptest.PtestRunnerTest.test_ptestrunner_expectsuccess: SKIPPED (0.00s)\nRESULTS - python.PythonTest.test_python3: SKIPPED (0.00s)\nRESULTS - rpm.RpmBasicTest.test_rpm_query: SKIPPED (0.55s)\nRESULTS - rpm.RpmBasicTest.test_rpm_query_nonroot: SKIPPED (0.00s)\nRESULTS - rpm.RpmInstallRemoveTest.test_check_rpm_install_removal_log_file_size: SKIPPED (0.00s)\nRESULTS - rpm.RpmInstallRemoveTest.test_rpm_install: SKIPPED (0.00s)\nRESULTS - rpm.RpmInstallRemoveTest.test_rpm_remove: SKIPPED (0.00s)\nRESULTS - rust.RustCLibExampleTest.test_rust_c_lib_example: SKIPPED (0.00s)\nRESULTS - rust.RustCompileTest.test_cargo_compile: SKIPPED (0.00s)\nRESULTS - rust.RustCompileTest.test_rust_compile: SKIPPED (0.00s)\nRESULTS - stap.StapTest.test_stap: SKIPPED (0.00s)\nRESULTS - systemd.SystemdBasicTests.test_systemd_basic: SKIPPED (0.00s)\nRESULTS - systemd.SystemdBasicTests.test_systemd_failed: SKIPPED (0.00s)\nRESULTS - systemd.SystemdBasicTests.test_systemd_list: SKIPPED (0.00s)\nRESULTS - systemd.SystemdJournalTests.test_systemd_boot_time: SKIPPED (0.00s)\nRESULTS - systemd.SystemdJournalTests.test_systemd_journal: SKIPPED (0.00s)\nRESULTS - systemd.SystemdServiceTests.test_systemd_coredump_minidebuginfo: SKIPPED (0.00s)\nRESULTS - systemd.SystemdServiceTests.test_systemd_disable_enable: SKIPPED (0.00s)\nRESULTS - systemd.SystemdServiceTests.test_systemd_disable_enable_ro: SKIPPED (0.00s)\nRESULTS - systemd.SystemdServiceTests.test_systemd_status: SKIPPED (0.00s)\nRESULTS - systemd.SystemdServiceTests.test_systemd_stop_start: SKIPPED (0.00s)\nRESULTS - xorg.XorgTest.test_xorg_running: SKIPPED (0.00s)\nRESULTS - weston.WestonTest.test_wayland_info: FAILED (0.57s)\nRESULTS - weston.WestonTest.test_weston_can_initialize_new_wayland_compositor: FAILED (0.37s)\nRESULTS - weston.WestonTest.test_weston_running: FAILED (0.89s)\nRESULTS - weston.WestonTest.test_weston_supports_xwayland: FAILED (0.91s)\nSUMMARY:\ncore-image-weston () - Ran 76 tests in 29.596s\ncore-image-weston - FAIL - Required tests failed (successes=12, skipped=60, failures=4, errors=0)\ncore-image-weston - FAILED - Last lines of QEMU boot log:\n * Starting Avahi mDNS/DNS-SD Daemon: avahi-daemon\n\n   ...done.\n\nStarting Telephony daemon\n\n[    3.103894] Bluetooth: BNEP (Ethernet Emulation) ver 1.3\n[    3.105762] Bluetooth: BNEP filters: protocol multicast\n[    3.107489] Bluetooth: BNEP socket layer initialized\n\n\nPoky (Yocto Project Reference Distro) 6.0.99+snapshot-10ace5cb9e4b9b323c3f713d3b15b6554681af2f qemux86-64 /dev/ttyS0\n\n\n\nType 'root' to login with superuser privileges (no password will be asked).\n\n\n\nqemux86-64 login: \nERROR: core-image-weston-1.0-r0 do_testimage: core-image-weston - FAILED - also check the logs in /srv/pokybuild/yocto-worker/oe-selftest-fedora/build/build-st-3264468/tmp/log\nNOTE: recipe core-image-weston-1.0-r0: task do_testimage: Succeeded\nNOTE: Tasks Summary: Attempted 1519 tasks of which 1517 didn't need to be rerun and all succeeded.\n\nSummary: There was 1 WARNING message.\nSummary: There was 1 ERROR message, returning a non-zero exit code.\n\n\nStderr:\n2026-06-23 12:49:08,631 - oe-selftest - INFO - Adding: \"include selftest.inc\" in /srv/pokybuild/yocto-worker/oe-selftest-fedora/build/build-st-3264468/conf/local.conf\n2026-06-23 12:49:08,632 - oe-selftest - INFO - Adding: \"include bblayers.inc\" in bblayers.conf\n/usr/lib64/python3.13/unittest/case.py:597: RuntimeWarning: TestResult has no addDuration method\n  warnings.warn(\"TestResult has no addDuration method\",\n\n",
    "status": "FAILED"
   },
   "incompatible_lic.NoGPL3InImagesTests.test_core_image_minimal": {
    "duration": 65.31621313095093,
    "status": "PASSED"
   },
   "install.InstallTests.test_gstreamer_plugins": {
    "duration": 4622.411039590836,
    "status": "PASSED"
   },
   "install.InstallTests.test_linux_firmware": {
    "duration": 151.01990842819214,
    "status": "PASSED"
   },
   "install.InstallTests.test_linux_modules": {
    "duration": 79.3944034576416,
    "status": "PASSED"
   },
   "install.InstallTests.test_perl": {
    "duration": 74.38175630569458,
    "status": "PASSED"
   },
   "install.InstallTests.test_python": {
    "duration": 67.88124561309814,
    "status": "PASSED"
   },
   "intercept.GitCheck.test_git_intercept": {
    "duration": 18.80792737007141,
    "status": "PASSED"
   },
   "kerneldevelopment.KernelDev.test_apply_patches": {
    "duration": 179.58013653755188,
    "status": "PASSED"
   },
   "kernelmodulesplit.KernelModuleSplit.test_cross_recipe_module_dependency": {
    "duration": 12.085627317428589,
    "status": "PASSED"
   },
   "layerappend.LayerAppendTests.test_layer_appends": {
    "duration": 57.45988368988037,
    "status": "PASSED"
   },
   "liboe.CopyTreeTests.test_copy_hardlink_tree_count": {
    "duration": 0.03954768180847168,
    "status": "PASSED"
   },
   "liboe.CopyTreeTests.test_copy_tree_special": {
    "duration": 0.0261685848236084,
    "status": "PASSED"
   },
   "liboe.CopyTreeTests.test_copy_tree_xattr": {
    "duration": 43.68676424026489,
    "status": "PASSED"
   },
   "liboe.SubprocessTests.test_subprocess_tweak": {
    "duration": 0.015757083892822266,
    "status": "PASSED"
   },
   "lic_checksum.LicenseTests.test_checksum_with_space": {
    "duration": 21.336288928985596,
    "status": "PASSED"
   },
   "lic_checksum.LicenseTests.test_nonmatching_checksum": {
    "duration": 22.471386671066284,
    "status": "PASSED"
   },
   "locales.LocalesTest.test_locales_off": {
    "duration": 83.05027866363525,
    "status": "PASSED"
   },
   "locales.LocalesTest.test_locales_on": {
    "duration": 142.6988444328308,
    "status": "PASSED"
   },
   "manifest.VerifyManifest.test_SDK_manifest_entries": {
    "duration": 432.1526908874512,
    "status": "PASSED"
   },
   "manifest.VerifyManifest.test_image_manifest_entries": {
    "duration": 13.328928470611572,
    "status": "PASSED"
   },
   "minidebuginfo.Minidebuginfo.test_minidebuginfo": {
    "duration": 1401.783775806427,
    "status": "PASSED"
   },
   "minidebuginfo.Minidebuginfo.test_minidebuginfo_qemu": {
    "duration": 905.6133270263672,
    "oetags": [
     "runqemu"
    ],
    "status": "PASSED"
   },
   "multiconfig.MultiConfig.test_multiconfig": {
    "duration": 379.73400139808655,
    "status": "PASSED"
   },
   "multiconfig.MultiConfig.test_multiconfig_inlayer": {
    "duration": 57.27847862243652,
    "status": "PASSED"
   },
   "multiconfig.MultiConfig.test_multiconfig_reparse": {
    "duration": 97.74193692207336,
    "status": "PASSED"
   },
   "newlib.NewlibTest.test_newlib": {
    "duration": 229.83478951454163,
    "status": "PASSED"
   },
   "oelib.buildhistory.TestBlobParsing.test_blob_to_dict": {
    "duration": 1.1483454704284668,
    "status": "PASSED"
   },
   "oelib.buildhistory.TestBlobParsing.test_compare_dict_blobs": {
    "duration": 0.7982823848724365,
    "status": "PASSED"
   },
   "oelib.buildhistory.TestBlobParsing.test_compare_dict_blobs_default": {
    "duration": 1.0737481117248535,
    "status": "PASSED"
   },
   "oelib.buildhistory.TestFileListCompare.test_compare_file_lists": {
    "duration": 0.23435688018798828,
    "status": "PASSED"
   },
   "oelib.elf.TestElf.test_machine_name": {
    "duration": 0.0027937889099121094,
    "status": "PASSED"
   },
   "oelib.license.TestComplexCombinations.test_tests": {
    "duration": 0.0008358955383300781,
    "status": "PASSED"
   },
   "oelib.license.TestIsIncluded.test_tests": {
    "duration": 0.003608226776123047,
    "status": "PASSED"
   },
   "oelib.license.TestSimpleCombinations.test_tests": {
    "duration": 0.0037920475006103516,
    "status": "PASSED"
   },
   "oelib.license.TestSingleLicense.test_invalid_licenses": {
    "duration": 0.0012276172637939453,
    "status": "PASSED"
   },
   "oelib.license.TestSingleLicense.test_single_licenses": {
    "duration": 0.0015947818756103516,
    "status": "PASSED"
   },
   "oelib.package.TestCopyDebugSources.test_copydebugsources_copies_files_and_dereferences_links": {
    "duration": 0.011562824249267578,
    "status": "PASSED"
   },
   "oelib.package.TestCopyDebugSources.test_copydebugsources_ignores_copy_failure": {
    "duration": 0.008019447326660156,
    "status": "PASSED"
   },
   "oelib.package.TestCopyDebugSources.test_copydebugsources_ignores_empty_externalsrc_relocation": {
    "duration": 0.0070612430572509766,
    "status": "PASSED"
   },
   "oelib.package.TestCopyDebugSources.test_copydebugsources_moves_externalsrc_relocation": {
    "duration": 0.011289358139038086,
    "status": "PASSED"
   },
   "oelib.path.TestRealPath.test_loop": {
    "duration": 0.0027298927307128906,
    "status": "PASSED"
   },
   "oelib.path.TestRealPath.test_norm": {
    "duration": 0.0024878978729248047,
    "status": "PASSED"
   },
   "oelib.path.TestRealPath.test_phys": {
    "duration": 0.0013954639434814453,
    "status": "PASSED"
   },
   "oelib.types.TestBooleanType.test_bool_equality": {
    "duration": 0.001791238784790039,
    "status": "PASSED"
   },
   "oelib.types.TestBooleanType.test_false": {
    "duration": 0.0018455982208251953,
    "status": "PASSED"
   },
   "oelib.types.TestBooleanType.test_invalid": {
    "duration": 0.0019791126251220703,
    "status": "PASSED"
   },
   "oelib.types.TestBooleanType.test_true": {
    "duration": 0.0051195621490478516,
    "status": "PASSED"
   },
   "oelib.types.TestList.test_list_nosep": {
    "duration": 0.010461807250976562,
    "status": "PASSED"
   },
   "oelib.types.TestList.test_list_usersep": {
    "duration": 0.010495901107788086,
    "status": "PASSED"
   },
   "oelib.utils.TestDefaultFeatures.test_filter_default_features": {
    "duration": 0.0013382434844970703,
    "status": "PASSED"
   },
   "oelib.utils.TestMultiprocessLaunch.test_multiprocesslaunch": {
    "duration": 0.02055644989013672,
    "status": "PASSED"
   },
   "oelib.utils.TestPackagesFilterOutSystem.test_filter": {
    "duration": 0.002111196517944336,
    "status": "PASSED"
   },
   "oelib.utils.TestTrimVersion.test_num_exception": {
    "duration": 0.00092315673828125,
    "status": "PASSED"
   },
   "oelib.utils.TestTrimVersion.test_valid": {
    "duration": 0.0010559558868408203,
    "status": "PASSED"
   },
   "oelib.utils.TestTrimVersion.test_version_exception": {
    "duration": 0.0012717247009277344,
    "status": "PASSED"
   },
   "oescripts.OEGitproxyTests.test_oegitproxy_help": {
    "duration": 0.09503960609436035,
    "status": "PASSED"
   },
   "oescripts.OEGitproxyTests.test_oegitproxy_proxy": {
    "duration": 0.24658608436584473,
    "status": "PASSED"
   },
   "oescripts.OEGitproxyTests.test_oegitproxy_proxy_dash": {
    "duration": 0.007258176803588867,
    "log": "No \"dash\" found on test system.\n",
    "status": "SKIPPED"
   },
   "oescripts.OEListPackageconfigTests.test_packageconfig_flags_default": {
    "duration": 284.85493636131287,
    "status": "PASSED"
   },
   "oescripts.OEListPackageconfigTests.test_packageconfig_flags_help": {
    "duration": 0.37336111068725586,
    "status": "PASSED"
   },
   "oescripts.OEListPackageconfigTests.test_packageconfig_flags_option_all": {
    "duration": 296.7690465450287,
    "status": "PASSED"
   },
   "oescripts.OEListPackageconfigTests.test_packageconfig_flags_option_flags": {
    "duration": 306.13002347946167,
    "status": "PASSED"
   },
   "oescripts.OEListPackageconfigTests.test_packageconfig_flags_options_preferred_only": {
    "duration": 303.1114192008972,
    "status": "PASSED"
   },
   "oescripts.OEPybootchartguyTests.test_pybootchartguy_help": {
    "duration": 0.570974588394165,
    "status": "PASSED"
   },
   "oescripts.OEPybootchartguyTests.test_pybootchartguy_to_generate_build_pdf_output": {
    "duration": 0.5001397132873535,
    "status": "PASSED"
   },
   "oescripts.OEPybootchartguyTests.test_pybootchartguy_to_generate_build_png_output": {
    "duration": 0.5444614887237549,
    "status": "PASSED"
   },
   "oescripts.OEPybootchartguyTests.test_pybootchartguy_to_generate_build_svg_output": {
    "duration": 0.29032349586486816,
    "status": "PASSED"
   },
   "oescripts.OeRunNativeTest.test_oe_run_native": {
    "duration": 18.67668080329895,
    "status": "PASSED"
   },
   "overlayfs.OverlayFSEtcRunTimeTests.test_all_required_variables_set": {
    "duration": 875.3581006526947,
    "oetags": [
     "runqemu"
    ],
    "status": "PASSED"
   },
   "overlayfs.OverlayFSEtcRunTimeTests.test_image_feature_conflict": {
    "duration": 3.9420225620269775,
    "oetags": [
     "runqemu"
    ],
    "status": "PASSED"
   },
   "overlayfs.OverlayFSEtcRunTimeTests.test_image_feature_is_missing": {
    "duration": 105.79083108901978,
    "oetags": [
     "runqemu"
    ],
    "status": "PASSED"
   },
   "overlayfs.OverlayFSEtcRunTimeTests.test_lower_layer_access": {
    "duration": 227.50069975852966,
    "oetags": [
     "runqemu"
    ],
    "status": "PASSED"
   },
   "overlayfs.OverlayFSEtcRunTimeTests.test_postinst_on_target_for_read_only_rootfs": {
    "duration": 137.23917937278748,
    "oetags": [
     "runqemu"
    ],
    "status": "PASSED"
   },
   "overlayfs.OverlayFSEtcRunTimeTests.test_sbin_init_original": {
    "duration": 162.54417824745178,
    "oetags": [
     "runqemu"
    ],
    "status": "PASSED"
   },
   "overlayfs.OverlayFSEtcRunTimeTests.test_sbin_init_preinit": {
    "duration": 146.85124731063843,
    "oetags": [
     "runqemu"
    ],
    "status": "PASSED"
   },
   "overlayfs.OverlayFSEtcRunTimeTests.test_sbin_init_read_only": {
    "duration": 122.8455421924591,
    "oetags": [
     "runqemu"
    ],
    "status": "PASSED"
   },
   "overlayfs.OverlayFSTests.test_correct_image_fstab": {
    "duration": 568.4999299049377,
    "oetags": [
     "runqemu"
    ],
    "status": "PASSED"
   },
   "overlayfs.OverlayFSTests.test_correct_image_unit": {
    "duration": 85.11731672286987,
    "oetags": [
     "runqemu"
    ],
    "status": "PASSED"
   },
   "overlayfs.OverlayFSTests.test_distro_features_missing": {
    "duration": 21.488251447677612,
    "status": "PASSED"
   },
   "overlayfs.OverlayFSTests.test_mount_unit_not_set": {
    "duration": 15.187653541564941,
    "status": "PASSED"
   },
   "overlayfs.OverlayFSTests.test_not_all_units_installed": {
    "duration": 74.42614912986755,
    "status": "PASSED"
   },
   "overlayfs.OverlayFSTests.test_not_all_units_installed_but_qa_skipped": {
    "duration": 86.7463595867157,
    "status": "PASSED"
   },
   "overlayfs.OverlayFSTests.test_wrong_mount_unit_set": {
    "duration": 17.380123376846313,
    "status": "PASSED"
   },
   "package.PackageTests.test_gdb_hardlink_debug": {
    "duration": 86.22201085090637,
    "status": "PASSED"
   },
   "package.PackageTests.test_package_name_conflict": {
    "duration": 15.66908860206604,
    "status": "PASSED"
   },
   "package.PackageTests.test_preserve_ownership": {
    "duration": 78.04002285003662,
    "status": "PASSED"
   },
   "package.PackageTests.test_preserve_sparse_hardlinks": {
    "duration": 48.5360791683197,
    "status": "PASSED"
   },
   "package.VersionOrdering.test_dpkg": {
    "duration": 0.05645608901977539,
    "status": "PASSED"
   },
   "package.VersionOrdering.test_opkg": {
    "duration": 0.06234288215637207,
    "status": "PASSED"
   },
   "package.VersionOrdering.test_rpm": {
    "duration": 0.3785586357116699,
    "status": "PASSED"
   },
   "picolibc.PicolibcTest.test_picolibc": {
    "duration": 0.9192721843719482,
    "log": "This test only works with machines : qemuarm qemuarm64 qemuriscv32 qemuriscv64\n",
    "status": "SKIPPED"
   },
   "pkgdata.OePkgdataUtilTests.test_find_path": {
    "duration": 4.3724517822265625,
    "status": "PASSED"
   },
   "pkgdata.OePkgdataUtilTests.test_glob": {
    "duration": 2.5448269844055176,
    "status": "PASSED"
   },
   "pkgdata.OePkgdataUtilTests.test_list_pkg_files": {
    "duration": 7.844663381576538,
    "status": "PASSED"
   },
   "pkgdata.OePkgdataUtilTests.test_list_pkgs": {
    "duration": 8.34556794166565,
    "status": "PASSED"
   },
   "pkgdata.OePkgdataUtilTests.test_lookup_pkg": {
    "duration": 5.967423439025879,
    "status": "PASSED"
   },
   "pkgdata.OePkgdataUtilTests.test_lookup_recipe": {
    "duration": 2.9331116676330566,
    "status": "PASSED"
   },
   "pkgdata.OePkgdataUtilTests.test_multilib_variables": {
    "duration": 2044.1577293872833,
    "status": "PASSED"
   },
   "pkgdata.OePkgdataUtilTests.test_no_param": {
    "duration": 0.07786989212036133,
    "status": "PASSED"
   },
   "pkgdata.OePkgdataUtilTests.test_read_value": {
    "duration": 3.1496236324310303,
    "status": "PASSED"
   },
   "pkgdata.OePkgdataUtilTests.test_specify_pkgdatadir": {
    "duration": 0.8812589645385742,
    "status": "PASSED"
   },
   "pokybleeding.PokyBleeding.test_poky_bleeding_autorev": {
    "duration": 86.08938097953796,
    "status": "PASSED"
   },
   "prservice.BitbakePrTests.test_import_export_override_db": {
    "duration": 1094.9020056724548,
    "status": "PASSED"
   },
   "prservice.BitbakePrTests.test_import_export_replace_db": {
    "duration": 105.47398543357849,
    "status": "PASSED"
   },
   "prservice.BitbakePrTests.test_pr_service_deb_arch_dep": {
    "duration": 76.73235011100769,
    "status": "PASSED"
   },
   "prservice.BitbakePrTests.test_pr_service_deb_arch_indep": {
    "duration": 39.45913338661194,
    "status": "PASSED"
   },
   "prservice.BitbakePrTests.test_pr_service_ipk_arch_dep": {
    "duration": 79.11097955703735,
    "status": "PASSED"
   },
   "prservice.BitbakePrTests.test_pr_service_ipk_arch_indep": {
    "duration": 34.530024766922,
    "status": "PASSED"
   },
   "prservice.BitbakePrTests.test_pr_service_rpm_arch_dep": {
    "duration": 55.96747660636902,
    "status": "PASSED"
   },
   "prservice.BitbakePrTests.test_pr_service_rpm_arch_indep": {
    "duration": 30.71467638015747,
    "status": "PASSED"
   },
   "prservice.BitbakePrTests.test_stopping_prservice_message": {
    "duration": 0.8138351440429688,
    "status": "PASSED"
   },
   "pseudo.Pseudo.test_pseudo_pyc_creation": {
    "duration": 11.252497673034668,
    "status": "PASSED"
   },
   "recipetool.RecipetoolAppendTests.test_recipetool_appendfile_add": {
    "duration": 50.401167154312134,
    "status": "PASSED"
   },
   "recipetool.RecipetoolAppendTests.test_recipetool_appendfile_add_bindir": {
    "duration": 24.290210485458374,
    "status": "PASSED"
   },
   "recipetool.RecipetoolAppendTests.test_recipetool_appendfile_add_machine": {
    "duration": 23.869377374649048,
    "status": "PASSED"
   },
   "recipetool.RecipetoolAppendTests.test_recipetool_appendfile_alternatives": {
    "duration": 28.158635139465332,
    "status": "PASSED"
   },
   "recipetool.RecipetoolAppendTests.test_recipetool_appendfile_basic": {
    "duration": 24.083563089370728,
    "status": "PASSED"
   },
   "recipetool.RecipetoolAppendTests.test_recipetool_appendfile_binary": {
    "duration": 15.776877403259277,
    "status": "PASSED"
   },
   "recipetool.RecipetoolAppendTests.test_recipetool_appendfile_extlayer": {
    "duration": 5.615713596343994,
    "status": "PASSED"
   },
   "recipetool.RecipetoolAppendTests.test_recipetool_appendfile_inst_func": {
    "duration": 23.382784605026245,
    "status": "PASSED"
   },
   "recipetool.RecipetoolAppendTests.test_recipetool_appendfile_inst_glob": {
    "duration": 23.32895255088806,
    "status": "PASSED"
   },
   "recipetool.RecipetoolAppendTests.test_recipetool_appendfile_inst_todir_glob": {
    "duration": 24.435142755508423,
    "status": "PASSED"
   },
   "recipetool.RecipetoolAppendTests.test_recipetool_appendfile_invalid": {
    "duration": 25.033204078674316,
    "status": "PASSED"
   },
   "recipetool.RecipetoolAppendTests.test_recipetool_appendfile_orig": {
    "duration": 24.220770597457886,
    "status": "PASSED"
   },
   "recipetool.RecipetoolAppendTests.test_recipetool_appendfile_patch": {
    "duration": 24.275314569473267,
    "status": "PASSED"
   },
   "recipetool.RecipetoolAppendTests.test_recipetool_appendfile_postinstall": {
    "duration": 27.814189672470093,
    "status": "PASSED"
   },
   "recipetool.RecipetoolAppendTests.test_recipetool_appendfile_renamed": {
    "duration": 23.808525562286377,
    "status": "PASSED"
   },
   "recipetool.RecipetoolAppendTests.test_recipetool_appendfile_script": {
    "duration": 22.78087568283081,
    "status": "PASSED"
   },
   "recipetool.RecipetoolAppendTests.test_recipetool_appendfile_subdir": {
    "duration": 23.169745206832886,
    "status": "PASSED"
   },
   "recipetool.RecipetoolAppendTests.test_recipetool_appendfile_todir": {
    "duration": 22.517727613449097,
    "status": "PASSED"
   },
   "recipetool.RecipetoolAppendTests.test_recipetool_appendfile_wildcard": {
    "duration": 11.707984447479248,
    "status": "PASSED"
   },
   "recipetool.RecipetoolAppendsrcTests.test_recipetool_appendsrcfile_basic": {
    "duration": 63.18961572647095,
    "status": "PASSED"
   },
   "recipetool.RecipetoolAppendsrcTests.test_recipetool_appendsrcfile_basic_wildcard": {
    "duration": 46.983771562576294,
    "status": "PASSED"
   },
   "recipetool.RecipetoolAppendsrcTests.test_recipetool_appendsrcfile_existing_in_src_uri": {
    "duration": 22.588032960891724,
    "status": "PASSED"
   },
   "recipetool.RecipetoolAppendsrcTests.test_recipetool_appendsrcfile_existing_in_src_uri_diff_params": {
    "duration": 22.783095836639404,
    "status": "PASSED"
   },
   "recipetool.RecipetoolAppendsrcTests.test_recipetool_appendsrcfile_machine": {
    "duration": 62.34832787513733,
    "status": "PASSED"
   },
   "recipetool.RecipetoolAppendsrcTests.test_recipetool_appendsrcfile_replace_file_srcdir": {
    "duration": 35.281949043273926,
    "status": "PASSED"
   },
   "recipetool.RecipetoolAppendsrcTests.test_recipetool_appendsrcfile_srcdir_basic": {
    "duration": 23.566118240356445,
    "status": "PASSED"
   },
   "recipetool.RecipetoolAppendsrcTests.test_recipetool_appendsrcfile_subdir_basic": {
    "duration": 37.17157196998596,
    "status": "PASSED"
   },
   "recipetool.RecipetoolAppendsrcTests.test_recipetool_appendsrcfile_subdir_basic_dirdest": {
    "duration": 38.005303621292114,
    "status": "PASSED"
   },
   "recipetool.RecipetoolAppendsrcTests.test_recipetool_appendsrcfile_update_recipe_basic": {
    "duration": 12.00100040435791,
    "status": "PASSED"
   },
   "recipetool.RecipetoolAppendsrcTests.test_recipetool_appendsrcfiles_basic": {
    "duration": 47.434995889663696,
    "status": "PASSED"
   },
   "recipetool.RecipetoolAppendsrcTests.test_recipetool_appendsrcfiles_basic_subdir": {
    "duration": 46.21381711959839,
    "status": "PASSED"
   },
   "recipetool.RecipetoolCreateTests.test_recipetool_create": {
    "duration": 40.73077201843262,
    "status": "PASSED"
   },
   "recipetool.RecipetoolCreateTests.test_recipetool_create_autotools": {
    "duration": 88.34554123878479,
    "status": "PASSED"
   },
   "recipetool.RecipetoolCreateTests.test_recipetool_create_cmake": {
    "duration": 38.03177285194397,
    "status": "PASSED"
   },
   "recipetool.RecipetoolCreateTests.test_recipetool_create_git_http": {
    "duration": 39.75855326652527,
    "status": "PASSED"
   },
   "recipetool.RecipetoolCreateTests.test_recipetool_create_git_srcbranch": {
    "duration": 39.49721622467041,
    "status": "PASSED"
   },
   "recipetool.RecipetoolCreateTests.test_recipetool_create_git_srcuri_branch": {
    "duration": 39.929068088531494,
    "status": "PASSED"
   },
   "recipetool.RecipetoolCreateTests.test_recipetool_create_git_srcuri_master": {
    "duration": 40.211098194122314,
    "status": "PASSED"
   },
   "recipetool.RecipetoolCreateTests.test_recipetool_create_github": {
    "duration": 43.23846387863159,
    "status": "PASSED"
   },
   "recipetool.RecipetoolCreateTests.test_recipetool_create_github_tarball": {
    "duration": 39.13604187965393,
    "status": "PASSED"
   },
   "recipetool.RecipetoolCreateTests.test_recipetool_create_go": {
    "duration": 61.59632158279419,
    "status": "PASSED"
   },
   "recipetool.RecipetoolCreateTests.test_recipetool_create_npm": {
    "duration": 1.6248226165771484,
    "log": "Test needs meta-oe for nodejs\n",
    "status": "SKIPPED"
   },
   "recipetool.RecipetoolCreateTests.test_recipetool_create_python3_pep517_flit_core_buildapi": {
    "duration": 38.574859619140625,
    "status": "PASSED"
   },
   "recipetool.RecipetoolCreateTests.test_recipetool_create_python3_pep517_hatchling": {
    "duration": 41.0510950088501,
    "status": "PASSED"
   },
   "recipetool.RecipetoolCreateTests.test_recipetool_create_python3_pep517_maturin": {
    "duration": 39.80919623374939,
    "status": "PASSED"
   },
   "recipetool.RecipetoolCreateTests.test_recipetool_create_python3_pep517_mesonpy": {
    "duration": 38.986000061035156,
    "status": "PASSED"
   },
   "recipetool.RecipetoolCreateTests.test_recipetool_create_python3_pep517_poetry_core_masonry_api": {
    "duration": 40.01251220703125,
    "status": "PASSED"
   },
   "recipetool.RecipetoolCreateTests.test_recipetool_create_python3_pep517_setuptools_build_meta": {
    "duration": 40.9490807056427,
    "status": "PASSED"
   },
   "recipetool.RecipetoolCreateTests.test_recipetool_create_python3_pep517_setuptools_build_meta_license_pep639": {
    "duration": 38.76939392089844,
    "status": "PASSED"
   },
   "recipetool.RecipetoolCreateTests.test_recipetool_create_python3_pep517_setuptools_build_meta_license_prepep639": {
    "duration": 38.9688196182251,
    "status": "PASSED"
   },
   "recipetool.RecipetoolCreateTests.test_recipetool_create_python3_setuptools": {
    "duration": 38.93860340118408,
    "status": "PASSED"
   },
   "recipetool.RecipetoolCreateTests.test_recipetool_create_python3_setuptools_pypi": {
    "duration": 73.48237490653992,
    "status": "PASSED"
   },
   "recipetool.RecipetoolCreateTests.test_recipetool_create_python3_setuptools_pypi_tarball": {
    "duration": 39.937845945358276,
    "status": "PASSED"
   },
   "recipetool.RecipetoolCreateTests.test_recipetool_create_simple": {
    "duration": 37.927488803863525,
    "status": "PASSED"
   },
   "recipetool.RecipetoolTests.test_recipetool_handle_license_vars": {
    "duration": 2.5821566581726074,
    "status": "PASSED"
   },
   "recipetool.RecipetoolTests.test_recipetool_load_plugin": {
    "duration": 9.750297546386719,
    "status": "PASSED"
   },
   "recipetool.RecipetoolTests.test_recipetool_split_pkg_licenses": {
    "duration": 0.026782751083374023,
    "status": "PASSED"
   },
   "recipeutils.RecipeUtilsTests.test_patch_recipe_appends": {
    "duration": 0.14878487586975098,
    "status": "PASSED"
   },
   "recipeutils.RecipeUtilsTests.test_patch_recipe_singleappend": {
    "duration": 0.10222005844116211,
    "status": "PASSED"
   },
   "recipeutils.RecipeUtilsTests.test_patch_recipe_varflag": {
    "duration": 0.08454489707946777,
    "status": "PASSED"
   },
   "recipeutils.RecipeUtilsTests.test_split_var_value": {
    "duration": 0.006908416748046875,
    "status": "PASSED"
   },
   "recipeutils.RecipeUtilsTests.test_validate_pn": {
    "duration": 0.006677865982055664,
    "status": "PASSED"
   },
   "reproducible.DiffoscopeTests.test_diffoscope": {
    "log": "Skip by the command line argument \"reproducible\"\n",
    "status": "SKIPPED"
   },
   "reproducible.ReproducibleTests.test_reproducible_builds": {
    "log": "Skip by the command line argument \"reproducible\"\n",
    "status": "SKIPPED"
   },
   "resulttooltests.ResultToolTests.test_can_compare_ltp_tests": {
    "duration": 0.009112834930419922,
    "status": "PASSED"
   },
   "resulttooltests.ResultToolTests.test_can_match_non_static_ptest_names": {
    "duration": 0.005995988845825195,
    "status": "PASSED"
   },
   "resulttooltests.ResultToolTests.test_can_not_compare_non_ltp_tests": {
    "duration": 0.005776166915893555,
    "status": "PASSED"
   },
   "resulttooltests.ResultToolTests.test_junit_empty_testresults": {
    "duration": 0.006048679351806641,
    "status": "PASSED"
   },
   "resulttooltests.ResultToolTests.test_junit_log_attached": {
    "duration": 0.005040884017944336,
    "status": "PASSED"
   },
   "resulttooltests.ResultToolTests.test_junit_log_inline": {
    "duration": 0.004476070404052734,
    "status": "PASSED"
   },
   "resulttooltests.ResultToolTests.test_junit_missing_image_tests": {
    "duration": 0.004590272903442383,
    "status": "PASSED"
   },
   "resulttooltests.ResultToolTests.test_junit_missing_ptests": {
    "duration": 0.004462718963623047,
    "status": "PASSED"
   },
   "resulttooltests.ResultToolTests.test_machine_matches": {
    "duration": 0.004435539245605469,
    "status": "PASSED"
   },
   "resulttooltests.ResultToolTests.test_machine_mismatches": {
    "duration": 0.0048465728759765625,
    "status": "PASSED"
   },
   "resulttooltests.ResultToolTests.test_merge_can_merged_results": {
    "duration": 0.004750490188598633,
    "status": "PASSED"
   },
   "resulttooltests.ResultToolTests.test_metadata_matching_is_only_checked_for_relevant_test_type": {
    "duration": 0.0045528411865234375,
    "status": "PASSED"
   },
   "resulttooltests.ResultToolTests.test_regression_can_get_regression_base_target_pair": {
    "duration": 0.004566669464111328,
    "status": "PASSED"
   },
   "resulttooltests.ResultToolTests.test_regression_can_get_regression_result": {
    "duration": 0.0050389766693115234,
    "status": "PASSED"
   },
   "resulttooltests.ResultToolTests.test_report_can_aggregate_test_result": {
    "duration": 0.00534820556640625,
    "status": "PASSED"
   },
   "resulttooltests.ResultToolTests.test_results_with_matching_metadata_can_be_compared": {
    "duration": 0.004607677459716797,
    "status": "PASSED"
   },
   "resulttooltests.ResultToolTests.test_results_with_mismatching_metadata_can_not_be_compared": {
    "duration": 0.00462651252746582,
    "status": "PASSED"
   },
   "resulttooltests.ResultToolTests.test_results_without_metadata_can_be_compared": {
    "duration": 0.004664182662963867,
    "status": "PASSED"
   },
   "resulttooltests.ResultToolTests.test_target_result_with_missing_metadata_can_not_be_compared": {
    "duration": 0.004548549652099609,
    "status": "PASSED"
   },
   "retain.Retain.test_retain_always": {
    "duration": 36.42810106277466,
    "status": "PASSED"
   },
   "retain.Retain.test_retain_failure": {
    "duration": 45.844117879867554,
    "status": "PASSED"
   },
   "retain.Retain.test_retain_global": {
    "duration": 62.564759969711304,
    "status": "PASSED"
   },
   "retain.Retain.test_retain_misc": {
    "duration": 74.9813220500946,
    "status": "PASSED"
   },
   "rootfspostcommandstests.ShadowUtilsTidyFiles.test_shadowutils_backup_files": {
    "duration": 24.410768032073975,
    "log": "Testcase skipped as 'tidy_shadowutils_files' rootfs post process command is not the set SORT_PASSWD_POSTPROCESS_COMMAND.\n",
    "status": "SKIPPED"
   },
   "rootfspostcommandstests.ShadowUtilsTidyFiles.test_shadowutils_sorted_files": {
    "duration": 7.446507215499878,
    "log": "Testcase skipped as 'tidy_shadowutils_files' rootfs post process command is not the set SORT_PASSWD_POSTPROCESS_COMMAND.\n",
    "status": "SKIPPED"
   },
   "rpmtests.BitbakeTests.test_rpm_filenames": {
    "duration": 10.943249225616455,
    "status": "PASSED"
   },
   "runcmd.RunCmdTests.test_list_not_found": {
    "duration": 0.01283717155456543,
    "status": "PASSED"
   },
   "runcmd.RunCmdTests.test_list_okay": {
    "duration": 0.1051948070526123,
    "status": "PASSED"
   },
   "runcmd.RunCmdTests.test_log": {
    "duration": 0.010190963745117188,
    "status": "PASSED"
   },
   "runcmd.RunCmdTests.test_log_split": {
    "duration": 0.009084224700927734,
    "status": "PASSED"
   },
   "runcmd.RunCmdTests.test_no_shell": {
    "duration": 0.007097005844116211,
    "status": "PASSED"
   },
   "runcmd.RunCmdTests.test_output": {
    "duration": 0.008456230163574219,
    "status": "PASSED"
   },
   "runcmd.RunCmdTests.test_output_split": {
    "duration": 0.008795022964477539,
    "status": "PASSED"
   },
   "runcmd.RunCmdTests.test_result_assertion": {
    "duration": 0.029581546783447266,
    "status": "PASSED"
   },
   "runcmd.RunCmdTests.test_result_exception": {
    "duration": 0.0164492130279541,
    "status": "PASSED"
   },
   "runcmd.RunCmdTests.test_result_false": {
    "duration": 0.016867399215698242,
    "status": "PASSED"
   },
   "runcmd.RunCmdTests.test_result_okay": {
    "duration": 0.011716604232788086,
    "status": "PASSED"
   },
   "runcmd.RunCmdTests.test_shell": {
    "duration": 0.013780355453491211,
    "status": "PASSED"
   },
   "runcmd.RunCmdTests.test_stdin": {
    "duration": 0.008237600326538086,
    "status": "PASSED"
   },
   "runcmd.RunCmdTests.test_stdin_timeout": {
    "duration": 10.007442712783813,
    "status": "PASSED"
   },
   "runcmd.RunCmdTests.test_timeout": {
    "duration": 10.01106572151184,
    "status": "PASSED"
   },
   "runcmd.RunCmdTests.test_timeout_split": {
    "duration": 10.014078140258789,
    "status": "PASSED"
   },
   "runqemu.RunqemuTests.test_boot_compressed_wic_by_path": {
    "duration": 183.71890497207642,
    "oetags": [
     "runqemu"
    ],
    "status": "PASSED"
   },
   "runqemu.RunqemuTests.test_boot_compressed_wic_by_recipe": {
    "duration": 27.236462116241455,
    "oetags": [
     "runqemu"
    ],
    "status": "PASSED"
   },
   "runqemu.RunqemuTests.test_boot_deploy": {
    "duration": 20.372109174728394,
    "oetags": [
     "runqemu"
    ],
    "status": "PASSED"
   },
   "runqemu.RunqemuTests.test_boot_deploy_hddimg": {
    "duration": 21.21262240409851,
    "oetags": [
     "runqemu"
    ],
    "status": "PASSED"
   },
   "runqemu.RunqemuTests.test_boot_machine": {
    "duration": 24.388434886932373,
    "oetags": [
     "runqemu"
    ],
    "status": "PASSED"
   },
   "runqemu.RunqemuTests.test_boot_machine_ext4": {
    "duration": 23.856916189193726,
    "oetags": [
     "runqemu"
    ],
    "status": "PASSED"
   },
   "runqemu.RunqemuTests.test_boot_machine_iso": {
    "duration": 28.223505973815918,
    "oetags": [
     "runqemu"
    ],
    "status": "PASSED"
   },
   "runqemu.RunqemuTests.test_boot_machine_slirp": {
    "duration": 24.76376223564148,
    "oetags": [
     "runqemu"
    ],
    "status": "PASSED"
   },
   "runqemu.RunqemuTests.test_boot_machine_slirp_qcow2": {
    "duration": 25.7475163936615,
    "oetags": [
     "runqemu"
    ],
    "status": "PASSED"
   },
   "runqemu.RunqemuTests.test_boot_qemu_boot": {
    "duration": 21.09885573387146,
    "oetags": [
     "runqemu"
    ],
    "status": "PASSED"
   },
   "runqemu.RunqemuTests.test_boot_recipe_image": {
    "duration": 28.943528175354004,
    "oetags": [
     "runqemu"
    ],
    "status": "PASSED"
   },
   "runqemu.RunqemuTests.test_boot_recipe_image_vdi": {
    "duration": 31.131057024002075,
    "oetags": [
     "runqemu"
    ],
    "status": "PASSED"
   },
   "runqemu.RunqemuTests.test_boot_recipe_image_vmdk": {
    "duration": 30.035813808441162,
    "oetags": [
     "runqemu"
    ],
    "status": "PASSED"
   },
   "runqemu.RunqemuTests.test_boot_rootfs": {
    "duration": 22.363430738449097,
    "oetags": [
     "runqemu"
    ],
    "status": "PASSED"
   },
   "runtime_test.Postinst.test_failing_postinst": {
    "duration": 177.86340641975403,
    "oetags": [
     "runqemu"
    ],
    "status": "PASSED"
   },
   "runtime_test.Postinst.test_postinst_rootfs_and_boot_systemd": {
    "duration": 286.21768712997437,
    "oetags": [
     "runqemu"
    ],
    "status": "PASSED"
   },
   "runtime_test.Postinst.test_postinst_rootfs_and_boot_sysvinit": {
    "duration": 218.1571388244629,
    "oetags": [
     "runqemu"
    ],
    "status": "PASSED"
   },
   "runtime_test.RustKernel.test_kernel_rust_sample": {
    "duration": 95.30053520202637,
    "oetags": [
     "runqemu"
    ],
    "status": "PASSED"
   },
   "runtime_test.SystemTap.test_crosstap_helloworld": {
    "duration": 410.9837465286255,
    "oetags": [
     "runqemu"
    ],
    "status": "PASSED"
   },
   "runtime_test.SystemTap.test_crosstap_pstree": {
    "duration": 36.253971099853516,
    "oetags": [
     "runqemu"
    ],
    "status": "PASSED"
   },
   "runtime_test.SystemTap.test_crosstap_syscalls_by_pid": {
    "duration": 36.06015634536743,
    "oetags": [
     "runqemu"
    ],
    "status": "PASSED"
   },
   "runtime_test.SystemTap.test_crosstap_syscalls_by_proc": {
    "duration": 36.955769538879395,
    "oetags": [
     "runqemu"
    ],
    "status": "PASSED"
   },
   "runtime_test.TestExport.test_testexport_basic": {
    "duration": 93.51725363731384,
    "oetags": [
     "runqemu"
    ],
    "status": "PASSED"
   },
   "runtime_test.TestExport.test_testexport_sdk": {
    "duration": 122.55864667892456,
    "status": "PASSED"
   },
   "runtime_test.TestImage.test_testimage_apt": {
    "duration": 420.56699562072754,
    "oetags": [
     "runqemu"
    ],
    "status": "PASSED"
   },
   "runtime_test.TestImage.test_testimage_dnf": {
    "duration": 262.88919830322266,
    "oetags": [
     "runqemu"
    ],
    "status": "PASSED"
   },
   "runtime_test.TestImage.test_testimage_install": {
    "duration": 192.97480964660645,
    "oetags": [
     "runqemu"
    ],
    "status": "PASSED"
   },
   "runtime_test.TestImage.test_testimage_slirp": {
    "duration": 132.22497177124023,
    "oetags": [
     "runqemu"
    ],
    "status": "PASSED"
   },
   "runtime_test.TestImage.test_testimage_virgl_gtk_sdl": {
    "duration": 1.229224443435669,
    "log": "virgl isn't working with Opensuse 16.0\n",
    "oetags": [
     "runqemu"
    ],
    "status": "SKIPPED"
   },
   "runtime_test.TestImage.test_testimage_virgl_headless": {
    "duration": 133.3115758895874,
    "oetags": [
     "runqemu"
    ],
    "status": "PASSED"
   },
   "rust.RustStaticMuslTest.test_static_musl_linking": {
    "duration": 53.243682622909546,
    "status": "PASSED"
   },
   "sdk.SDKTests.test_sdk_manifests": {
    "duration": 378.87113547325134,
    "status": "PASSED"
   },
   "sdk.SDKTests.test_sdk_runqemu": {
    "duration": 325.3247227668762,
    "status": "PASSED"
   },
   "selftest.ExternalLayer.test_list_imported": {
    "duration": 0.01224517822265625,
    "status": "PASSED"
   },
   "signing.LockedSignatures.test_locked_signatures": {
    "duration": 98.54460525512695,
    "status": "PASSED"
   },
   "signing.Signing.test_signing_packages": {
    "duration": 1901.0587420463562,
    "status": "PASSED"
   },
   "signing.Signing.test_signing_sstate_archive": {
    "duration": 191.007506608963,
    "status": "PASSED"
   },
   "spdx.SPDX30Check.test_baremetal_helloworld": {
    "duration": 58.88400650024414,
    "status": "PASSED"
   },
   "spdx.SPDX30Check.test_base_files": {
    "duration": 58.66100454330444,
    "status": "PASSED"
   },
   "spdx.SPDX30Check.test_core_image_minimal": {
    "duration": 78.16267395019531,
    "status": "PASSED"
   },
   "spdx.SPDX30Check.test_core_image_minimal_sdk": {
    "duration": 432.9781348705292,
    "status": "PASSED"
   },
   "spdx.SPDX30Check.test_custom_annotation_vars": {
    "duration": 35.391684770584106,
    "status": "PASSED"
   },
   "spdx.SPDX30Check.test_download_location_defensive_handling": {
    "duration": 17.308000564575195,
    "status": "PASSED"
   },
   "spdx.SPDX30Check.test_extra_opts": {
    "duration": 372.21638226509094,
    "status": "PASSED"
   },
   "spdx.SPDX30Check.test_gcc_include_source": {
    "duration": 3434.9526777267456,
    "status": "PASSED"
   },
   "spdx.SPDX30Check.test_kernel_config_spdx": {
    "duration": 26.60319709777832,
    "status": "PASSED"
   },
   "spdx.SPDX30Check.test_packageconfig_spdx": {
    "duration": 19.717698574066162,
    "status": "PASSED"
   },
   "spdx.SPDX30Check.test_version_extraction_patterns": {
    "duration": 9.273574113845825,
    "status": "PASSED"
   },
   "spdx.SPDX30Check.test_world_sbom": {
    "duration": 29.172308683395386,
    "status": "PASSED"
   },
   "sstatetests.SStateCacheManagement.test_sstate_cache_management_script_using_machine": {
    "duration": 154.79752922058105,
    "status": "PASSED"
   },
   "sstatetests.SStateCacheManagement.test_sstate_cache_management_script_using_pr_1": {
    "duration": 131.20239520072937,
    "status": "PASSED"
   },
   "sstatetests.SStateCacheManagement.test_sstate_cache_management_script_using_pr_2": {
    "duration": 133.42652130126953,
    "status": "PASSED"
   },
   "sstatetests.SStateCacheManagement.test_sstate_cache_management_script_using_pr_3": {
    "duration": 167.55788564682007,
    "status": "PASSED"
   },
   "sstatetests.SStateCleanup.test_cleansstate_task_distro_nonspecific": {
    "duration": 60.53058886528015,
    "status": "PASSED"
   },
   "sstatetests.SStateCleanup.test_cleansstate_task_distro_specific": {
    "duration": 66.51738119125366,
    "status": "PASSED"
   },
   "sstatetests.SStateCleanup.test_cleansstate_task_distro_specific_nonspecific": {
    "duration": 63.639153480529785,
    "status": "PASSED"
   },
   "sstatetests.SStateCreation.test_sstate_creation_distro_nonspecific": {
    "duration": 40.37081599235535,
    "status": "PASSED"
   },
   "sstatetests.SStateCreation.test_sstate_creation_distro_specific": {
    "duration": 39.69399571418762,
    "status": "PASSED"
   },
   "sstatetests.SStateDistroTests.test_rebuild_distro_specific_sstate_cross_native_targets": {
    "duration": 58.459434509277344,
    "status": "PASSED"
   },
   "sstatetests.SStateDistroTests.test_rebuild_distro_specific_sstate_cross_target": {
    "duration": 58.56398415565491,
    "status": "PASSED"
   },
   "sstatetests.SStateDistroTests.test_rebuild_distro_specific_sstate_native_target": {
    "duration": 58.31490206718445,
    "status": "PASSED"
   },
   "sstatetests.SStateFindSiginfo.test_sstate_compare_sigfiles_and_find_siginfo": {
    "duration": 198.96035361289978,
    "status": "PASSED"
   },
   "sstatetests.SStateHashSameSigs.test_sstate_32_64_same_hash": {
    "duration": 111.13560557365417,
    "status": "PASSED"
   },
   "sstatetests.SStateHashSameSigs.test_sstate_nativelsbstring_same_hash": {
    "duration": 113.63424587249756,
    "status": "PASSED"
   },
   "sstatetests.SStateHashSameSigs.test_sstate_sdk_arch_same_hash": {
    "duration": 118.83163642883301,
    "status": "PASSED"
   },
   "sstatetests.SStateHashSameSigs2.test_sstate_allarch_samesigs": {
    "duration": 94.3007299900055,
    "status": "PASSED"
   },
   "sstatetests.SStateHashSameSigs2.test_sstate_nativesdk_samesigs_multilib": {
    "duration": 125.20633745193481,
    "status": "PASSED"
   },
   "sstatetests.SStateHashSameSigs3.test_sstate_multilib_or_not_native_samesigs": {
    "duration": 91.83416748046875,
    "status": "PASSED"
   },
   "sstatetests.SStateHashSameSigs3.test_sstate_sametune_samesigs": {
    "duration": 213.05941724777222,
    "status": "PASSED"
   },
   "sstatetests.SStateHashSameSigs4.test_sstate_movelayer_samesigs": {
    "duration": 94.03513026237488,
    "status": "PASSED"
   },
   "sstatetests.SStateHashSameSigs4.test_sstate_noop_samesigs": {
    "duration": 160.50988864898682,
    "status": "PASSED"
   },
   "sstatetests.SStatePrintdiff.test_gcc_runtime_vs_gcc_source": {
    "duration": 981.033524274826,
    "status": "PASSED"
   },
   "sstatetests.SStatePrintdiff.test_image_minimal_vs_base_do_configure": {
    "duration": 544.5780065059662,
    "status": "PASSED"
   },
   "sstatetests.SStatePrintdiff.test_image_minimal_vs_perlcross": {
    "duration": 281.9162266254425,
    "status": "PASSED"
   },
   "sstatetests.SStateTests.test_autorev_sstate_works": {
    "duration": 55.72615599632263,
    "status": "PASSED"
   },
   "sysroot.SysrootTests.test_sysroot_cleanup": {
    "duration": 69.92445302009583,
    "status": "PASSED"
   },
   "sysroot.SysrootTests.test_sysroot_la": {
    "duration": 49.24739146232605,
    "status": "PASSED"
   },
   "sysroot.SysrootTests.test_sysroot_max_shebang": {
    "duration": 18.38036274909973,
    "status": "PASSED"
   },
   "sysroot.SysrootTests.test_sysroot_pkgconfig": {
    "duration": 32.050960540771484,
    "status": "PASSED"
   },
   "systemd_boot.Systemdboot.test_efi_systemdboot_images_can_be_built": {
    "duration": 224.23626065254211,
    "status": "PASSED"
   },
   "tinfoil.TinfoilTests.test_datastore_operations": {
    "duration": 1.001756191253662,
    "status": "PASSED"
   },
   "tinfoil.TinfoilTests.test_expand": {
    "duration": 0.2563660144805908,
    "status": "PASSED"
   },
   "tinfoil.TinfoilTests.test_getvar": {
    "duration": 1.007791519165039,
    "status": "PASSED"
   },
   "tinfoil.TinfoilTests.test_getvar_bb_origenv": {
    "duration": 1.007899284362793,
    "status": "PASSED"
   },
   "tinfoil.TinfoilTests.test_list_recipes": {
    "duration": 4.925502777099609,
    "status": "PASSED"
   },
   "tinfoil.TinfoilTests.test_parse_recipe": {
    "duration": 3.634561538696289,
    "status": "PASSED"
   },
   "tinfoil.TinfoilTests.test_parse_recipe_copy_expand": {
    "duration": 4.306397438049316,
    "status": "PASSED"
   },
   "tinfoil.TinfoilTests.test_parse_recipe_custom_data": {
    "duration": 4.5622570514678955,
    "status": "PASSED"
   },
   "tinfoil.TinfoilTests.test_parse_virtual_recipe": {
    "duration": 4.622629165649414,
    "status": "PASSED"
   },
   "tinfoil.TinfoilTests.test_parse_virtual_recipe_custom_data": {
    "duration": 4.904344081878662,
    "status": "PASSED"
   },
   "tinfoil.TinfoilTests.test_setvariable_clean": {
    "duration": 3.0264241695404053,
    "status": "PASSED"
   },
   "tinfoil.TinfoilTests.test_variable_history": {
    "duration": 4.4356794357299805,
    "status": "PASSED"
   },
   "tinfoil.TinfoilTests.test_wait_event": {
    "duration": 2.002387285232544,
    "status": "PASSED"
   },
   "toolchain.ToolchainTests.test_toolchain_switching": {
    "duration": 107.84077739715576,
    "status": "PASSED"
   },
   "uboot.UBootConfigTest.test_uboot_config_extract": {
    "duration": 17.952669620513916,
    "status": "PASSED"
   },
   "uboot.UBootConfigTest.test_uboot_config_extract_error_missing_config": {
    "duration": 14.36193037033081,
    "status": "PASSED"
   },
   "uboot.UBootConfigTest.test_uboot_config_extract_error_nothing_set": {
    "duration": 17.536086320877075,
    "status": "PASSED"
   },
   "uboot.UBootConfigTest.test_uboot_config_extract_error_set_both_config_and_machine": {
    "duration": 14.119932889938354,
    "status": "PASSED"
   },
   "uboot.UBootConfigTest.test_uboot_config_extract_error_set_uboot_config_binary": {
    "duration": 14.161695718765259,
    "status": "PASSED"
   },
   "uboot.UBootConfigTest.test_uboot_config_extract_error_set_uboot_config_fragments": {
    "duration": 14.506778240203857,
    "status": "PASSED"
   },
   "uboot.UBootConfigTest.test_uboot_config_extract_error_set_uboot_config_image_fstypes": {
    "duration": 14.31648302078247,
    "status": "PASSED"
   },
   "uboot.UBootConfigTest.test_uboot_config_extract_error_set_uboot_config_make_opts": {
    "duration": 14.476256370544434,
    "status": "PASSED"
   },
   "uboot.UBootConfigTest.test_uboot_config_extract_legacy": {
    "duration": 17.942067861557007,
    "status": "PASSED"
   },
   "uboot.UBootConfigTest.test_uboot_config_extract_single_config": {
    "duration": 17.681126832962036,
    "status": "PASSED"
   },
   "uboot.UBootTest.test_boot_uboot": {
    "duration": 0.0004940032958984375,
    "log": "Test skipped on x86_64\n",
    "oetags": [
     "runqemu"
    ],
    "status": "SKIPPED"
   },
   "uboot.UBootTest.test_boot_uboot_kvm_to_full_target": {
    "duration": 0.0006535053253173828,
    "log": "Test skipped on x86_64\n",
    "oetags": [
     "runqemu"
    ],
    "status": "SKIPPED"
   },
   "uboot.UBootTest.test_uboot_config_initial_env_binary": {
    "duration": 56.338866233825684,
    "status": "PASSED"
   },
   "uboot.UBootTest.test_uboot_initial_env_binary": {
    "duration": 45.576199531555176,
    "status": "PASSED"
   },
   "uki.UkiTest.test_uki_boot_systemd": {
    "duration": 2281.795033931732,
    "oetags": [
     "runqemu"
    ],
    "status": "PASSED"
   },
   "uki.UkiTest.test_uki_sysvinit": {
    "duration": 656.7472748756409,
    "oetags": [
     "runqemu"
    ],
    "status": "PASSED"
   },
   "usergrouptests.UserGroupTests.test_add_task_between_p_sysroot_and_package": {
    "duration": 35.747140884399414,
    "status": "PASSED"
   },
   "usergrouptests.UserGroupTests.test_group_from_dep_package": {
    "duration": 35.22707676887512,
    "status": "PASSED"
   },
   "usergrouptests.UserGroupTests.test_postinst_order": {
    "duration": 21.867425441741943,
    "status": "PASSED"
   },
   "usergrouptests.UserGroupTests.test_static_useradd_from_dynamic": {
    "duration": 118.1862370967865,
    "status": "PASSED"
   },
   "usergrouptests.UserGroupTests.test_useradd_depends_only": {
    "duration": 15.99905276298523,
    "status": "PASSED"
   },
   "wic.CLITests.test_createhelp": {
    "duration": 56.959182024002075,
    "status": "PASSED"
   },
   "wic.CLITests.test_help": {
    "duration": 4.365335464477539,
    "status": "PASSED"
   },
   "wic.CLITests.test_help_create": {
    "duration": 3.6539580821990967,
    "status": "PASSED"
   },
   "wic.CLITests.test_help_kickstart": {
    "duration": 4.322551727294922,
    "status": "PASSED"
   },
   "wic.CLITests.test_help_list": {
    "duration": 4.194494962692261,
    "status": "PASSED"
   },
   "wic.CLITests.test_help_overview": {
    "duration": 4.036761283874512,
    "status": "PASSED"
   },
   "wic.CLITests.test_help_plugins": {
    "duration": 4.127009630203247,
    "status": "PASSED"
   },
   "wic.CLITests.test_list_images": {
    "duration": 6.241459369659424,
    "status": "PASSED"
   },
   "wic.CLITests.test_list_source_plugins": {
    "duration": 8.042750597000122,
    "status": "PASSED"
   },
   "wic.CLITests.test_listed_images_help": {
    "duration": 57.09847354888916,
    "status": "PASSED"
   },
   "wic.CLITests.test_listhelp": {
    "duration": 3.0425972938537598,
    "status": "PASSED"
   },
   "wic.CLITests.test_no_command": {
    "duration": 4.084164381027222,
    "status": "PASSED"
   },
   "wic.CLITests.test_unsupported_subcommand": {
    "duration": 4.30412483215332,
    "status": "PASSED"
   },
   "wic.CLITests.test_version": {
    "duration": 3.722628355026245,
    "status": "PASSED"
   },
   "wic.ModifyTests.test_wic_cp": {
    "duration": 84.60793614387512,
    "status": "PASSED"
   },
   "wic.ModifyTests.test_wic_cp_ext": {
    "duration": 48.14770007133484,
    "status": "PASSED"
   },
   "wic.ModifyTests.test_wic_ls": {
    "duration": 33.44545125961304,
    "status": "PASSED"
   },
   "wic.ModifyTests.test_wic_ls_ext": {
    "duration": 29.152074575424194,
    "status": "PASSED"
   },
   "wic.ModifyTests.test_wic_rm": {
    "duration": 42.34284734725952,
    "status": "PASSED"
   },
   "wic.ModifyTests.test_wic_rm_ext": {
    "duration": 39.25924873352051,
    "status": "PASSED"
   },
   "wic.Wic.test_bootloader_config": {
    "duration": 186.0484335422516,
    "status": "PASSED"
   },
   "wic.Wic.test_build_artifacts": {
    "duration": 23.73555064201355,
    "status": "PASSED"
   },
   "wic.Wic.test_build_image_name": {
    "duration": 57.952656745910645,
    "status": "PASSED"
   },
   "wic.Wic.test_build_rootfs_long": {
    "duration": 83.92027544975281,
    "status": "PASSED"
   },
   "wic.Wic.test_build_rootfs_short": {
    "duration": 45.089717388153076,
    "status": "PASSED"
   },
   "wic.Wic.test_change_directory": {
    "duration": 40.254862785339355,
    "status": "PASSED"
   },
   "wic.Wic.test_change_directory_errors": {
    "duration": 57.347065687179565,
    "status": "PASSED"
   },
   "wic.Wic.test_compress_bzip2": {
    "duration": 36.597962379455566,
    "status": "PASSED"
   },
   "wic.Wic.test_compress_gzip": {
    "duration": 35.0319459438324,
    "status": "PASSED"
   },
   "wic.Wic.test_compress_xz": {
    "duration": 42.49044060707092,
    "status": "PASSED"
   },
   "wic.Wic.test_debug_long": {
    "duration": 37.316731691360474,
    "status": "PASSED"
   },
   "wic.Wic.test_debug_short": {
    "duration": 31.466288089752197,
    "status": "PASSED"
   },
   "wic.Wic.test_default_output_dir": {
    "duration": 76.14120554924011,
    "status": "PASSED"
   },
   "wic.Wic.test_efi_bootpart": {
    "duration": 67.92997217178345,
    "status": "PASSED"
   },
   "wic.Wic.test_exclude_path": {
    "duration": 45.6769483089447,
    "status": "PASSED"
   },
   "wic.Wic.test_exclude_path_errors": {
    "duration": 53.72764825820923,
    "status": "PASSED"
   },
   "wic.Wic.test_exclude_path_with_extra_space": {
    "duration": 98.0822126865387,
    "status": "PASSED"
   },
   "wic.Wic.test_extra_space": {
    "duration": 30.347925424575806,
    "status": "PASSED"
   },
   "wic.Wic.test_gpt_image": {
    "duration": 31.0433030128479,
    "status": "PASSED"
   },
   "wic.Wic.test_grub_install_pcbios": {
    "duration": 107.91903448104858,
    "status": "PASSED"
   },
   "wic.Wic.test_include_path": {
    "duration": 42.526280641555786,
    "status": "PASSED"
   },
   "wic.Wic.test_include_path_embeded": {
    "duration": 44.89825129508972,
    "status": "PASSED"
   },
   "wic.Wic.test_include_path_errors": {
    "duration": 91.54879570007324,
    "status": "PASSED"
   },
   "wic.Wic.test_iso_image": {
    "duration": 200.9279592037201,
    "status": "PASSED"
   },
   "wic.Wic.test_kernel_install": {
    "duration": 42.08667349815369,
    "status": "PASSED"
   },
   "wic.Wic.test_mkefidisk": {
    "duration": 33.53993368148804,
    "status": "PASSED"
   },
   "wic.Wic.test_no_fstab_update": {
    "duration": 50.36155676841736,
    "status": "PASSED"
   },
   "wic.Wic.test_no_fstab_update_errors": {
    "duration": 50.745609521865845,
    "status": "PASSED"
   },
   "wic.Wic.test_no_table": {
    "duration": 27.782520532608032,
    "status": "PASSED"
   },
   "wic.Wic.test_partition_hidden_attributes": {
    "duration": 35.16284394264221,
    "status": "PASSED"
   },
   "wic.Wic.test_permissions": {
    "duration": 271.38587260246277,
    "status": "PASSED"
   },
   "wic.Wic.test_qemux86_directdisk": {
    "duration": 23.709646224975586,
    "status": "PASSED"
   },
   "wic.Wic.test_rootfs_artifacts": {
    "duration": 17.1536865234375,
    "status": "PASSED"
   },
   "wic.Wic.test_rootfs_indirect_recipes": {
    "duration": 23.126896381378174,
    "status": "PASSED"
   },
   "wic.Wic.test_sdimage_bootpart": {
    "duration": 43.11835813522339,
    "status": "PASSED"
   },
   "wic.Wic.test_skip_build_check_long": {
    "duration": 22.87872838973999,
    "status": "PASSED"
   },
   "wic.Wic.test_skip_build_check_short": {
    "duration": 22.787760972976685,
    "status": "PASSED"
   },
   "wic.Wic.test_skip_kernel_install": {
    "duration": 32.51593589782715,
    "status": "PASSED"
   },
   "wic.Wic.test_systemd_bootdisk": {
    "duration": 74.95314931869507,
    "status": "PASSED"
   },
   "wic.Wic.test_wic_sector_size_cli": {
    "duration": 64.65055513381958,
    "status": "PASSED"
   },
   "wic.Wic.test_wic_sector_size_env": {
    "duration": 62.796796560287476,
    "status": "PASSED"
   },
   "wic.Wic.test_wrong_compressor": {
    "duration": 3.2630794048309326,
    "status": "PASSED"
   },
   "wic.Wic2.test_biosplusefi_plugin": {
    "duration": 128.0313422679901,
    "status": "PASSED"
   },
   "wic.Wic2.test_biosplusefi_plugin_qemu": {
    "duration": 34.88216519355774,
    "oetags": [
     "runqemu"
    ],
    "status": "PASSED"
   },
   "wic.Wic2.test_bmap_long": {
    "duration": 23.41340208053589,
    "status": "PASSED"
   },
   "wic.Wic2.test_bmap_short": {
    "duration": 23.563755989074707,
    "status": "PASSED"
   },
   "wic.Wic2.test_diskid_on_gpt_partition": {
    "duration": 26.80744767189026,
    "status": "PASSED"
   },
   "wic.Wic2.test_diskid_on_msdos_partition": {
    "duration": 27.60990285873413,
    "status": "PASSED"
   },
   "wic.Wic2.test_efi_plugin_plain_systemd_boot_qemu_aarch64": {
    "duration": 0.0007119178771972656,
    "log": "Test skipped on x86_64\n",
    "oetags": [
     "runqemu"
    ],
    "status": "SKIPPED"
   },
   "wic.Wic2.test_efi_plugin_plain_systemd_boot_qemu_x86": {
    "duration": 405.3740301132202,
    "oetags": [
     "runqemu"
    ],
    "status": "PASSED"
   },
   "wic.Wic2.test_efi_plugin_unified_kernel_image_qemu": {
    "duration": 110.87918090820312,
    "oetags": [
     "runqemu"
    ],
    "status": "PASSED"
   },
   "wic.Wic2.test_empty_plugin": {
    "duration": 66.23697686195374,
    "status": "PASSED"
   },
   "wic.Wic2.test_empty_zeroize_plugin": {
    "duration": 40.7293758392334,
    "status": "PASSED"
   },
   "wic.Wic2.test_expand_mbr_image": {
    "duration": 70.64088606834412,
    "oetags": [
     "runqemu"
    ],
    "status": "PASSED"
   },
   "wic.Wic2.test_extra_filesystem_space": {
    "duration": 27.20198893547058,
    "status": "PASSED"
   },
   "wic.Wic2.test_extra_partition_plugin": {
    "duration": 67.89489436149597,
    "status": "PASSED"
   },
   "wic.Wic2.test_extra_partition_space": {
    "duration": 33.17792367935181,
    "status": "PASSED"
   },
   "wic.Wic2.test_fixed_size": {
    "duration": 25.38068699836731,
    "status": "PASSED"
   },
   "wic.Wic2.test_fixed_size_error": {
    "duration": 24.67089581489563,
    "status": "PASSED"
   },
   "wic.Wic2.test_fs_types": {
    "duration": 24.66279101371765,
    "status": "PASSED"
   },
   "wic.Wic2.test_gpt_partition_name": {
    "duration": 60.541975259780884,
    "status": "PASSED"
   },
   "wic.Wic2.test_image_bootpart_globbed": {
    "duration": 41.53863072395325,
    "status": "PASSED"
   },
   "wic.Wic2.test_image_env": {
    "duration": 39.237305641174316,
    "status": "PASSED"
   },
   "wic.Wic2.test_image_vars_dir_long": {
    "duration": 8.144867897033691,
    "status": "PASSED"
   },
   "wic.Wic2.test_image_vars_dir_short": {
    "duration": 8.580019474029541,
    "status": "PASSED"
   },
   "wic.Wic2.test_kickstart_parser": {
    "duration": 23.881693601608276,
    "status": "PASSED"
   },
   "wic.Wic2.test_mkfs_extraopts": {
    "duration": 24.315621614456177,
    "status": "PASSED"
   },
   "wic.Wic2.test_offset": {
    "duration": 142.1784429550171,
    "status": "PASSED"
   },
   "wic.Wic2.test_qemu": {
    "duration": 95.02656173706055,
    "oetags": [
     "runqemu"
    ],
    "status": "PASSED"
   },
   "wic.Wic2.test_qemu_efi": {
    "duration": 78.76123785972595,
    "oetags": [
     "runqemu"
    ],
    "status": "PASSED"
   },
   "wic.Wic2.test_rawcopy_plugin": {
    "duration": 73.66721057891846,
    "status": "PASSED"
   },
   "wic.Wic2.test_rawcopy_plugin_qemu": {
    "duration": 86.44085812568665,
    "oetags": [
     "runqemu"
    ],
    "status": "PASSED"
   },
   "wic.Wic2.test_rawcopy_plugin_unpack": {
    "duration": 71.05768585205078,
    "status": "PASSED"
   },
   "wic.Wic2.test_uefi_kernel": {
    "duration": 71.36354279518127,
    "status": "PASSED"
   },
   "wic.Wic2.test_wic_image_type": {
    "duration": 29.674763917922974,
    "status": "PASSED"
   },
   "wrapper.WrapperTests.test_shebang_wrapper": {
    "duration": 29.228698015213013,
    "status": "PASSED"
   },
   "yoctotestresultsquerytests.TestResultsQueryTests.test_create_workdir": {
    "duration": 4.075550317764282,
    "status": "PASSED"
   },
   "yoctotestresultsquerytests.TestResultsQueryTests.test_get_sha1": {
    "duration": 0.08482885360717773,
    "status": "PASSED"
   }
  }
 }
}