{
 "oeselftest_opensuseleap-15.6_qemux86-64_20260717125451": {
  "configuration": {
   "HOST_DISTRO": "opensuseleap-15.6",
   "HOST_NAME": "opensuse156-vk-1",
   "LAYERS": {
    "meta": {
     "branch": "mathieu/master-next-tests",
     "commit": "7e53577eb667c8eb2691f72787831b6a93bb4b6e",
     "commit_count": 67916,
     "commit_time": 1784290797
    },
    "meta-poky": {
     "branch": "contrib/mathieu/master-next",
     "commit": "bcd8094dcb24a7c426ba4f77dcded0c12c06cc7e",
     "commit_count": 1807,
     "commit_time": 1783693288
    },
    "meta-selftest": {
     "branch": "mathieu/master-next-tests",
     "commit": "7e53577eb667c8eb2691f72787831b6a93bb4b6e",
     "commit_count": 67916,
     "commit_time": 1784290797
    },
    "meta-yocto-bsp": {
     "branch": "contrib/mathieu/master-next",
     "commit": "bcd8094dcb24a7c426ba4f77dcded0c12c06cc7e",
     "commit_count": 1807,
     "commit_time": 1783693288
    }
   },
   "MACHINE": "qemux86-64",
   "OESELFTEST_METADATA": {
    "exclude_tags": [
     "yocto-mirrors",
     "machine",
     "toolchain-user",
     "toolchain-system"
    ],
    "run_all_tests": true,
    "run_tests": null,
    "select_tags": null,
    "skips": [
     "distrodata.Distrodata.test_checkpkg",
     "reproducible"
    ]
   },
   "STARTTIME": "20260717125451",
   "TEST_TYPE": "oeselftest"
  },
  "result": {
   "archiver.Archiver.test_archiver_allows_to_filter_on_recipe_name": {
    "duration": 44.44658350944519,
    "status": "PASSED"
   },
   "archiver.Archiver.test_archiver_cleanup": {
    "duration": 80.44556188583374,
    "status": "PASSED"
   },
   "archiver.Archiver.test_archiver_filters_by_type": {
    "duration": 33.8857524394989,
    "status": "PASSED"
   },
   "archiver.Archiver.test_archiver_filters_by_type_and_name": {
    "duration": 36.776087045669556,
    "status": "PASSED"
   },
   "archiver.Archiver.test_archiver_mode_configured": {
    "duration": 35.18097472190857,
    "status": "PASSED"
   },
   "archiver.Archiver.test_archiver_mode_diff": {
    "duration": 33.50168204307556,
    "status": "PASSED"
   },
   "archiver.Archiver.test_archiver_mode_dumpdata": {
    "duration": 12.03784704208374,
    "status": "PASSED"
   },
   "archiver.Archiver.test_archiver_mode_mirror": {
    "duration": 36.01112461090088,
    "status": "PASSED"
   },
   "archiver.Archiver.test_archiver_mode_mirror_combined": {
    "duration": 42.24442148208618,
    "status": "PASSED"
   },
   "archiver.Archiver.test_archiver_mode_mirror_excludes": {
    "duration": 32.9768500328064,
    "status": "PASSED"
   },
   "archiver.Archiver.test_archiver_mode_mirror_gitsm": {
    "duration": 25.857411861419678,
    "status": "PASSED"
   },
   "archiver.Archiver.test_archiver_mode_mirror_gitsm_shallow": {
    "duration": 56.66408586502075,
    "status": "PASSED"
   },
   "archiver.Archiver.test_archiver_mode_original": {
    "duration": 37.37750291824341,
    "status": "PASSED"
   },
   "archiver.Archiver.test_archiver_mode_patched": {
    "duration": 13.474062442779541,
    "status": "PASSED"
   },
   "archiver.Archiver.test_archiver_mode_recipe": {
    "duration": 32.16675662994385,
    "status": "PASSED"
   },
   "archiver.Archiver.test_archiver_multiconfig_shared_unpack_and_patch": {
    "duration": 159.3656005859375,
    "status": "PASSED"
   },
   "barebox.BareboxTest.test_boot_barebox": {
    "duration": 0.0031409263610839844,
    "log": "Test skipped on x86_64\n",
    "oetags": [
     "runqemu"
    ],
    "status": "SKIPPED"
   },
   "baremetal.BaremetalTest.test_baremetal": {
    "duration": 84.86164879798889,
    "status": "PASSED"
   },
   "bbclasses.Systemd.test_systemd_in_distro": {
    "duration": 81.15021109580994,
    "status": "PASSED"
   },
   "bbclasses.Systemd.test_sysvinit_in_distro": {
    "duration": 41.81361436843872,
    "status": "PASSED"
   },
   "bblayers.BitbakeConfigBuild.test_enable_disable_builtin_fragments": {
    "duration": 23.628528356552124,
    "status": "PASSED"
   },
   "bblayers.BitbakeConfigBuild.test_enable_disable_fragments": {
    "duration": 19.39708161354065,
    "status": "PASSED"
   },
   "bblayers.BitbakeConfigBuild.test_show_fragment": {
    "duration": 1.722752332687378,
    "status": "PASSED"
   },
   "bblayers.BitbakeLayers.test_bitbakelayers_add_remove": {
    "duration": 9.475880861282349,
    "status": "PASSED"
   },
   "bblayers.BitbakeLayers.test_bitbakelayers_createlayer": {
    "duration": 9.488370895385742,
    "status": "PASSED"
   },
   "bblayers.BitbakeLayers.test_bitbakelayers_flatten": {
    "duration": 29.905089378356934,
    "status": "PASSED"
   },
   "bblayers.BitbakeLayers.test_bitbakelayers_layerindexshowdepends": {
    "duration": 1.6495468616485596,
    "status": "PASSED"
   },
   "bblayers.BitbakeLayers.test_bitbakelayers_setup": {
    "duration": 46.528462648391724,
    "status": "PASSED"
   },
   "bblayers.BitbakeLayers.test_bitbakelayers_showappends": {
    "duration": 10.34557557106018,
    "status": "PASSED"
   },
   "bblayers.BitbakeLayers.test_bitbakelayers_showcrossdepends": {
    "duration": 29.653170108795166,
    "status": "PASSED"
   },
   "bblayers.BitbakeLayers.test_bitbakelayers_showlayers": {
    "duration": 0.6193180084228516,
    "status": "PASSED"
   },
   "bblayers.BitbakeLayers.test_bitbakelayers_showoverlayed": {
    "duration": 4.739100694656372,
    "status": "PASSED"
   },
   "bblayers.BitbakeLayers.test_bitbakelayers_showrecipes": {
    "duration": 28.59476923942566,
    "status": "PASSED"
   },
   "bblayers.BitbakeLayers.test_bitbakelayers_updatelayer": {
    "duration": 9.637518405914307,
    "status": "PASSED"
   },
   "bblayers.BitbakeLayers.test_validate_bitbake_setup_default_registry": {
    "duration": 3.199012279510498,
    "status": "PASSED"
   },
   "bblayers.BitbakeLayers.test_validate_examplelayersjson": {
    "duration": 0.37073445320129395,
    "status": "PASSED"
   },
   "bblock.BBLock.test_lock_architecture_specific": {
    "duration": 106.92756509780884,
    "status": "PASSED"
   },
   "bblock.BBLock.test_lock_multiple_recipe_single_task": {
    "duration": 310.3197786808014,
    "status": "PASSED"
   },
   "bblock.BBLock.test_lock_single_recipe_all_tasks": {
    "duration": 176.80368423461914,
    "status": "PASSED"
   },
   "bblock.BBLock.test_lock_single_recipe_multiple_tasks": {
    "duration": 161.4888300895691,
    "status": "PASSED"
   },
   "bblock.BBLock.test_lock_single_recipe_single_task": {
    "duration": 166.37934350967407,
    "status": "PASSED"
   },
   "bblogging.BitBakeLogging.test_python_exec_func_python_loggingA": {
    "duration": 46.96866416931152,
    "status": "PASSED"
   },
   "bblogging.BitBakeLogging.test_python_exec_func_python_loggingB": {
    "duration": 34.92344307899475,
    "status": "PASSED"
   },
   "bblogging.BitBakeLogging.test_python_exec_func_python_loggingC": {
    "duration": 35.86241865158081,
    "status": "PASSED"
   },
   "bblogging.BitBakeLogging.test_python_exec_func_python_loggingD": {
    "duration": 13.828984260559082,
    "status": "PASSED"
   },
   "bblogging.BitBakeLogging.test_python_exec_func_shell_loggingA": {
    "duration": 16.616543769836426,
    "status": "PASSED"
   },
   "bblogging.BitBakeLogging.test_python_exec_func_shell_loggingB": {
    "duration": 13.87819790840149,
    "status": "PASSED"
   },
   "bblogging.BitBakeLogging.test_python_exec_func_shell_loggingC": {
    "duration": 17.07353687286377,
    "status": "PASSED"
   },
   "bblogging.BitBakeLogging.test_python_exec_func_shell_loggingD": {
    "duration": 16.391483783721924,
    "status": "PASSED"
   },
   "bblogging.BitBakeLogging.test_python_exit_loggingA": {
    "duration": 15.46407699584961,
    "status": "PASSED"
   },
   "bblogging.BitBakeLogging.test_python_exit_loggingB": {
    "duration": 14.817349195480347,
    "status": "PASSED"
   },
   "bblogging.BitBakeLogging.test_python_exit_loggingC": {
    "duration": 14.830238819122314,
    "status": "PASSED"
   },
   "bblogging.BitBakeLogging.test_python_exit_loggingD": {
    "duration": 15.124334812164307,
    "status": "PASSED"
   },
   "bblogging.BitBakeLogging.test_python_fatal_loggingA": {
    "duration": 13.510638952255249,
    "status": "PASSED"
   },
   "bblogging.BitBakeLogging.test_python_fatal_loggingB": {
    "duration": 15.830127000808716,
    "status": "PASSED"
   },
   "bblogging.BitBakeLogging.test_python_fatal_loggingC": {
    "duration": 16.430659294128418,
    "status": "PASSED"
   },
   "bblogging.BitBakeLogging.test_python_fatal_loggingD": {
    "duration": 14.913490295410156,
    "status": "PASSED"
   },
   "bblogging.BitBakeLogging.test_shell_loggingA": {
    "duration": 16.504297971725464,
    "status": "PASSED"
   },
   "bblogging.BitBakeLogging.test_shell_loggingB": {
    "duration": 13.929319858551025,
    "status": "PASSED"
   },
   "bblogging.BitBakeLogging.test_shell_loggingC": {
    "duration": 15.326354265213013,
    "status": "PASSED"
   },
   "bblogging.BitBakeLogging.test_shell_loggingD": {
    "duration": 15.734044075012207,
    "status": "PASSED"
   },
   "bbtests.BitbakeTests.test_bb_env_bb_getvar_equality": {
    "duration": 4.033337831497192,
    "status": "PASSED"
   },
   "bbtests.BitbakeTests.test_bbappend_order": {
    "duration": 40.472853660583496,
    "status": "PASSED"
   },
   "bbtests.BitbakeTests.test_bitbake_g": {
    "duration": 8.051785469055176,
    "status": "PASSED"
   },
   "bbtests.BitbakeTests.test_bitbake_invalid_recipe": {
    "duration": 1.2328813076019287,
    "status": "PASSED"
   },
   "bbtests.BitbakeTests.test_bitbake_invalid_target": {
    "duration": 8.224018812179565,
    "status": "PASSED"
   },
   "bbtests.BitbakeTests.test_checkuri": {
    "duration": 9.660369157791138,
    "status": "PASSED"
   },
   "bbtests.BitbakeTests.test_continue": {
    "duration": 45.714024782180786,
    "status": "PASSED"
   },
   "bbtests.BitbakeTests.test_dry_run": {
    "duration": 9.378893375396729,
    "status": "PASSED"
   },
   "bbtests.BitbakeTests.test_environment": {
    "duration": 3.7700917720794678,
    "status": "PASSED"
   },
   "bbtests.BitbakeTests.test_event_handler": {
    "duration": 29.783111572265625,
    "status": "PASSED"
   },
   "bbtests.BitbakeTests.test_force_task_1": {
    "duration": 99.03670191764832,
    "status": "PASSED"
   },
   "bbtests.BitbakeTests.test_force_task_2": {
    "duration": 58.22433376312256,
    "status": "PASSED"
   },
   "bbtests.BitbakeTests.test_git_patchtool": {
    "duration": 24.513120412826538,
    "status": "PASSED"
   },
   "bbtests.BitbakeTests.test_git_patchtool2": {
    "duration": 30.17710852622986,
    "status": "PASSED"
   },
   "bbtests.BitbakeTests.test_git_unpack_nonetwork": {
    "duration": 43.89603090286255,
    "status": "PASSED"
   },
   "bbtests.BitbakeTests.test_git_unpack_nonetwork_fail": {
    "duration": 17.4379940032959,
    "status": "PASSED"
   },
   "bbtests.BitbakeTests.test_image_manifest": {
    "duration": 120.86736369132996,
    "status": "PASSED"
   },
   "bbtests.BitbakeTests.test_invalid_patch": {
    "duration": 48.41484832763672,
    "status": "PASSED"
   },
   "bbtests.BitbakeTests.test_invalid_recipe_src_uri": {
    "duration": 6.338319301605225,
    "status": "PASSED"
   },
   "bbtests.BitbakeTests.test_just_parse": {
    "duration": 5.97348952293396,
    "status": "PASSED"
   },
   "bbtests.BitbakeTests.test_local_sstate": {
    "duration": 30.935898065567017,
    "status": "PASSED"
   },
   "bbtests.BitbakeTests.test_non_gplv3": {
    "duration": 37.600841760635376,
    "status": "PASSED"
   },
   "bbtests.BitbakeTests.test_postfile": {
    "duration": 5.599277973175049,
    "status": "PASSED"
   },
   "bbtests.BitbakeTests.test_prefile": {
    "duration": 6.926628828048706,
    "status": "PASSED"
   },
   "bbtests.BitbakeTests.test_rename_downloaded_file": {
    "duration": 31.63810896873474,
    "status": "PASSED"
   },
   "bbtests.BitbakeTests.test_run_bitbake_from_dir_1": {
    "duration": 3.5068211555480957,
    "status": "PASSED"
   },
   "bbtests.BitbakeTests.test_run_bitbake_from_dir_2": {
    "duration": 3.762467384338379,
    "status": "PASSED"
   },
   "bbtests.BitbakeTests.test_run_bitbake_from_dir_3": {
    "duration": 3.0820212364196777,
    "status": "PASSED"
   },
   "bbtests.BitbakeTests.test_setscene_only": {
    "duration": 29.786136627197266,
    "status": "PASSED"
   },
   "bbtests.BitbakeTests.test_skip_setscene": {
    "duration": 62.20328330993652,
    "status": "PASSED"
   },
   "bbtests.BitbakeTests.test_unexpanded_variable_in_path": {
    "duration": 33.868780851364136,
    "status": "PASSED"
   },
   "bbtests.BitbakeTests.test_version": {
    "duration": 6.416959285736084,
    "status": "PASSED"
   },
   "bbtests.BitbakeTests.test_warnings_errors": {
    "duration": 0.9165060520172119,
    "status": "PASSED"
   },
   "buildhistory.BuildhistoryTests.test_buildhistory_basic": {
    "duration": 71.65682530403137,
    "status": "PASSED"
   },
   "buildhistory.BuildhistoryTests.test_buildhistory_buildtime_pr_backwards": {
    "duration": 83.68283438682556,
    "status": "PASSED"
   },
   "buildhistory.BuildhistoryTests.test_buildhistory_diff": {
    "duration": 91.13178300857544,
    "status": "PASSED"
   },
   "buildhistory.BuildhistoryTests.test_fileinfo": {
    "duration": 22.033270359039307,
    "status": "PASSED"
   },
   "buildoptions.ArchiverTest.test_arch_work_dir_and_export_source": {
    "duration": 60.78353404998779,
    "status": "PASSED"
   },
   "buildoptions.DiskMonTest.test_stoptask_behavior": {
    "duration": 115.51489853858948,
    "status": "PASSED"
   },
   "buildoptions.ImageOptionsTests.test_ccache_tool": {
    "duration": 137.3125114440918,
    "status": "PASSED"
   },
   "buildoptions.ImageOptionsTests.test_incremental_image_generation": {
    "duration": 265.3209924697876,
    "status": "PASSED"
   },
   "buildoptions.ImageOptionsTests.test_read_only_image": {
    "duration": 345.16870760917664,
    "status": "PASSED"
   },
   "buildoptions.Poisoning.test_poisoning": {
    "duration": 48.82916331291199,
    "status": "PASSED"
   },
   "buildoptions.SanityOptionsTest.test_layer_without_git_dir": {
    "duration": 38.78304123878479,
    "status": "PASSED"
   },
   "buildoptions.SanityOptionsTest.test_options_warnqa_errorqa_switch": {
    "duration": 101.94097948074341,
    "status": "PASSED"
   },
   "buildoptions.ToolchainOptions.test_toolchain_fortran": {
    "duration": 46.628947734832764,
    "status": "PASSED"
   },
   "c_cpp.CMakeTests.test_cmake_qemu": {
    "duration": 70.63622903823853,
    "status": "PASSED"
   },
   "c_cpp.CMakeTests.test_cmake_qemu_failing": {
    "duration": 51.30638408660889,
    "status": "PASSED"
   },
   "c_cpp.MesonTests.test_meson_qemu": {
    "duration": 56.425909757614136,
    "status": "PASSED"
   },
   "c_cpp.MesonTests.test_meson_qemu_failing": {
    "duration": 54.19541025161743,
    "status": "PASSED"
   },
   "containerimage.ContainerImageTests.test_expected_files": {
    "duration": 85.15749788284302,
    "status": "PASSED"
   },
   "cve_check.CVECheck.test_convert_cve_version": {
    "duration": 0.011281967163085938,
    "status": "PASSED"
   },
   "cve_check.CVECheck.test_parse_cve_from_patch_contents": {
    "duration": 0.005057334899902344,
    "status": "PASSED"
   },
   "cve_check.CVECheck.test_parse_cve_from_patch_filename": {
    "duration": 0.0046520233154296875,
    "status": "PASSED"
   },
   "cve_check.CVECheck.test_product_match": {
    "duration": 0.0045621395111083984,
    "status": "PASSED"
   },
   "cve_check.CVECheck.test_version_compare": {
    "duration": 0.005688667297363281,
    "status": "PASSED"
   },
   "debuginfod.Debuginfod.test_debuginfod_native": {
    "duration": 67.03462767601013,
    "status": "PASSED"
   },
   "debuginfod.Debuginfod.test_debuginfod_qemu": {
    "duration": 200.7523341178894,
    "oetags": [
     "runqemu"
    ],
    "status": "PASSED"
   },
   "devtool.DevtoolAddTests.test_devtool_add": {
    "duration": 101.13421440124512,
    "status": "PASSED"
   },
   "devtool.DevtoolAddTests.test_devtool_add_binary": {
    "duration": 76.26812553405762,
    "status": "PASSED"
   },
   "devtool.DevtoolAddTests.test_devtool_add_fetch": {
    "duration": 76.45304846763611,
    "status": "PASSED"
   },
   "devtool.DevtoolAddTests.test_devtool_add_fetch_git": {
    "duration": 91.18696570396423,
    "status": "PASSED"
   },
   "devtool.DevtoolAddTests.test_devtool_add_fetch_simple": {
    "duration": 38.581825733184814,
    "status": "PASSED"
   },
   "devtool.DevtoolAddTests.test_devtool_add_git_local": {
    "duration": 48.73348617553711,
    "status": "PASSED"
   },
   "devtool.DevtoolAddTests.test_devtool_add_git_style1": {
    "duration": 44.30531454086304,
    "status": "PASSED"
   },
   "devtool.DevtoolAddTests.test_devtool_add_git_style2": {
    "duration": 45.77078652381897,
    "status": "PASSED"
   },
   "devtool.DevtoolAddTests.test_devtool_add_library": {
    "duration": 68.96552181243896,
    "status": "PASSED"
   },
   "devtool.DevtoolAddTests.test_devtool_add_npm": {
    "duration": 1.0491595268249512,
    "log": "Test needs meta-oe for nodejs\n",
    "status": "SKIPPED"
   },
   "devtool.DevtoolAddTests.test_devtool_add_python_egg_requires": {
    "duration": 30.561023950576782,
    "status": "PASSED"
   },
   "devtool.DevtoolBuildImageTests.test_devtool_build_image": {
    "duration": 392.7174458503723,
    "status": "PASSED"
   },
   "devtool.DevtoolDeployTargetTests.test_devtool_deploy_target": {
    "duration": 330.2065854072571,
    "oetags": [
     "runqemu"
    ],
    "status": "PASSED"
   },
   "devtool.DevtoolExtractTests.test_devtool_extract": {
    "duration": 60.490761518478394,
    "status": "PASSED"
   },
   "devtool.DevtoolExtractTests.test_devtool_extract_virtual": {
    "duration": 47.017828941345215,
    "status": "PASSED"
   },
   "devtool.DevtoolIdeSdkTests.test_devtool_ide_sdk_code_cmake": {
    "duration": 480.4148211479187,
    "oetags": [
     "runqemu"
    ],
    "status": "PASSED"
   },
   "devtool.DevtoolIdeSdkTests.test_devtool_ide_sdk_code_kernel_module": {
    "duration": 1087.7807381153107,
    "oetags": [
     "runqemu"
    ],
    "status": "PASSED"
   },
   "devtool.DevtoolIdeSdkTests.test_devtool_ide_sdk_code_meson": {
    "duration": 202.42551350593567,
    "status": "PASSED"
   },
   "devtool.DevtoolIdeSdkTests.test_devtool_ide_sdk_none_qemu": {
    "duration": 479.67927861213684,
    "oetags": [
     "runqemu"
    ],
    "status": "PASSED"
   },
   "devtool.DevtoolIdeSdkTests.test_devtool_ide_sdk_plugins": {
    "duration": 54.31687951087952,
    "status": "PASSED"
   },
   "devtool.DevtoolIdeSdkTests.test_devtool_ide_sdk_shared_sysroots": {
    "duration": 74.84102487564087,
    "status": "PASSED"
   },
   "devtool.DevtoolModifyTests.test_devtool_buildclean": {
    "duration": 413.9975907802582,
    "status": "PASSED"
   },
   "devtool.DevtoolModifyTests.test_devtool_modify": {
    "duration": 234.20270323753357,
    "status": "PASSED"
   },
   "devtool.DevtoolModifyTests.test_devtool_modify_git": {
    "duration": 102.4808337688446,
    "status": "PASSED"
   },
   "devtool.DevtoolModifyTests.test_devtool_modify_git_crates_subpath": {
    "duration": 106.94806218147278,
    "status": "PASSED"
   },
   "devtool.DevtoolModifyTests.test_devtool_modify_git_no_extract": {
    "duration": 36.24993133544922,
    "status": "PASSED"
   },
   "devtool.DevtoolModifyTests.test_devtool_modify_go": {
    "duration": 51.360145568847656,
    "status": "PASSED"
   },
   "devtool.DevtoolModifyTests.test_devtool_modify_invalid": {
    "duration": 148.26292753219604,
    "status": "PASSED"
   },
   "devtool.DevtoolModifyTests.test_devtool_modify_kernel_cfg_subdirs": {
    "duration": 541.2105445861816,
    "status": "PASSED"
   },
   "devtool.DevtoolModifyTests.test_devtool_modify_localfiles": {
    "duration": 83.76096820831299,
    "status": "PASSED"
   },
   "devtool.DevtoolModifyTests.test_devtool_modify_localfiles_only": {
    "duration": 67.57525730133057,
    "status": "PASSED"
   },
   "devtool.DevtoolModifyTests.test_devtool_modify_multiple_sources": {
    "duration": 819.9777181148529,
    "status": "PASSED"
   },
   "devtool.DevtoolModifyTests.test_devtool_modify_native": {
    "duration": 419.24199891090393,
    "status": "PASSED"
   },
   "devtool.DevtoolModifyTests.test_devtool_modify_nested_gitsm": {
    "duration": 40.40715265274048,
    "status": "PASSED"
   },
   "devtool.DevtoolModifyTests.test_devtool_modify_overrides": {
    "duration": 39.443784952163696,
    "status": "PASSED"
   },
   "devtool.DevtoolModifyTests.test_devtool_modify_virtual": {
    "duration": 38.19674873352051,
    "status": "PASSED"
   },
   "devtool.DevtoolResetTests.test_devtool_reset_all": {
    "duration": 247.6234405040741,
    "status": "PASSED"
   },
   "devtool.DevtoolResetTests.test_devtool_reset_re_plus_plus": {
    "duration": 45.22811508178711,
    "status": "PASSED"
   },
   "devtool.DevtoolTests.test_create_workspace": {
    "duration": 8.505853652954102,
    "status": "PASSED"
   },
   "devtool.DevtoolUpdateTests.test_devtool_finish_modify_git_subdir": {
    "duration": 142.9896981716156,
    "status": "PASSED"
   },
   "devtool.DevtoolUpdateTests.test_devtool_git_submodules": {
    "duration": 213.1156508922577,
    "status": "PASSED"
   },
   "devtool.DevtoolUpdateTests.test_devtool_update_recipe": {
    "duration": 81.9930100440979,
    "status": "PASSED"
   },
   "devtool.DevtoolUpdateTests.test_devtool_update_recipe_append": {
    "duration": 108.90325665473938,
    "status": "PASSED"
   },
   "devtool.DevtoolUpdateTests.test_devtool_update_recipe_append_git": {
    "duration": 112.06540274620056,
    "status": "PASSED"
   },
   "devtool.DevtoolUpdateTests.test_devtool_update_recipe_git": {
    "duration": 63.39816427230835,
    "status": "PASSED"
   },
   "devtool.DevtoolUpdateTests.test_devtool_update_recipe_local_files": {
    "duration": 122.10437321662903,
    "status": "PASSED"
   },
   "devtool.DevtoolUpdateTests.test_devtool_update_recipe_local_files_3": {
    "duration": 52.74512052536011,
    "status": "PASSED"
   },
   "devtool.DevtoolUpdateTests.test_devtool_update_recipe_local_files_subdir": {
    "duration": 47.87312936782837,
    "status": "PASSED"
   },
   "devtool.DevtoolUpdateTests.test_devtool_update_recipe_local_patch_gz": {
    "duration": 51.6122522354126,
    "status": "PASSED"
   },
   "devtool.DevtoolUpdateTests.test_devtool_update_recipe_long_filename": {
    "duration": 60.04061484336853,
    "status": "PASSED"
   },
   "devtool.DevtoolUpdateTests.test_devtool_update_recipe_with_gitignore": {
    "duration": 54.826404333114624,
    "status": "PASSED"
   },
   "devtool.DevtoolUpgradeTests.test_devtool_finish_modify_origlayer": {
    "duration": 137.85141611099243,
    "status": "PASSED"
   },
   "devtool.DevtoolUpgradeTests.test_devtool_finish_modify_otherlayer": {
    "duration": 81.83535265922546,
    "status": "PASSED"
   },
   "devtool.DevtoolUpgradeTests.test_devtool_finish_update_patch": {
    "duration": 90.81468343734741,
    "status": "PASSED"
   },
   "devtool.DevtoolUpgradeTests.test_devtool_finish_upgrade_origlayer": {
    "duration": 96.78406548500061,
    "status": "PASSED"
   },
   "devtool.DevtoolUpgradeTests.test_devtool_finish_upgrade_otherlayer": {
    "duration": 99.65640997886658,
    "status": "PASSED"
   },
   "devtool.DevtoolUpgradeTests.test_devtool_layer_plugins": {
    "duration": 3.6108977794647217,
    "status": "PASSED"
   },
   "devtool.DevtoolUpgradeTests.test_devtool_load_plugin": {
    "duration": 12.331670045852661,
    "status": "PASSED"
   },
   "devtool.DevtoolUpgradeTests.test_devtool_rename": {
    "duration": 94.46179580688477,
    "status": "PASSED"
   },
   "devtool.DevtoolUpgradeTests.test_devtool_upgrade": {
    "duration": 87.37068724632263,
    "status": "PASSED"
   },
   "devtool.DevtoolUpgradeTests.test_devtool_upgrade_all_checksums": {
    "duration": 75.49336457252502,
    "status": "PASSED"
   },
   "devtool.DevtoolUpgradeTests.test_devtool_upgrade_drop_md5sum": {
    "duration": 77.26776075363159,
    "status": "PASSED"
   },
   "devtool.DevtoolUpgradeTests.test_devtool_upgrade_git": {
    "duration": 50.93228197097778,
    "status": "PASSED"
   },
   "devtool.DevtoolUpgradeTests.test_devtool_upgrade_gitsm": {
    "duration": 55.70421361923218,
    "status": "PASSED"
   },
   "devtool.DevtoolUpgradeTests.test_devtool_upgrade_recipe_upgrade_extra_tasks": {
    "duration": 80.97598338127136,
    "status": "PASSED"
   },
   "devtool.DevtoolUpgradeTests.test_devtool_virtual_kernel_modify": {
    "duration": 1040.6573240756989,
    "status": "PASSED"
   },
   "distrodata.Distrodata.test_checkpkg": {
    "duration": 0.0010998249053955078,
    "log": "Skip by the command line argument \"distrodata.Distrodata.test_checkpkg\"\n",
    "status": "SKIPPED"
   },
   "distrodata.Distrodata.test_common_include_recipes": {
    "duration": 101.1750693321228,
    "status": "PASSED"
   },
   "distrodata.Distrodata.test_maintainers": {
    "duration": 106.380859375,
    "status": "PASSED"
   },
   "efibootpartition.GenericEFITest.test_boot_efi": {
    "duration": 201.9341208934784,
    "status": "PASSED"
   },
   "esdk.oeSDKExtSelfTest.test_image_generation_binary_feeds": {
    "duration": 144.8432981967926,
    "status": "PASSED"
   },
   "esdk.oeSDKExtSelfTest.test_install_libraries_headers": {
    "duration": 51.656978130340576,
    "status": "PASSED"
   },
   "externalsrc.ExternalSrc.test_externalsrc_srctree_hash_files": {
    "duration": 71.9208173751831,
    "status": "PASSED"
   },
   "fetch.Dependencies.test_dependencies": {
    "duration": 5.4313929080963135,
    "status": "PASSED"
   },
   "fetch.Fetch.test_git_mirrors": {
    "duration": 90.07888317108154,
    "status": "PASSED"
   },
   "fitimage.FitImagePyTests.test_fitimage_py_conf_extra_mappings_unused_error": {
    "duration": 0.010132074356079102,
    "status": "PASSED"
   },
   "fitimage.FitImagePyTests.test_fitimage_py_conf_loadables": {
    "duration": 0.007752895355224609,
    "status": "PASSED"
   },
   "fitimage.FitImagePyTests.test_fitimage_py_conf_mappings": {
    "duration": 0.007079362869262695,
    "status": "PASSED"
   },
   "fitimage.FitImagePyTests.test_fitimage_py_conf_mappings_unused_error": {
    "duration": 0.0065424442291259766,
    "status": "PASSED"
   },
   "fitimage.FitImagePyTests.test_fitimage_py_conf_mappings_with_alias": {
    "duration": 0.006867408752441406,
    "status": "PASSED"
   },
   "fitimage.FitImagePyTests.test_fitimage_py_conf_os": {
    "duration": 0.0062906742095947266,
    "status": "PASSED"
   },
   "fitimage.FitImagePyTests.test_fitimage_py_default": {
    "duration": 0.005882740020751953,
    "status": "PASSED"
   },
   "fitimage.FitImagePyTests.test_fitimage_py_default_dtb": {
    "duration": 0.00591731071472168,
    "status": "PASSED"
   },
   "fitimage.KernelFitImageRecipeTests.test_fit_image": {
    "duration": 97.93004488945007,
    "status": "PASSED"
   },
   "fitimage.KernelFitImageRecipeTests.test_fit_image_ext_dtb_dtbo": {
    "duration": 47.95639181137085,
    "status": "PASSED"
   },
   "fitimage.KernelFitImageRecipeTests.test_fit_image_sign_initramfs": {
    "duration": 112.33739256858826,
    "status": "PASSED"
   },
   "fitimage.KernelFitImageRecipeTests.test_fit_image_sign_initramfs_bundle": {
    "duration": 555.1123797893524,
    "status": "PASSED"
   },
   "fitimage.KernelFitImageRecipeTests.test_get_compatible_from_dtb": {
    "duration": 24.74389123916626,
    "status": "PASSED"
   },
   "fitimage.KernelFitImageRecipeTests.test_sign_fit_image_configurations": {
    "duration": 60.36698389053345,
    "status": "PASSED"
   },
   "fitimage.KernelFitImageRecipeTests.test_sign_fit_image_individual": {
    "duration": 54.546241998672485,
    "status": "PASSED"
   },
   "fitimage.KernelFitImageRecipeTests.test_vendored_dtb_with_kernel_dtbvendored": {
    "duration": 52.92380690574646,
    "status": "PASSED"
   },
   "fitimage.KernelFitImageRecipeTests.test_vendored_dtb_without_kernel_dtbvendored": {
    "duration": 50.93116021156311,
    "status": "PASSED"
   },
   "fitimage.UBootFitImageTests.test_sign_cascaded_uboot_fit_image": {
    "duration": 1.055812120437622,
    "log": "MACHINE=qemux86-64 does not provide capability _cap_spl_dtb\n",
    "status": "SKIPPED"
   },
   "fitimage.UBootFitImageTests.test_sign_standalone_uboot_atf_tee_fit_image": {
    "duration": 0.8531284332275391,
    "log": "MACHINE=qemux86-64 does not provide capability _cap_spl_dtb\n",
    "status": "SKIPPED"
   },
   "fitimage.UBootFitImageTests.test_sign_standalone_uboot_fit_image": {
    "duration": 0.8566291332244873,
    "log": "MACHINE=qemux86-64 does not provide capability _cap_spl_dtb\n",
    "status": "SKIPPED"
   },
   "fitimage.UBootFitImageTests.test_sign_uboot_fit_image_without_spl": {
    "duration": 196.15851998329163,
    "status": "PASSED"
   },
   "fitimage.UBootFitImageTests.test_sign_uboot_kernel_individual": {
    "duration": 105.09437322616577,
    "status": "PASSED"
   },
   "fitimage.UBootFitImageTests.test_uboot_atf_tee_fit_image": {
    "duration": 1.1952247619628906,
    "log": "MACHINE=qemux86-64 does not provide capability _cap_atf_tee\n",
    "status": "SKIPPED"
   },
   "fitimage.UBootFitImageTests.test_uboot_fit_image": {
    "duration": 51.14134097099304,
    "status": "PASSED"
   },
   "gdbserver.GdbServerTest.test_gdb_server": {
    "duration": 117.65050387382507,
    "status": "PASSED"
   },
   "gitarchivetests.GitArchiveTests.test_create_first_test_tag": {
    "duration": 1.3114476203918457,
    "status": "PASSED"
   },
   "gitarchivetests.GitArchiveTests.test_create_second_test_tag": {
    "duration": 1.2696552276611328,
    "status": "PASSED"
   },
   "gitarchivetests.GitArchiveTests.test_get_revs_on_branch": {
    "duration": 0.6347172260284424,
    "status": "PASSED"
   },
   "gitarchivetests.GitArchiveTests.test_get_tags_with_only_local_tag": {
    "duration": 0.7002229690551758,
    "status": "PASSED"
   },
   "gitarchivetests.GitArchiveTests.test_get_tags_without_valid_remote": {
    "duration": 1.342618465423584,
    "status": "PASSED"
   },
   "gitarchivetests.GitArchiveTests.test_get_tags_without_valid_remote_and_wrong_url": {
    "duration": 0.6917543411254883,
    "status": "PASSED"
   },
   "gotoolchain.oeGoToolchainSelfTest.test_go_dep_build": {
    "duration": 2.954728364944458,
    "status": "PASSED"
   },
   "image_typedep.ImageTypeDepTests.test_conversion_typedep_added": {
    "duration": 45.07206678390503,
    "status": "PASSED"
   },
   "imagefeatures.ImageFeatures.test_all_users_can_connect_via_ssh_without_password": {
    "duration": 254.8737370967865,
    "oetags": [
     "runqemu"
    ],
    "status": "PASSED"
   },
   "imagefeatures.ImageFeatures.test_bmap": {
    "duration": 63.13097596168518,
    "status": "PASSED"
   },
   "imagefeatures.ImageFeatures.test_empty_image": {
    "duration": 42.34391188621521,
    "status": "PASSED"
   },
   "imagefeatures.ImageFeatures.test_hypervisor_fmts": {
    "duration": 76.07072925567627,
    "status": "PASSED"
   },
   "imagefeatures.ImageFeatures.test_image_fstypes": {
    "duration": 127.95808219909668,
    "status": "PASSED"
   },
   "imagefeatures.ImageFeatures.test_image_gen_debugfs": {
    "duration": 73.57537341117859,
    "status": "PASSED"
   },
   "imagefeatures.ImageFeatures.test_long_chain_conversion": {
    "duration": 56.062268018722534,
    "status": "PASSED"
   },
   "imagefeatures.ImageFeatures.test_mandb": {
    "duration": 101.07441902160645,
    "status": "PASSED"
   },
   "imagefeatures.ImageFeatures.test_no_busybox_base_utils": {
    "duration": 38.19872450828552,
    "status": "PASSED"
   },
   "imagefeatures.ImageFeatures.test_non_root_user_can_connect_via_ssh_without_password": {
    "duration": 100.50306749343872,
    "oetags": [
     "runqemu"
    ],
    "status": "PASSED"
   },
   "imagefeatures.ImageFeatures.test_useradd_static": {
    "duration": 92.40900683403015,
    "status": "PASSED"
   },
   "imagefeatures.ImageFeatures.test_wayland_support_in_image": {
    "duration": 144.4660987854004,
    "status": "PASSED"
   },
   "incompatible_lic.IncompatibleLicensePerImageTests.test_bash_and_license": {
    "duration": 91.70432114601135,
    "status": "PASSED"
   },
   "incompatible_lic.IncompatibleLicensePerImageTests.test_bash_default": {
    "duration": 69.43687868118286,
    "status": "PASSED"
   },
   "incompatible_lic.IncompatibleLicensePerImageTests.test_bash_license_exceptions": {
    "duration": 56.01749277114868,
    "status": "PASSED"
   },
   "incompatible_lic.IncompatibleLicensePerImageTests.test_bash_or_license": {
    "duration": 48.497637033462524,
    "status": "PASSED"
   },
   "incompatible_lic.IncompatibleLicensePerImageTests.test_spdx_exception": {
    "duration": 118.49732565879822,
    "status": "PASSED"
   },
   "incompatible_lic.IncompatibleLicenseTestObsolete.test_incompatible_alias_spdx_license": {
    "duration": 9.957627058029175,
    "status": "PASSED"
   },
   "incompatible_lic.IncompatibleLicenseTestObsolete.test_incompatible_alias_spdx_license_alias": {
    "duration": 10.19727897644043,
    "status": "PASSED"
   },
   "incompatible_lic.IncompatibleLicenseTestObsolete.test_incompatible_alias_spdx_license_alias_wildcard": {
    "duration": 11.482457637786865,
    "status": "PASSED"
   },
   "incompatible_lic.IncompatibleLicenseTestObsolete.test_incompatible_alias_spdx_license_wildcard": {
    "duration": 10.837847709655762,
    "status": "PASSED"
   },
   "incompatible_lic.IncompatibleLicenseTestObsolete.test_incompatible_all_licenses_wildcard": {
    "duration": 10.213587045669556,
    "status": "PASSED"
   },
   "incompatible_lic.IncompatibleLicenseTestObsolete.test_incompatible_spdx_license_alias_wildcard": {
    "duration": 10.237444162368774,
    "status": "PASSED"
   },
   "incompatible_lic.IncompatibleLicenseTestObsolete.test_incompatible_spdx_licenses_wildcard": {
    "duration": 10.2155442237854,
    "status": "PASSED"
   },
   "incompatible_lic.IncompatibleLicenseTests.test_incompatible_nonspdx_license": {
    "duration": 28.40712308883667,
    "status": "PASSED"
   },
   "incompatible_lic.IncompatibleLicenseTests.test_incompatible_spdx_license": {
    "duration": 29.994291305541992,
    "status": "PASSED"
   },
   "incompatible_lic.IncompatibleLicenseTests.test_incompatible_spdx_license_alias": {
    "duration": 4.674727916717529,
    "status": "PASSED"
   },
   "incompatible_lic.IncompatibleLicenseTests.test_incompatible_spdx_license_wildcard": {
    "duration": 30.582855939865112,
    "status": "PASSED"
   },
   "incompatible_lic.IncompatibleLicenseTests.test_incompatible_spdx_licenses": {
    "duration": 26.492029905319214,
    "status": "PASSED"
   },
   "incompatible_lic.NoGPL3InImagesTests.test_core_image_full_cmdline_weston": {
    "duration": 247.12099838256836,
    "status": "PASSED"
   },
   "incompatible_lic.NoGPL3InImagesTests.test_core_image_minimal": {
    "duration": 63.415910959243774,
    "status": "PASSED"
   },
   "install.InstallTests.test_gstreamer_plugins": {
    "duration": 265.78633308410645,
    "status": "PASSED"
   },
   "install.InstallTests.test_linux_firmware": {
    "duration": 193.88282084465027,
    "status": "PASSED"
   },
   "install.InstallTests.test_linux_modules": {
    "duration": 122.25035572052002,
    "status": "PASSED"
   },
   "install.InstallTests.test_perl": {
    "duration": 101.40103816986084,
    "status": "PASSED"
   },
   "install.InstallTests.test_python": {
    "duration": 110.05210471153259,
    "status": "PASSED"
   },
   "intercept.GitCheck.test_git_intercept": {
    "duration": 35.216938734054565,
    "status": "PASSED"
   },
   "kerneldevelopment.KernelDev.test_apply_patches": {
    "duration": 212.3889286518097,
    "status": "PASSED"
   },
   "kernelmodulesplit.KernelModuleSplit.test_cross_recipe_module_dependency": {
    "duration": 16.49331831932068,
    "status": "PASSED"
   },
   "layerappend.LayerAppendTests.test_layer_appends": {
    "duration": 41.29680347442627,
    "log": "testtools.testresult.real._StringException: Traceback (most recent call last):\n  File \"/srv/pokybuild/yocto-worker/oe-selftest-fedora/build/layers/openembedded-core/meta/lib/oeqa/selftest/cases/layerappend.py\", line 88, in test_layer_appends\n    bitbake(\"layerappendtest\")\n    ~~~~~~~^^^^^^^^^^^^^^^^^^^\n  File \"/srv/pokybuild/yocto-worker/oe-selftest-fedora/build/layers/openembedded-core/meta/lib/oeqa/utils/commands.py\", line 236, in bitbake\n    return runCmd(cmd, ignore_status, timeout, output_log=output_log, **options)\n  File \"/srv/pokybuild/yocto-worker/oe-selftest-fedora/build/layers/openembedded-core/meta/lib/oeqa/utils/commands.py\", line 214, in runCmd\n    raise AssertionError(\"Command '%s' returned non-zero exit status %d:\\n%s\" % (command, result.status, exc_output))\nAssertionError: Command 'bitbake  layerappendtest' returned non-zero exit status 1:\nNOTE: Reconnecting to bitbake server...\nLoading cache...done.\nLoaded 2077 entries from dependency cache.\nNOTE: Resolving any missing task queue dependencies\n\nBuild Configuration:\nBB_VERSION           = \"2.19.0\"\nBUILD_SYS            = \"x86_64-linux\"\nNATIVELSBSTRING      = \"universal\"\nTARGET_SYS           = \"x86_64-poky-linux\"\nMACHINE              = \"qemux86-64\"\nSDKMACHINE           = \"x86_64\"\nDISTRO               = \"poky\"\nDISTRO_VERSION       = \"6.0.99+snapshot-7e53577eb667c8eb2691f72787831b6a93bb4b6e\"\nTUNE_FEATURES        = \"m64 x86-64-v3\"\nmeta                 = \"mathieu/master-next-tests:7e53577eb667c8eb2691f72787831b6a93bb4b6e\"\nmeta-yocto-bsp       \nmeta-poky            = \"contrib/mathieu/master-next:bcd8094dcb24a7c426ba4f77dcded0c12c06cc7e\"\nmeta-selftest        = \"master:2c5aa3e7d47a877c4e6b8a010c1cfebb4f5c8a30\"\nmeta-layertest0      \nmeta-layertest1      \nmeta-layertest2      = \"mathieu/master-next-tests:7e53577eb667c8eb2691f72787831b6a93bb4b6e\"\n\nInitialising tasks...NOTE: The /proc/pressure files can't be read. Continuing build without monitoring pressure\nSstate summary: Wanted 100 Local 99 Mirrors 0 Missed 1 Current 136 (99% match, 99% complete)\ndone.\nNOTE: Executing Tasks\nNOTE: Running setscene task 196 of 236 (/srv/pokybuild/yocto-worker/oe-selftest-fedora/build/layers/openembedded-core/meta-layertest0/recipes-test/layerappendtest.bb:do_populate_lic_setscene)\nNOTE: Running setscene task 212 of 236 (/srv/pokybuild/yocto-worker/oe-selftest-fedora/build/layers/openembedded-core/meta-layertest0/recipes-test/layerappendtest.bb:do_package_write_rpm_setscene)\nNOTE: Running setscene task 218 of 236 (/srv/pokybuild/yocto-worker/oe-selftest-fedora/build/layers/openembedded-core/meta-layertest0/recipes-test/layerappendtest.bb:do_create_package_spdx_setscene)\nWARNING: /srv/pokybuild/yocto-worker/oe-selftest-fedora/build/layers/openembedded-core/meta-layertest0/recipes-test/layerappendtest.bb:2 has a lack of whitespace around the assignment: 'LICENSE=\"CLOSED\"'\nWARNING: /srv/pokybuild/yocto-worker/oe-selftest-fedora/build/layers/openembedded-core/meta-layertest0/recipes-test/layerappendtest.bb:2 has a lack of whitespace around the assignment: 'LICENSE=\"CLOSED\"'\nWARNING: /srv/pokybuild/yocto-worker/oe-selftest-fedora/build/layers/openembedded-core/meta-layertest0/recipes-test/layerappendtest.bb:2 has a lack of whitespace around the assignment: 'LICENSE=\"CLOSED\"'\nWARNING: layerappendtest: LICENSE is using \"CLOSED\", which is deprecated. Convert to using a license ref pointing to an actual license file, e.g.\nLICENSE = \"LicenseRef-layerappendtest-CLOSED\"\nWARNING: layerappendtest: LICENSE is using \"CLOSED\", which is deprecated. Convert to using a license ref pointing to an actual license file, e.g.\nLICENSE = \"LicenseRef-layerappendtest-CLOSED\"\nWARNING: layerappendtest: LICENSE is using \"CLOSED\", which is deprecated. Convert to using a license ref pointing to an actual license file, e.g.\nLICENSE = \"LicenseRef-layerappendtest-CLOSED\"\nNOTE: recipe layerappendtest-1.0-r0: task do_populate_lic_setscene: Started\nNOTE: recipe layerappendtest-1.0-r0: task do_create_package_spdx_setscene: Started\nNOTE: recipe layerappendtest-1.0-r0: task do_package_write_rpm_setscene: Started\nNOTE: recipe layerappendtest-1.0-r0: task do_populate_lic_setscene: Succeeded\nNOTE: recipe layerappendtest-1.0-r0: task do_create_package_spdx_setscene: Succeeded\nNOTE: recipe layerappendtest-1.0-r0: task do_package_write_rpm_setscene: Succeeded\nNOTE: Running setscene task 230 of 236 (/srv/pokybuild/yocto-worker/oe-selftest-fedora/build/layers/openembedded-core/meta-layertest0/recipes-test/layerappendtest.bb:do_create_spdx_setscene)\nWARNING: /srv/pokybuild/yocto-worker/oe-selftest-fedora/build/layers/openembedded-core/meta-layertest0/recipes-test/layerappendtest.bb:2 has a lack of whitespace around the assignment: 'LICENSE=\"CLOSED\"'\nWARNING: layerappendtest: LICENSE is using \"CLOSED\", which is deprecated. Convert to using a license ref pointing to an actual license file, e.g.\nLICENSE = \"LicenseRef-layerappendtest-CLOSED\"\nNOTE: recipe layerappendtest-1.0-r0: task do_create_spdx_setscene: Started\nNOTE: recipe layerappendtest-1.0-r0: task do_create_spdx_setscene: Succeeded\nNOTE: Running setscene task 232 of 236 (/srv/pokybuild/yocto-worker/oe-selftest-fedora/build/layers/openembedded-core/meta-layertest0/recipes-test/layerappendtest.bb:do_packagedata_setscene)\nNOTE: Running setscene task 233 of 236 (/srv/pokybuild/yocto-worker/oe-selftest-fedora/build/layers/openembedded-core/meta-layertest0/recipes-test/layerappendtest.bb:do_populate_sysroot_setscene)\nWARNING: /srv/pokybuild/yocto-worker/oe-selftest-fedora/build/layers/openembedded-core/meta-layertest0/recipes-test/layerappendtest.bb:2 has a lack of whitespace around the assignment: 'LICENSE=\"CLOSED\"'\nWARNING: /srv/pokybuild/yocto-worker/oe-selftest-fedora/build/layers/openembedded-core/meta-layertest0/recipes-test/layerappendtest.bb:2 has a lack of whitespace around the assignment: 'LICENSE=\"CLOSED\"'\nWARNING: layerappendtest: LICENSE is using \"CLOSED\", which is deprecated. Convert to using a license ref pointing to an actual license file, e.g.\nLICENSE = \"LicenseRef-layerappendtest-CLOSED\"\nWARNING: layerappendtest: LICENSE is using \"CLOSED\", which is deprecated. Convert to using a license ref pointing to an actual license file, e.g.\nLICENSE = \"LicenseRef-layerappendtest-CLOSED\"\nNOTE: recipe layerappendtest-1.0-r0: task do_populate_sysroot_setscene: Started\nNOTE: recipe layerappendtest-1.0-r0: task do_packagedata_setscene: Started\nNOTE: recipe layerappendtest-1.0-r0: task do_packagedata_setscene: Succeeded\nNOTE: recipe layerappendtest-1.0-r0: task do_populate_sysroot_setscene: Succeeded\nNOTE: Running setscene task 234 of 236 (/srv/pokybuild/yocto-worker/oe-selftest-fedora/build/layers/openembedded-core/meta-layertest0/recipes-test/layerappendtest.bb:do_package_setscene)\nWARNING: /srv/pokybuild/yocto-worker/oe-selftest-fedora/build/layers/openembedded-core/meta-layertest0/recipes-test/layerappendtest.bb:2 has a lack of whitespace around the assignment: 'LICENSE=\"CLOSED\"'\nWARNING: layerappendtest: LICENSE is using \"CLOSED\", which is deprecated. Convert to using a license ref pointing to an actual license file, e.g.\nLICENSE = \"LicenseRef-layerappendtest-CLOSED\"\nNOTE: recipe layerappendtest-1.0-r0: task do_package_setscene: Started\nNOTE: recipe layerappendtest-1.0-r0: task do_package_setscene: Succeeded\nNOTE: Running setscene task 236 of 236 (/srv/pokybuild/yocto-worker/oe-selftest-fedora/build/layers/openembedded-core/meta-layertest0/recipes-test/layerappendtest.bb:do_recipe_qa_setscene)\nWARNING: /srv/pokybuild/yocto-worker/oe-selftest-fedora/build/layers/openembedded-core/meta-layertest0/recipes-test/layerappendtest.bb:2 has a lack of whitespace around the assignment: 'LICENSE=\"CLOSED\"'\nWARNING: layerappendtest: LICENSE is using \"CLOSED\", which is deprecated. Convert to using a license ref pointing to an actual license file, e.g.\nLICENSE = \"LicenseRef-layerappendtest-CLOSED\"\nNOTE: recipe layerappendtest-1.0-r0: task do_recipe_qa_setscene: Started\nNOTE: recipe layerappendtest-1.0-r0: task do_recipe_qa_setscene: Succeeded\nNOTE: Setscene tasks completed\nNOTE: Running task 773 of 774 (/srv/pokybuild/yocto-worker/oe-selftest-fedora/build/layers/openembedded-core/meta-layertest0/recipes-test/layerappendtest.bb:do_package_qa)\nWARNING: /srv/pokybuild/yocto-worker/oe-selftest-fedora/build/layers/openembedded-core/meta-layertest0/recipes-test/layerappendtest.bb:2 has a lack of whitespace around the assignment: 'LICENSE=\"CLOSED\"'\nWARNING: layerappendtest: LICENSE is using \"CLOSED\", which is deprecated. Convert to using a license ref pointing to an actual license file, e.g.\nLICENSE = \"LicenseRef-layerappendtest-CLOSED\"\nNOTE: recipe layerappendtest-1.0-r0: task do_package_qa: Started\nERROR: layerappendtest-1.0-r0 do_package_qa: Error executing a python function in exec_func_python() autogenerated:\n\nThe stack trace of python calls that resulted in this exception/failure was:\nFile: 'exec_func_python() autogenerated', lineno: 2, function: <module>\n     0001:\n *** 0002:do_package_qa(d)\n     0003:\nFile: '/srv/pokybuild/yocto-worker/oe-selftest-fedora/build/layers/openembedded-core/meta/classes-global/insane.bbclass', lineno: 1116, function: do_package_qa\n     1112:python do_package_qa () {\n     1113:    import oe.packagedata\n     1114:\n     1115:    # Check for obsolete license references in main LICENSE (packages are checked below for any changes)\n *** 1116:    main_licenses = oe.license.list_licenses(d.getVar('LICENSE'), d)\n     1117:    obsolete = set(oe.license.obsolete_license_list()) & main_licenses\n     1118:    if obsolete:\n     1119:        oe.qa.handle_error(\"obsolete-license\", \"Recipe LICENSE includes obsolete licenses %s\" % ' '.join(obsolete), d)\n     1120:\nFile: '/srv/pokybuild/yocto-worker/oe-selftest-fedora/build/layers/openembedded-core/meta/lib/oe/license.py', lineno: 238, function: list_licenses\n     0234:\n     0235:        for child in node.children:\n     0236:            walk_license(child)\n     0237:\n *** 0238:    walk_license(parse_legacy_license(d, licensestr))\n     0239:    return set(licenses)\n     0240:\n     0241:def return_spdx(d, license):\n     0242:    \"\"\"\nFile: '/srv/pokybuild/yocto-worker/oe-selftest-fedora/build/layers/openembedded-core/meta/lib/oe/license.py', lineno: 235, function: walk_license\n     0231:        nonlocal licenses\n     0232:        if isinstance(node, oe.spdx_license.Identifier):\n     0233:            licenses.append(node.ident)\n     0234:\n *** 0235:        for child in node.children:\n     0236:            walk_license(child)\n     0237:\n     0238:    walk_license(parse_legacy_license(d, licensestr))\n     0239:    return set(licenses)\nException: AttributeError: 'NoneType' object has no attribute 'children'\n\nERROR: Logfile of failure stored in: /srv/pokybuild/yocto-worker/oe-selftest-fedora/build/build-st-31253/tmp/work/x86-64-v3-poky-linux/layerappendtest/1.0/temp/log.do_package_qa.44882\nNOTE: recipe layerappendtest-1.0-r0: task do_package_qa: Failed\nERROR: Task (/srv/pokybuild/yocto-worker/oe-selftest-fedora/build/layers/openembedded-core/meta-layertest0/recipes-test/layerappendtest.bb:do_package_qa) failed with exit code '1'\nNOTE: Tasks Summary: Attempted 773 tasks of which 772 didn't need to be rerun and 1 failed.\nNOTE: The errors for this build are stored in /srv/pokybuild/yocto-worker/oe-selftest-fedora/build/build-st-31253/tmp/log/error-report/error_report_20260717133321.txt\nYou can send the errors to a reports server by running:\n  send-error-report /srv/pokybuild/yocto-worker/oe-selftest-fedora/build/build-st-31253/tmp/log/error-report/error_report_20260717133321.txt [-s server]\nNOTE: The contents of these logs will be posted in public if you use the above command with the default server. Please ensure you remove any identifying or proprietary information when prompted before sending.\n\nSummary: 1 task failed:\n  /srv/pokybuild/yocto-worker/oe-selftest-fedora/build/layers/openembedded-core/meta-layertest0/recipes-test/layerappendtest.bb:do_package_qa\n    log: /srv/pokybuild/yocto-worker/oe-selftest-fedora/build/build-st-31253/tmp/work/x86-64-v3-poky-linux/layerappendtest/1.0/temp/log.do_package_qa.44882\nSummary: There were 18 WARNING messages.\nSummary: There was 1 ERROR message, returning a non-zero exit code.\nWARNING: /srv/pokybuild/yocto-worker/oe-selftest-fedora/build/buildtools/sysroots/x86_64-pokysdk-linux/usr/lib/python3.13/unittest/case.py:597: RuntimeWarning: TestResult has no addDuration method\n  warnings.warn(\"TestResult has no addDuration method\",\n\n\nStderr:\n2026-07-17 12:54:54,376 - oe-selftest - INFO - Adding: \"include selftest.inc\" in /srv/pokybuild/yocto-worker/oe-selftest-fedora/build/build-st-31253/conf/local.conf\n2026-07-17 12:54:54,376 - oe-selftest - INFO - Adding: \"include bblayers.inc\" in bblayers.conf\n/srv/pokybuild/yocto-worker/oe-selftest-fedora/build/buildtools/sysroots/x86_64-pokysdk-linux/usr/lib/python3.13/unittest/case.py:597: RuntimeWarning: TestResult has no addDuration method\n  warnings.warn(\"TestResult has no addDuration method\",\n\n/srv/pokybuild/yocto-worker/oe-selftest-fedora/build/buildtools/sysroots/x86_64-pokysdk-linux/usr/lib/python3.13/unittest/case.py:597: RuntimeWarning: TestResult has no addDuration method\n  warnings.warn(\"TestResult has no addDuration method\",\n\n/srv/pokybuild/yocto-worker/oe-selftest-fedora/build/buildtools/sysroots/x86_64-pokysdk-linux/usr/lib/python3.13/unittest/case.py:597: RuntimeWarning: TestResult has no addDuration method\n  warnings.warn(\"TestResult has no addDuration method\",\n\n/srv/pokybuild/yocto-worker/oe-selftest-fedora/build/buildtools/sysroots/x86_64-pokysdk-linux/usr/lib/python3.13/unittest/case.py:597: RuntimeWarning: TestResult has no addDuration method\n  warnings.warn(\"TestResult has no addDuration method\",\n\n/srv/pokybuild/yocto-worker/oe-selftest-fedora/build/buildtools/sysroots/x86_64-pokysdk-linux/usr/lib/python3.13/unittest/case.py:597: RuntimeWarning: TestResult has no addDuration method\n  warnings.warn(\"TestResult has no addDuration method\",\n\n/srv/pokybuild/yocto-worker/oe-selftest-fedora/build/buildtools/sysroots/x86_64-pokysdk-linux/usr/lib/python3.13/unittest/case.py:597: RuntimeWarning: TestResult has no addDuration method\n  warnings.warn(\"TestResult has no addDuration method\",\n\n/srv/pokybuild/yocto-worker/oe-selftest-fedora/build/buildtools/sysroots/x86_64-pokysdk-linux/usr/lib/python3.13/unittest/case.py:597: RuntimeWarning: TestResult has no addDuration method\n  warnings.warn(\"TestResult has no addDuration method\",\n\n/srv/pokybuild/yocto-worker/oe-selftest-fedora/build/buildtools/sysroots/x86_64-pokysdk-linux/usr/lib/python3.13/unittest/case.py:597: RuntimeWarning: TestResult has no addDuration method\n  warnings.warn(\"TestResult has no addDuration method\",\n\nLoading cache...done.\nParsing recipes...done.\nrootfs file: /srv/pokybuild/yocto-worker/oe-selftest-fedora/build/build-st-31253/tmp/deploy/images/qemux86-64/oe-selftest-image-qemux86-64.rootfs.ext4.zst\nQemu log file: /srv/pokybuild/yocto-worker/oe-selftest-fedora/build/build-st-31253/tmp/work/qemux86_64-poky-linux/oe-selftest-image/1.0/testimage/qemu_boot_log.20260717131133\nSSH log file: /srv/pokybuild/yocto-worker/oe-selftest-fedora/build/build-st-31253/tmp/work/qemux86_64-poky-linux/oe-selftest-image/1.0/testimage/ssh_target_log.20260717131133\nUsing kvm for runqemu\nQMP Available for connection at /srv/pokybuild/yocto-worker/oe-selftest-fedora/build/build-st-31253/tmp/.nnj1eh8x\nCreated listening socket for qemu serial console on: 127.0.0.1:48959\nCreated listening socket for qemu serial console on: 127.0.0.1:52841\nlaunchcmd=runqemu snapshot kvm  qemux86-64 /srv/pokybuild/yocto-worker/oe-selftest-fedora/build/build-st-31253/tmp/deploy/images/qemux86-64/oe-selftest-image-qemux86-64.rootfs.ext4.zst tcpserial=48959:52841 bootparams=\" printk.time=1\" qemuparams=\"-pidfile /srv/pokybuild/yocto-worker/oe-selftest-fedora/build/build-st-31253/pidfile_31253  -S -qmp unix:./.972mvi4b,server,wait -qmp unix:./.nnj1eh8x,server,nowait\"\nrunqemu started, pid is 39773\nwaiting at most 300 seconds for qemu pid (07/17/26 13:13:59)\nQMP Initializing to /srv/pokybuild/yocto-worker/oe-selftest-fedora/build/build-st-31253/tmp/.972mvi4b\nQMP Connecting to /srv/pokybuild/yocto-worker/oe-selftest-fedora/build/build-st-31253/tmp/.972mvi4b\nQMP connected to QEMU at 07/17/26 13:14:00 and took 0.89 seconds\nQMP released QEMU at 07/17/26 13:14:00 and took 0.13 seconds from connect\nqemu started in 1.02 seconds - qemu procces pid is 40308 (07/17/26 13:14:00)\nqemu cmdline used:\n/srv/pokybuild/yocto-worker/oe-selftest-fedora/build/build-st-31253/tmp/work/x86_64-linux/qemu-helper-native/1.0/recipe-sysroot-native/usr/bin/qemu-system-x86_64 -device virtio-net-pci,netdev=net0,mac=52:54:00:12:34:02 -netdev tap,id=net0,ifname=tap0,script=no,downscript=no -object rng-random,filename=/dev/urandom,id=rng0 -device virtio-rng-pci,rng=rng0 -drive file=/home/pokybuild/tmp/oe-selftest-image-qemux86-64.rootfs-20260717131019.ext4.39773,if=virtio,format=raw -usb -device usb-tablet -usb -device usb-kbd -cpu Skylake-Client -machine q35,i8042=off -smp 4 -enable-kvm -m 256 -serial tcp:127.0.0.1:48959,nodelay=on -serial tcp:127.0.0.1:52841,nodelay=on -pidfile /srv/pokybuild/yocto-worker/oe-selftest-fedora/build/build-st-31253/pidfile_31253 -S -qmp unix:./.972mvi4b,server,wait -qmp unix:./.nnj1eh8x,server,nowait -vnc unix:/tmp/qemu-tap-locks/tap0.vnc-socket -kernel /srv/pokybuild/yocto-worker/oe-selftest-fedora/build/build-st-31253/tmp/deploy/images/qemux86-64/bzImage -append root=/dev/vda rw  ip=192.168.7.2::192.168.7.1:255.255.255.0::eth0:off:8.8.8.8 net.ifnames=0 console=ttyS0 console=ttyS1 oprofile.timer=1 tsc=reliable no_timer_check rcupdate.rcu_expedited=1 swiotlb=0  printk.time=1 \nTarget IP: 192.168.7.2\nServer IP: 192.168.7.1\nStarting logging thread\nStarting thread event loop\nConnection request received\nSetting connection established event\nOutput from runqemu:\nrunqemu - INFO - Decompressing /srv/pokybuild/yocto-worker/oe-selftest-fedora/build/build-st-31253/tmp/deploy/images/qemux86-64/oe-selftest-image-qemux86-64.rootfs.ext4.zst to /srv/pokybuild/yocto-worker/oe-selftest-fedora/build/build-st-31253/tmp/deploy/images/qemux86-64/oe-selftest-image-qemux86-64.rootfs-20260717131019.ext4\n/srv/pokybuild/yocto-worker/oe-selftest-fedora/build/build-st-31253/tmp/deploy/images/qemux86-64/oe-selftest-image-qemux86-64.rootfs-20260717131019.ext4.zst: 67108864 bytes \nrunqemu - INFO - Continuing with the following parameters:\nKERNEL: [/srv/pokybuild/yocto-worker/oe-selftest-fedora/build/build-st-31253/tmp/deploy/images/qemux86-64/bzImage]\nMACHINE: [qemux86-64]\nFSTYPE: [ext4]\nROOTFS: [/srv/pokybuild/yocto-worker/oe-selftest-fedora/build/build-st-31253/tmp/deploy/images/qemux86-64/oe-selftest-image-qemux86-64.rootfs-20260717131019.ext4]\nSNAPSHOT: [Enabled. Changes on rootfs won't be kept after QEMU shutdown.]\nCONFFILE: [/srv/pokybuild/yocto-worker/oe-selftest-fedora/build/build-st-31253/tmp/deploy/images/qemux86-64/oe-selftest-image-qemux86-64.rootfs.qemuboot.conf]\n\nrunqemu - INFO - Using preconfigured tap device tap0\nrunqemu - INFO - If this is not intended, touch /tmp/qemu-tap-locks/tap0.skip to make runqemu skip tap0.\nrunqemu - INFO - Network configuration: ip=192.168.7.2::192.168.7.1:255.255.255.0::eth0:off:8.8.8.8 net.ifnames=0\nrunqemu - INFO - Copying rootfs to /home/pokybuild/tmp/oe-selftest-image-qemux86-64.rootfs-20260717131019.ext4.39773\nrunqemu - INFO - Copy done in 0.09908151626586914 seconds\nrunqemu - INFO - Using VNC server at unix:/tmp/qemu-tap-locks/tap0.vnc-socket for graphical output\nrunqemu - INFO - Running /srv/pokybuild/yocto-worker/oe-selftest-fedora/build/build-st-31253/tmp/work/x86_64-linux/qemu-helper-native/1.0/recipe-sysroot-native/usr/bin/qemu-system-x86_64 -device virtio-net-pci,netdev=net0,mac=52:54:00:12:34:02 -netdev tap,id=net0,ifname=tap0,script=no,downscript=no -object rng-random,filename=/dev/urandom,id=rng0 -device virtio-rng-pci,rng=rng0 -drive file=/home/pokybuild/tmp/oe-selftest-image-qemux86-64.rootfs-20260717131019.ext4.39773,if=virtio,format=raw -usb -device usb-tablet -usb -device usb-kbd   -cpu Skylake-Client -machine q35,i8042=off -smp 4 -enable-kvm -m 256 -serial tcp:127.0.0.1:48959,nodelay=on -serial tcp:127.0.0.1:52841,nodelay=on  -pidfile /srv/pokybuild/yocto-worker/oe-selftest-fedora/build/build-st-31253/pidfile_31253  -S -qmp unix:./.972mvi4b,server,wait -qmp unix:./.nnj1eh8x,server,nowait -vnc unix:/tmp/qemu-tap-locks/tap0.vnc-socket  -kernel /srv/pokybuild/yocto-worker/oe-selftest-fedora/build/build-st-31253/tmp/deploy/images/qemux86-64/bzImage -append 'root=/dev/vda rw  ip=192.168.7.2::192.168.7.1:255.255.255.0::eth0:off:8.8.8.8 net.ifnames=0 console=ttyS0 console=ttyS1 oprofile.timer=1 tsc=reliable no_timer_check rcupdate.rcu_expedited=1 swiotlb=0  printk.time=1'\n\nrunqemu - INFO - Host uptime: 661225.49\n\n\nWaiting at most 1000 seconds for login banner (07/17/26 13:14:00)\nConnection from 127.0.0.1:55572\nReached login banner in 7.23 seconds (07/17/26 13:14:07)\nLogged in as root in serial console\nWARNING: /srv/pokybuild/yocto-worker/oe-selftest-fedora/build/buildtools/sysroots/x86_64-pokysdk-linux/usr/lib/python3.13/unittest/case.py:597: RuntimeWarning: TestResult has no addDuration method\n  warnings.warn(\"TestResult has no addDuration method\",\n\nWARNING: /srv/pokybuild/yocto-worker/oe-selftest-fedora/build/buildtools/sysroots/x86_64-pokysdk-linux/usr/lib/python3.13/unittest/case.py:597: RuntimeWarning: TestResult has no addDuration method\n  warnings.warn(\"TestResult has no addDuration method\",\n\nWARNING: /srv/pokybuild/yocto-worker/oe-selftest-fedora/build/buildtools/sysroots/x86_64-pokysdk-linux/usr/lib/python3.13/unittest/case.py:597: RuntimeWarning: TestResult has no addDuration method\n  warnings.warn(\"TestResult has no addDuration method\",\n\nWARNING: /srv/pokybuild/yocto-worker/oe-selftest-fedora/build/buildtools/sysroots/x86_64-pokysdk-linux/usr/lib/python3.13/unittest/case.py:597: RuntimeWarning: TestResult has no addDuration method\n  warnings.warn(\"TestResult has no addDuration method\",\n\nWARNING: /srv/pokybuild/yocto-worker/oe-selftest-fedora/build/buildtools/sysroots/x86_64-pokysdk-linux/usr/lib/python3.13/unittest/case.py:597: RuntimeWarning: TestResult has no addDuration method\n  warnings.warn(\"TestResult has no addDuration method\",\n\nWARNING: /srv/pokybuild/yocto-worker/oe-selftest-fedora/build/buildtools/sysroots/x86_64-pokysdk-linux/usr/lib/python3.13/unittest/case.py:597: RuntimeWarning: TestResult has no addDuration method\n  warnings.warn(\"TestResult has no addDuration method\",\n\nWARNING: /srv/pokybuild/yocto-worker/oe-selftest-fedora/build/buildtools/sysroots/x86_64-pokysdk-linux/usr/lib/python3.13/unittest/case.py:597: RuntimeWarning: TestResult has no addDuration method\n  warnings.warn(\"TestResult has no addDuration method\",\n\nWARNING: /srv/pokybuild/yocto-worker/oe-selftest-fedora/build/buildtools/sysroots/x86_64-pokysdk-linux/usr/lib/python3.13/unittest/case.py:597: RuntimeWarning: TestResult has no addDuration method\n  warnings.warn(\"TestResult has no addDuration method\",\n\nWARNING: /srv/pokybuild/yocto-worker/oe-selftest-fedora/build/buildtools/sysroots/x86_64-pokysdk-linux/usr/lib/python3.13/unittest/case.py:597: RuntimeWarning: TestResult has no addDuration method\n  warnings.warn(\"TestResult has no addDuration method\",\n\nWARNING: /srv/pokybuild/yocto-worker/oe-selftest-fedora/build/buildtools/sysroots/x86_64-pokysdk-linux/usr/lib/python3.13/unittest/case.py:597: RuntimeWarning: TestResult has no addDuration method\n  warnings.warn(\"TestResult has no addDuration method\",\n\n",
    "status": "FAILED"
   },
   "liboe.CopyTreeTests.test_copy_hardlink_tree_count": {
    "duration": 0.01606607437133789,
    "status": "PASSED"
   },
   "liboe.CopyTreeTests.test_copy_tree_special": {
    "duration": 0.012965202331542969,
    "status": "PASSED"
   },
   "liboe.CopyTreeTests.test_copy_tree_xattr": {
    "duration": 42.682121992111206,
    "status": "PASSED"
   },
   "liboe.PathTests.test_canonicalize_empty_string_returns_empty_string": {
    "duration": 0.006398439407348633,
    "status": "PASSED"
   },
   "liboe.PathTests.test_canonicalize_empty_token_between_paths_is_dropped": {
    "duration": 0.004967451095581055,
    "status": "PASSED"
   },
   "liboe.PathTests.test_canonicalize_none_returns_empty_string": {
    "duration": 0.004459381103515625,
    "status": "PASSED"
   },
   "liboe.PathTests.test_canonicalize_real_path_returned": {
    "duration": 0.004398345947265625,
    "status": "PASSED"
   },
   "liboe.PathTests.test_canonicalize_trailing_slash_preserved": {
    "duration": 0.004364013671875,
    "status": "PASSED"
   },
   "liboe.PathTests.test_canonicalize_unexpanded_variable_is_skipped": {
    "duration": 0.004376649856567383,
    "status": "PASSED"
   },
   "liboe.PathTests.test_canonicalize_variable_token_dropped_leaving_real_path": {
    "duration": 0.004419565200805664,
    "status": "PASSED"
   },
   "liboe.PathTests.test_is_path_parent_all_paths_must_be_below": {
    "duration": 0.004494667053222656,
    "status": "PASSED"
   },
   "liboe.PathTests.test_is_path_parent_child_is_not_parent_of_its_parent": {
    "duration": 0.004409313201904297,
    "status": "PASSED"
   },
   "liboe.PathTests.test_is_path_parent_direct_child": {
    "duration": 0.004411220550537109,
    "status": "PASSED"
   },
   "liboe.PathTests.test_is_path_parent_no_paths_returns_false": {
    "duration": 0.004331111907958984,
    "status": "PASSED"
   },
   "liboe.PathTests.test_is_path_parent_one_path_outside_fails": {
    "duration": 0.004545927047729492,
    "status": "PASSED"
   },
   "liboe.PathTests.test_is_path_parent_prefix_string_is_not_a_path_parent": {
    "duration": 0.004311323165893555,
    "status": "PASSED"
   },
   "liboe.PathTests.test_is_path_parent_unrelated_path": {
    "duration": 0.004346132278442383,
    "status": "PASSED"
   },
   "liboe.PathTests.test_join_absolute_rhs_is_not_special": {
    "duration": 0.00433039665222168,
    "status": "PASSED"
   },
   "liboe.PathTests.test_join_empty_leading_component_is_absolute": {
    "duration": 0.004336118698120117,
    "status": "PASSED"
   },
   "liboe.PathTests.test_join_pardir_normalised": {
    "duration": 0.004355192184448242,
    "status": "PASSED"
   },
   "liboe.PathTests.test_join_redundant_separators_normalised": {
    "duration": 0.0046901702880859375,
    "status": "PASSED"
   },
   "liboe.PathTests.test_join_two_paths": {
    "duration": 0.004436492919921875,
    "status": "PASSED"
   },
   "liboe.PathTests.test_make_relative_symlink_absolute_becomes_relative_and_resolves": {
    "duration": 0.004816293716430664,
    "status": "PASSED"
   },
   "liboe.PathTests.test_make_relative_symlink_already_relative_unchanged": {
    "duration": 0.004628896713256836,
    "status": "PASSED"
   },
   "liboe.PathTests.test_make_relative_symlink_non_symlink_is_ignored": {
    "duration": 0.004555702209472656,
    "status": "PASSED"
   },
   "liboe.PathTests.test_realpath_isdir_failure_falls_back_without_nameerror": {
    "duration": 0.0051326751708984375,
    "status": "PASSED"
   },
   "liboe.PathTests.test_realpath_path_outside_root_raises": {
    "duration": 0.004549741744995117,
    "status": "PASSED"
   },
   "liboe.PathTests.test_realpath_plain_path_is_returned": {
    "duration": 0.004620552062988281,
    "status": "PASSED"
   },
   "liboe.PathTests.test_realpath_resolves_symlink_below_root": {
    "duration": 0.004758119583129883,
    "status": "PASSED"
   },
   "liboe.PathTests.test_symlink_conflicting_existing_raises": {
    "duration": 0.004815101623535156,
    "status": "PASSED"
   },
   "liboe.PathTests.test_symlink_creates_symlink": {
    "duration": 0.004971027374267578,
    "status": "PASSED"
   },
   "liboe.PathTests.test_symlink_force_does_not_delete_glob_siblings": {
    "duration": 0.004777669906616211,
    "status": "PASSED"
   },
   "liboe.PathTests.test_symlink_force_overwrites_existing_symlink": {
    "duration": 0.004881143569946289,
    "status": "PASSED"
   },
   "liboe.PathTests.test_symlink_force_replaces_destination_with_glob_metacharacters": {
    "duration": 0.005162954330444336,
    "status": "PASSED"
   },
   "liboe.PathTests.test_symlink_force_replaces_existing_directory": {
    "duration": 0.004900932312011719,
    "status": "PASSED"
   },
   "liboe.PathTests.test_symlink_matching_existing_is_idempotent": {
    "duration": 0.00495147705078125,
    "status": "PASSED"
   },
   "liboe.PathTests.test_which_wild_explicit_search_path": {
    "duration": 0.004745960235595703,
    "status": "PASSED"
   },
   "liboe.PathTests.test_which_wild_first_match_per_name_wins": {
    "duration": 0.0048754215240478516,
    "status": "PASSED"
   },
   "liboe.PathTests.test_which_wild_missing_tool_returns_empty": {
    "duration": 0.0047969818115234375,
    "status": "PASSED"
   },
   "liboe.PathTests.test_which_wild_wildcard_pattern": {
    "duration": 0.004988193511962891,
    "status": "PASSED"
   },
   "liboe.SubprocessTests.test_subprocess_tweak": {
    "duration": 0.017620086669921875,
    "status": "PASSED"
   },
   "lic_checksum.LicenseTests.test_checksum_with_space": {
    "duration": 30.08392024040222,
    "status": "PASSED"
   },
   "lic_checksum.LicenseTests.test_nonmatching_checksum": {
    "duration": 19.536193370819092,
    "status": "PASSED"
   },
   "locales.LocalesTest.test_locales_off": {
    "duration": 139.60169744491577,
    "status": "PASSED"
   },
   "locales.LocalesTest.test_locales_on": {
    "duration": 88.21284985542297,
    "status": "PASSED"
   },
   "manifest.VerifyManifest.test_SDK_manifest_entries": {
    "duration": 364.7960250377655,
    "status": "PASSED"
   },
   "manifest.VerifyManifest.test_image_manifest_entries": {
    "duration": 11.07767367362976,
    "status": "PASSED"
   },
   "minidebuginfo.Minidebuginfo.test_minidebuginfo": {
    "duration": 143.97285199165344,
    "status": "PASSED"
   },
   "minidebuginfo.Minidebuginfo.test_minidebuginfo_qemu": {
    "duration": 163.7049605846405,
    "oetags": [
     "runqemu"
    ],
    "status": "PASSED"
   },
   "multiconfig.MultiConfig.test_multiconfig": {
    "duration": 577.9392583370209,
    "status": "PASSED"
   },
   "multiconfig.MultiConfig.test_multiconfig_inlayer": {
    "duration": 58.260987997055054,
    "status": "PASSED"
   },
   "multiconfig.MultiConfig.test_multiconfig_reparse": {
    "duration": 106.102623462677,
    "status": "PASSED"
   },
   "newlib.NewlibTest.test_newlib": {
    "duration": 38.33221244812012,
    "status": "PASSED"
   },
   "oelib.buildhistory.TestBlobParsing.test_blob_to_dict": {
    "duration": 1.2383463382720947,
    "status": "PASSED"
   },
   "oelib.buildhistory.TestBlobParsing.test_compare_dict_blobs": {
    "duration": 0.9880104064941406,
    "status": "PASSED"
   },
   "oelib.buildhistory.TestBlobParsing.test_compare_dict_blobs_default": {
    "duration": 0.7630877494812012,
    "status": "PASSED"
   },
   "oelib.buildhistory.TestFileListCompare.test_compare_file_lists": {
    "duration": 0.20874476432800293,
    "status": "PASSED"
   },
   "oelib.elf.TestElf.test_machine_name": {
    "duration": 0.0016713142395019531,
    "status": "PASSED"
   },
   "oelib.license.TestComplexCombinations.test_tests": {
    "duration": 0.002540111541748047,
    "status": "PASSED"
   },
   "oelib.license.TestIsIncluded.test_tests": {
    "duration": 0.00561213493347168,
    "status": "PASSED"
   },
   "oelib.license.TestSimpleCombinations.test_tests": {
    "duration": 0.0020139217376708984,
    "status": "PASSED"
   },
   "oelib.license.TestSingleLicense.test_invalid_licenses": {
    "duration": 0.0012564659118652344,
    "status": "PASSED"
   },
   "oelib.license.TestSingleLicense.test_single_licenses": {
    "duration": 0.0010509490966796875,
    "status": "PASSED"
   },
   "oelib.license.TestSort.test_sort": {
    "duration": 0.00501561164855957,
    "status": "PASSED"
   },
   "oelib.package.TestCopyDebugSources.test_copydebugsources_copies_files_and_dereferences_links": {
    "duration": 0.014708280563354492,
    "status": "PASSED"
   },
   "oelib.package.TestCopyDebugSources.test_copydebugsources_ignores_copy_failure": {
    "duration": 0.006783962249755859,
    "status": "PASSED"
   },
   "oelib.package.TestCopyDebugSources.test_copydebugsources_ignores_empty_externalsrc_relocation": {
    "duration": 0.007754325866699219,
    "status": "PASSED"
   },
   "oelib.package.TestCopyDebugSources.test_copydebugsources_moves_externalsrc_relocation": {
    "duration": 0.010155677795410156,
    "status": "PASSED"
   },
   "oelib.patch.TestGitApplyTree.test_dirty_push_run_false_returns_argv": {
    "duration": 0.3940913677215576,
    "status": "PASSED"
   },
   "oelib.patch.TestGitApplyTree.test_fallback_preserves_original_patch_name": {
    "duration": 1.013141393661499,
    "status": "PASSED"
   },
   "oelib.patch.TestGitApplyTree.test_git_am_preserves_original_patch_name": {
    "duration": 0.9772217273712158,
    "status": "PASSED"
   },
   "oelib.patch.TestGitApplyTree.test_push_run_false_returns_argv": {
    "duration": 0.6914799213409424,
    "status": "PASSED"
   },
   "oelib.patch.TestPatchTree.test_push_run_false_returns_argv": {
    "duration": 0.009236335754394531,
    "status": "PASSED"
   },
   "oelib.patch.TestRunCmd.test_runcmd_allows_explicit_shell": {
    "duration": 0.0040166378021240234,
    "status": "PASSED"
   },
   "oelib.patch.TestRunCmd.test_runcmd_preserves_argv_elements": {
    "duration": 0.02312779426574707,
    "status": "PASSED"
   },
   "oelib.patch.TestRunCmd.test_runcmd_reports_exit_status": {
    "duration": 0.026937484741210938,
    "status": "PASSED"
   },
   "oelib.patch.TestRunCmd.test_runcmd_wraps_exec_failure": {
    "duration": 0.0005965232849121094,
    "status": "PASSED"
   },
   "oelib.path.TestRealPath.test_loop": {
    "duration": 0.006275177001953125,
    "status": "PASSED"
   },
   "oelib.path.TestRealPath.test_norm": {
    "duration": 0.0058746337890625,
    "status": "PASSED"
   },
   "oelib.path.TestRealPath.test_phys": {
    "duration": 0.0037255287170410156,
    "status": "PASSED"
   },
   "oelib.types.TestBooleanType.test_bool_equality": {
    "duration": 0.0007824897766113281,
    "status": "PASSED"
   },
   "oelib.types.TestBooleanType.test_false": {
    "duration": 0.001043558120727539,
    "status": "PASSED"
   },
   "oelib.types.TestBooleanType.test_invalid": {
    "duration": 0.0013391971588134766,
    "status": "PASSED"
   },
   "oelib.types.TestBooleanType.test_true": {
    "duration": 0.0014567375183105469,
    "status": "PASSED"
   },
   "oelib.types.TestList.test_list_nosep": {
    "duration": 0.0009748935699462891,
    "status": "PASSED"
   },
   "oelib.types.TestList.test_list_usersep": {
    "duration": 0.0010564327239990234,
    "status": "PASSED"
   },
   "oelib.utils.TestDefaultFeatures.test_filter_default_features": {
    "duration": 0.0008170604705810547,
    "status": "PASSED"
   },
   "oelib.utils.TestMultiprocessLaunch.test_multiprocesslaunch": {
    "duration": 0.03808403015136719,
    "status": "PASSED"
   },
   "oelib.utils.TestPackagesFilterOutSystem.test_filter": {
    "duration": 0.0017626285552978516,
    "status": "PASSED"
   },
   "oelib.utils.TestTrimVersion.test_num_exception": {
    "duration": 0.000576019287109375,
    "status": "PASSED"
   },
   "oelib.utils.TestTrimVersion.test_valid": {
    "duration": 0.0006911754608154297,
    "status": "PASSED"
   },
   "oelib.utils.TestTrimVersion.test_version_exception": {
    "duration": 0.0007984638214111328,
    "status": "PASSED"
   },
   "oescripts.OEGitproxyTests.test_oegitproxy_help": {
    "duration": 0.09368729591369629,
    "status": "PASSED"
   },
   "oescripts.OEGitproxyTests.test_oegitproxy_proxy": {
    "duration": 0.9135253429412842,
    "status": "PASSED"
   },
   "oescripts.OEGitproxyTests.test_oegitproxy_proxy_dash": {
    "duration": 0.008055448532104492,
    "log": "No \"dash\" found on test system.\n",
    "status": "SKIPPED"
   },
   "oescripts.OEListPackageconfigTests.test_packageconfig_flags_default": {
    "duration": 216.80319833755493,
    "status": "PASSED"
   },
   "oescripts.OEListPackageconfigTests.test_packageconfig_flags_help": {
    "duration": 0.21314120292663574,
    "status": "PASSED"
   },
   "oescripts.OEListPackageconfigTests.test_packageconfig_flags_option_all": {
    "duration": 220.93944096565247,
    "status": "PASSED"
   },
   "oescripts.OEListPackageconfigTests.test_packageconfig_flags_option_flags": {
    "duration": 231.86409974098206,
    "status": "PASSED"
   },
   "oescripts.OEListPackageconfigTests.test_packageconfig_flags_options_preferred_only": {
    "duration": 234.427419424057,
    "status": "PASSED"
   },
   "oescripts.OEPybootchartguyTests.test_pybootchartguy_help": {
    "duration": 0.0008776187896728516,
    "log": "Python cairo module is not present\n",
    "status": "SKIPPED"
   },
   "oescripts.OEPybootchartguyTests.test_pybootchartguy_to_generate_build_pdf_output": {
    "duration": 0.0011439323425292969,
    "log": "Python cairo module is not present\n",
    "status": "SKIPPED"
   },
   "oescripts.OEPybootchartguyTests.test_pybootchartguy_to_generate_build_png_output": {
    "duration": 0.0014142990112304688,
    "log": "Python cairo module is not present\n",
    "status": "SKIPPED"
   },
   "oescripts.OEPybootchartguyTests.test_pybootchartguy_to_generate_build_svg_output": {
    "duration": 0.0016620159149169922,
    "log": "Python cairo module is not present\n",
    "status": "SKIPPED"
   },
   "oescripts.OeRunNativeTest.test_oe_run_native": {
    "duration": 25.51448965072632,
    "status": "PASSED"
   },
   "overlayfs.OverlayFSEtcRunTimeTests.test_all_required_variables_set": {
    "duration": 279.3399612903595,
    "oetags": [
     "runqemu"
    ],
    "status": "PASSED"
   },
   "overlayfs.OverlayFSEtcRunTimeTests.test_image_feature_conflict": {
    "duration": 6.203320741653442,
    "oetags": [
     "runqemu"
    ],
    "status": "PASSED"
   },
   "overlayfs.OverlayFSEtcRunTimeTests.test_image_feature_is_missing": {
    "duration": 116.74431109428406,
    "oetags": [
     "runqemu"
    ],
    "status": "PASSED"
   },
   "overlayfs.OverlayFSEtcRunTimeTests.test_lower_layer_access": {
    "duration": 111.81979990005493,
    "oetags": [
     "runqemu"
    ],
    "status": "PASSED"
   },
   "overlayfs.OverlayFSEtcRunTimeTests.test_postinst_on_target_for_read_only_rootfs": {
    "duration": 132.57367706298828,
    "oetags": [
     "runqemu"
    ],
    "status": "PASSED"
   },
   "overlayfs.OverlayFSEtcRunTimeTests.test_sbin_init_original": {
    "duration": 134.53209376335144,
    "oetags": [
     "runqemu"
    ],
    "status": "PASSED"
   },
   "overlayfs.OverlayFSEtcRunTimeTests.test_sbin_init_preinit": {
    "duration": 132.16459274291992,
    "oetags": [
     "runqemu"
    ],
    "status": "PASSED"
   },
   "overlayfs.OverlayFSEtcRunTimeTests.test_sbin_init_read_only": {
    "duration": 133.34930086135864,
    "oetags": [
     "runqemu"
    ],
    "status": "PASSED"
   },
   "overlayfs.OverlayFSTests.test_correct_image_fstab": {
    "duration": 125.79466533660889,
    "oetags": [
     "runqemu"
    ],
    "status": "PASSED"
   },
   "overlayfs.OverlayFSTests.test_correct_image_unit": {
    "duration": 84.83632850646973,
    "oetags": [
     "runqemu"
    ],
    "status": "PASSED"
   },
   "overlayfs.OverlayFSTests.test_distro_features_missing": {
    "duration": 26.609922409057617,
    "status": "PASSED"
   },
   "overlayfs.OverlayFSTests.test_mount_unit_not_set": {
    "duration": 13.872217416763306,
    "status": "PASSED"
   },
   "overlayfs.OverlayFSTests.test_not_all_units_installed": {
    "duration": 58.656830072402954,
    "status": "PASSED"
   },
   "overlayfs.OverlayFSTests.test_not_all_units_installed_but_qa_skipped": {
    "duration": 73.5717248916626,
    "status": "PASSED"
   },
   "overlayfs.OverlayFSTests.test_wrong_mount_unit_set": {
    "duration": 12.871866941452026,
    "status": "PASSED"
   },
   "package.PackageTests.test_gdb_hardlink_debug": {
    "duration": 155.28912258148193,
    "status": "PASSED"
   },
   "package.PackageTests.test_package_name_conflict": {
    "duration": 21.148431301116943,
    "status": "PASSED"
   },
   "package.PackageTests.test_preserve_ownership": {
    "duration": 137.77920246124268,
    "status": "PASSED"
   },
   "package.PackageTests.test_preserve_sparse_hardlinks": {
    "duration": 52.56207489967346,
    "status": "PASSED"
   },
   "package.VersionOrdering.test_dpkg": {
    "duration": 0.02626180648803711,
    "status": "PASSED"
   },
   "package.VersionOrdering.test_opkg": {
    "duration": 0.035843849182128906,
    "status": "PASSED"
   },
   "package.VersionOrdering.test_rpm": {
    "duration": 0.1969766616821289,
    "status": "PASSED"
   },
   "picolibc.PicolibcTest.test_picolibc": {
    "duration": 2.3511838912963867,
    "log": "This test only works with machines : qemuarm qemuarm64 qemuriscv32 qemuriscv64\n",
    "status": "SKIPPED"
   },
   "pkgdata.OePkgdataUtilTests.test_find_path": {
    "duration": 3.109001874923706,
    "status": "PASSED"
   },
   "pkgdata.OePkgdataUtilTests.test_glob": {
    "duration": 1.7488656044006348,
    "status": "PASSED"
   },
   "pkgdata.OePkgdataUtilTests.test_list_pkg_files": {
    "duration": 8.632647275924683,
    "status": "PASSED"
   },
   "pkgdata.OePkgdataUtilTests.test_list_pkgs": {
    "duration": 8.026097774505615,
    "status": "PASSED"
   },
   "pkgdata.OePkgdataUtilTests.test_lookup_pkg": {
    "duration": 5.97734260559082,
    "status": "PASSED"
   },
   "pkgdata.OePkgdataUtilTests.test_lookup_recipe": {
    "duration": 2.996089220046997,
    "status": "PASSED"
   },
   "pkgdata.OePkgdataUtilTests.test_multilib_variables": {
    "duration": 63.77561140060425,
    "status": "PASSED"
   },
   "pkgdata.OePkgdataUtilTests.test_no_param": {
    "duration": 0.10315752029418945,
    "status": "PASSED"
   },
   "pkgdata.OePkgdataUtilTests.test_read_value": {
    "duration": 3.136720895767212,
    "status": "PASSED"
   },
   "pkgdata.OePkgdataUtilTests.test_specify_pkgdatadir": {
    "duration": 0.9317989349365234,
    "status": "PASSED"
   },
   "pokybleeding.PokyBleeding.test_poky_bleeding_autorev": {
    "duration": 81.451655626297,
    "status": "PASSED"
   },
   "prservice.BitbakePrTests.test_import_export_override_db": {
    "duration": 343.56459379196167,
    "status": "PASSED"
   },
   "prservice.BitbakePrTests.test_import_export_replace_db": {
    "duration": 139.42895531654358,
    "status": "PASSED"
   },
   "prservice.BitbakePrTests.test_pr_service_deb_arch_dep": {
    "duration": 91.15504193305969,
    "status": "PASSED"
   },
   "prservice.BitbakePrTests.test_pr_service_deb_arch_indep": {
    "duration": 40.72669053077698,
    "status": "PASSED"
   },
   "prservice.BitbakePrTests.test_pr_service_ipk_arch_dep": {
    "duration": 90.7399492263794,
    "status": "PASSED"
   },
   "prservice.BitbakePrTests.test_pr_service_ipk_arch_indep": {
    "duration": 38.053879737854004,
    "status": "PASSED"
   },
   "prservice.BitbakePrTests.test_pr_service_rpm_arch_dep": {
    "duration": 60.124977588653564,
    "status": "PASSED"
   },
   "prservice.BitbakePrTests.test_pr_service_rpm_arch_indep": {
    "duration": 34.27661991119385,
    "status": "PASSED"
   },
   "prservice.BitbakePrTests.test_stopping_prservice_message": {
    "duration": 0.6535904407501221,
    "status": "PASSED"
   },
   "pseudo.Pseudo.test_pseudo_pyc_creation": {
    "duration": 10.875415802001953,
    "status": "PASSED"
   },
   "recipetool.RecipetoolAppendTests.test_recipetool_appendfile_add": {
    "duration": 76.20024085044861,
    "status": "PASSED"
   },
   "recipetool.RecipetoolAppendTests.test_recipetool_appendfile_add_bindir": {
    "duration": 36.91865062713623,
    "status": "PASSED"
   },
   "recipetool.RecipetoolAppendTests.test_recipetool_appendfile_add_machine": {
    "duration": 34.07251524925232,
    "status": "PASSED"
   },
   "recipetool.RecipetoolAppendTests.test_recipetool_appendfile_alternatives": {
    "duration": 36.35623216629028,
    "status": "PASSED"
   },
   "recipetool.RecipetoolAppendTests.test_recipetool_appendfile_basic": {
    "duration": 33.1319100856781,
    "status": "PASSED"
   },
   "recipetool.RecipetoolAppendTests.test_recipetool_appendfile_binary": {
    "duration": 22.36630630493164,
    "status": "PASSED"
   },
   "recipetool.RecipetoolAppendTests.test_recipetool_appendfile_extlayer": {
    "duration": 6.249588251113892,
    "status": "PASSED"
   },
   "recipetool.RecipetoolAppendTests.test_recipetool_appendfile_inst_func": {
    "duration": 35.18654155731201,
    "status": "PASSED"
   },
   "recipetool.RecipetoolAppendTests.test_recipetool_appendfile_inst_glob": {
    "duration": 32.88861584663391,
    "status": "PASSED"
   },
   "recipetool.RecipetoolAppendTests.test_recipetool_appendfile_inst_todir_glob": {
    "duration": 33.046801805496216,
    "status": "PASSED"
   },
   "recipetool.RecipetoolAppendTests.test_recipetool_appendfile_invalid": {
    "duration": 28.512786149978638,
    "status": "PASSED"
   },
   "recipetool.RecipetoolAppendTests.test_recipetool_appendfile_orig": {
    "duration": 32.538490772247314,
    "status": "PASSED"
   },
   "recipetool.RecipetoolAppendTests.test_recipetool_appendfile_patch": {
    "duration": 31.7341947555542,
    "status": "PASSED"
   },
   "recipetool.RecipetoolAppendTests.test_recipetool_appendfile_postinstall": {
    "duration": 41.65951657295227,
    "status": "PASSED"
   },
   "recipetool.RecipetoolAppendTests.test_recipetool_appendfile_renamed": {
    "duration": 29.52898335456848,
    "status": "PASSED"
   },
   "recipetool.RecipetoolAppendTests.test_recipetool_appendfile_script": {
    "duration": 28.72603154182434,
    "status": "PASSED"
   },
   "recipetool.RecipetoolAppendTests.test_recipetool_appendfile_subdir": {
    "duration": 29.96204948425293,
    "status": "PASSED"
   },
   "recipetool.RecipetoolAppendTests.test_recipetool_appendfile_todir": {
    "duration": 30.389868021011353,
    "status": "PASSED"
   },
   "recipetool.RecipetoolAppendTests.test_recipetool_appendfile_wildcard": {
    "duration": 12.973466873168945,
    "status": "PASSED"
   },
   "recipetool.RecipetoolAppendsrcTests.test_recipetool_appendsrcfile_basic": {
    "duration": 65.76918125152588,
    "status": "PASSED"
   },
   "recipetool.RecipetoolAppendsrcTests.test_recipetool_appendsrcfile_basic_wildcard": {
    "duration": 45.06327533721924,
    "status": "PASSED"
   },
   "recipetool.RecipetoolAppendsrcTests.test_recipetool_appendsrcfile_existing_in_src_uri": {
    "duration": 20.0665225982666,
    "status": "PASSED"
   },
   "recipetool.RecipetoolAppendsrcTests.test_recipetool_appendsrcfile_existing_in_src_uri_diff_params": {
    "duration": 19.27952289581299,
    "status": "PASSED"
   },
   "recipetool.RecipetoolAppendsrcTests.test_recipetool_appendsrcfile_machine": {
    "duration": 59.9358286857605,
    "status": "PASSED"
   },
   "recipetool.RecipetoolAppendsrcTests.test_recipetool_appendsrcfile_replace_file_srcdir": {
    "duration": 37.755502700805664,
    "status": "PASSED"
   },
   "recipetool.RecipetoolAppendsrcTests.test_recipetool_appendsrcfile_srcdir_basic": {
    "duration": 24.17007827758789,
    "status": "PASSED"
   },
   "recipetool.RecipetoolAppendsrcTests.test_recipetool_appendsrcfile_subdir_basic": {
    "duration": 37.54270148277283,
    "status": "PASSED"
   },
   "recipetool.RecipetoolAppendsrcTests.test_recipetool_appendsrcfile_subdir_basic_dirdest": {
    "duration": 36.71353101730347,
    "status": "PASSED"
   },
   "recipetool.RecipetoolAppendsrcTests.test_recipetool_appendsrcfile_update_recipe_basic": {
    "duration": 10.677595615386963,
    "status": "PASSED"
   },
   "recipetool.RecipetoolAppendsrcTests.test_recipetool_appendsrcfiles_basic": {
    "duration": 48.55984711647034,
    "status": "PASSED"
   },
   "recipetool.RecipetoolAppendsrcTests.test_recipetool_appendsrcfiles_basic_subdir": {
    "duration": 50.294187784194946,
    "status": "PASSED"
   },
   "recipetool.RecipetoolCreateTests.test_recipetool_create": {
    "duration": 30.25576400756836,
    "status": "PASSED"
   },
   "recipetool.RecipetoolCreateTests.test_recipetool_create_autotools": {
    "duration": 49.073564529418945,
    "status": "PASSED"
   },
   "recipetool.RecipetoolCreateTests.test_recipetool_create_cmake": {
    "duration": 21.8215970993042,
    "status": "PASSED"
   },
   "recipetool.RecipetoolCreateTests.test_recipetool_create_git_http": {
    "duration": 24.600330591201782,
    "status": "PASSED"
   },
   "recipetool.RecipetoolCreateTests.test_recipetool_create_git_srcbranch": {
    "duration": 24.595940113067627,
    "status": "PASSED"
   },
   "recipetool.RecipetoolCreateTests.test_recipetool_create_git_srcuri_branch": {
    "duration": 23.03597378730774,
    "status": "PASSED"
   },
   "recipetool.RecipetoolCreateTests.test_recipetool_create_git_srcuri_master": {
    "duration": 23.890106201171875,
    "status": "PASSED"
   },
   "recipetool.RecipetoolCreateTests.test_recipetool_create_github": {
    "duration": 28.111714601516724,
    "status": "PASSED"
   },
   "recipetool.RecipetoolCreateTests.test_recipetool_create_github_tarball": {
    "duration": 27.52976894378662,
    "status": "PASSED"
   },
   "recipetool.RecipetoolCreateTests.test_recipetool_create_go": {
    "duration": 37.83286643028259,
    "status": "PASSED"
   },
   "recipetool.RecipetoolCreateTests.test_recipetool_create_npm": {
    "duration": 1.3329570293426514,
    "log": "Test needs meta-oe for nodejs\n",
    "status": "SKIPPED"
   },
   "recipetool.RecipetoolCreateTests.test_recipetool_create_python3_pep517_flit_core_buildapi": {
    "duration": 32.22685170173645,
    "status": "PASSED"
   },
   "recipetool.RecipetoolCreateTests.test_recipetool_create_python3_pep517_hatchling": {
    "duration": 30.896615982055664,
    "status": "PASSED"
   },
   "recipetool.RecipetoolCreateTests.test_recipetool_create_python3_pep517_maturin": {
    "duration": 31.48005509376526,
    "status": "PASSED"
   },
   "recipetool.RecipetoolCreateTests.test_recipetool_create_python3_pep517_mesonpy": {
    "duration": 32.50415754318237,
    "status": "PASSED"
   },
   "recipetool.RecipetoolCreateTests.test_recipetool_create_python3_pep517_poetry_core_masonry_api": {
    "duration": 28.194234609603882,
    "status": "PASSED"
   },
   "recipetool.RecipetoolCreateTests.test_recipetool_create_python3_pep517_setuptools_build_meta": {
    "duration": 26.28726625442505,
    "status": "PASSED"
   },
   "recipetool.RecipetoolCreateTests.test_recipetool_create_python3_pep517_setuptools_build_meta_license_pep639": {
    "duration": 23.372652292251587,
    "status": "PASSED"
   },
   "recipetool.RecipetoolCreateTests.test_recipetool_create_python3_pep517_setuptools_build_meta_license_prepep639": {
    "duration": 22.712356090545654,
    "status": "PASSED"
   },
   "recipetool.RecipetoolCreateTests.test_recipetool_create_python3_setuptools": {
    "duration": 25.290749311447144,
    "status": "PASSED"
   },
   "recipetool.RecipetoolCreateTests.test_recipetool_create_python3_setuptools_pypi": {
    "duration": 52.67988300323486,
    "status": "PASSED"
   },
   "recipetool.RecipetoolCreateTests.test_recipetool_create_python3_setuptools_pypi_tarball": {
    "duration": 25.56553316116333,
    "status": "PASSED"
   },
   "recipetool.RecipetoolCreateTests.test_recipetool_create_simple": {
    "duration": 25.84992265701294,
    "status": "PASSED"
   },
   "recipetool.RecipetoolTests.test_recipetool_handle_license_vars": {
    "duration": 3.1321096420288086,
    "status": "PASSED"
   },
   "recipetool.RecipetoolTests.test_recipetool_load_plugin": {
    "duration": 10.09399700164795,
    "status": "PASSED"
   },
   "recipetool.RecipetoolTests.test_recipetool_split_pkg_licenses": {
    "duration": 0.025014877319335938,
    "status": "PASSED"
   },
   "recipeutils.RecipeUtilsTests.test_patch_recipe_appends": {
    "duration": 0.08736228942871094,
    "status": "PASSED"
   },
   "recipeutils.RecipeUtilsTests.test_patch_recipe_singleappend": {
    "duration": 0.09048604965209961,
    "status": "PASSED"
   },
   "recipeutils.RecipeUtilsTests.test_patch_recipe_varflag": {
    "duration": 0.08737802505493164,
    "status": "PASSED"
   },
   "recipeutils.RecipeUtilsTests.test_split_var_value": {
    "duration": 0.006479740142822266,
    "status": "PASSED"
   },
   "recipeutils.RecipeUtilsTests.test_validate_pn": {
    "duration": 0.0063877105712890625,
    "status": "PASSED"
   },
   "reproducible.DiffoscopeTests.test_diffoscope": {
    "log": "Skip by the command line argument \"reproducible\"\n",
    "status": "SKIPPED"
   },
   "reproducible.ReproducibleTests.test_reproducible_builds": {
    "log": "Skip by the command line argument \"reproducible\"\n",
    "status": "SKIPPED"
   },
   "resulttooltests.ResultToolTests.test_can_compare_ltp_tests": {
    "duration": 0.00766754150390625,
    "status": "PASSED"
   },
   "resulttooltests.ResultToolTests.test_can_match_non_static_ptest_names": {
    "duration": 0.007270097732543945,
    "status": "PASSED"
   },
   "resulttooltests.ResultToolTests.test_can_not_compare_non_ltp_tests": {
    "duration": 0.0071735382080078125,
    "status": "PASSED"
   },
   "resulttooltests.ResultToolTests.test_junit_empty_testresults": {
    "duration": 0.0071904659271240234,
    "status": "PASSED"
   },
   "resulttooltests.ResultToolTests.test_junit_log_attached": {
    "duration": 0.0075914859771728516,
    "status": "PASSED"
   },
   "resulttooltests.ResultToolTests.test_junit_log_inline": {
    "duration": 0.007405757904052734,
    "status": "PASSED"
   },
   "resulttooltests.ResultToolTests.test_junit_missing_image_tests": {
    "duration": 0.0072345733642578125,
    "status": "PASSED"
   },
   "resulttooltests.ResultToolTests.test_junit_missing_ptests": {
    "duration": 0.007557392120361328,
    "status": "PASSED"
   },
   "resulttooltests.ResultToolTests.test_machine_matches": {
    "duration": 0.007233142852783203,
    "status": "PASSED"
   },
   "resulttooltests.ResultToolTests.test_machine_mismatches": {
    "duration": 0.007317543029785156,
    "status": "PASSED"
   },
   "resulttooltests.ResultToolTests.test_merge_can_merged_results": {
    "duration": 0.00737309455871582,
    "status": "PASSED"
   },
   "resulttooltests.ResultToolTests.test_metadata_matching_is_only_checked_for_relevant_test_type": {
    "duration": 0.007576704025268555,
    "status": "PASSED"
   },
   "resulttooltests.ResultToolTests.test_regression_can_get_regression_base_target_pair": {
    "duration": 0.007434844970703125,
    "status": "PASSED"
   },
   "resulttooltests.ResultToolTests.test_regression_can_get_regression_result": {
    "duration": 0.007669210433959961,
    "status": "PASSED"
   },
   "resulttooltests.ResultToolTests.test_report_can_aggregate_test_result": {
    "duration": 0.007290840148925781,
    "status": "PASSED"
   },
   "resulttooltests.ResultToolTests.test_results_with_matching_metadata_can_be_compared": {
    "duration": 0.0072612762451171875,
    "status": "PASSED"
   },
   "resulttooltests.ResultToolTests.test_results_with_mismatching_metadata_can_not_be_compared": {
    "duration": 0.007181882858276367,
    "status": "PASSED"
   },
   "resulttooltests.ResultToolTests.test_results_without_metadata_can_be_compared": {
    "duration": 0.007315874099731445,
    "status": "PASSED"
   },
   "resulttooltests.ResultToolTests.test_target_result_with_missing_metadata_can_not_be_compared": {
    "duration": 0.007586002349853516,
    "status": "PASSED"
   },
   "retain.Retain.test_retain_always": {
    "duration": 31.3163640499115,
    "status": "PASSED"
   },
   "retain.Retain.test_retain_failure": {
    "duration": 41.52850008010864,
    "status": "PASSED"
   },
   "retain.Retain.test_retain_global": {
    "duration": 56.40749144554138,
    "status": "PASSED"
   },
   "retain.Retain.test_retain_misc": {
    "duration": 69.26638841629028,
    "status": "PASSED"
   },
   "rootfspostcommandstests.ShadowUtilsTidyFiles.test_shadowutils_backup_files": {
    "duration": 26.770864248275757,
    "log": "Testcase skipped as 'tidy_shadowutils_files' rootfs post process command is not the set SORT_PASSWD_POSTPROCESS_COMMAND.\n",
    "status": "SKIPPED"
   },
   "rootfspostcommandstests.ShadowUtilsTidyFiles.test_shadowutils_sorted_files": {
    "duration": 7.130636215209961,
    "log": "Testcase skipped as 'tidy_shadowutils_files' rootfs post process command is not the set SORT_PASSWD_POSTPROCESS_COMMAND.\n",
    "status": "SKIPPED"
   },
   "rpmtests.BitbakeTests.test_rpm_filenames": {
    "duration": 9.471282720565796,
    "status": "PASSED"
   },
   "runcmd.RunCmdTests.test_list_not_found": {
    "duration": 0.007848262786865234,
    "status": "PASSED"
   },
   "runcmd.RunCmdTests.test_list_okay": {
    "duration": 0.04821348190307617,
    "status": "PASSED"
   },
   "runcmd.RunCmdTests.test_log": {
    "duration": 0.009466886520385742,
    "status": "PASSED"
   },
   "runcmd.RunCmdTests.test_log_split": {
    "duration": 0.008524894714355469,
    "status": "PASSED"
   },
   "runcmd.RunCmdTests.test_no_shell": {
    "duration": 0.007082939147949219,
    "status": "PASSED"
   },
   "runcmd.RunCmdTests.test_output": {
    "duration": 0.007824420928955078,
    "status": "PASSED"
   },
   "runcmd.RunCmdTests.test_output_split": {
    "duration": 0.008712530136108398,
    "status": "PASSED"
   },
   "runcmd.RunCmdTests.test_result_assertion": {
    "duration": 0.02109217643737793,
    "status": "PASSED"
   },
   "runcmd.RunCmdTests.test_result_exception": {
    "duration": 0.01993727684020996,
    "status": "PASSED"
   },
   "runcmd.RunCmdTests.test_result_false": {
    "duration": 0.023287296295166016,
    "status": "PASSED"
   },
   "runcmd.RunCmdTests.test_result_okay": {
    "duration": 0.022366046905517578,
    "status": "PASSED"
   },
   "runcmd.RunCmdTests.test_shell": {
    "duration": 0.0254974365234375,
    "status": "PASSED"
   },
   "runcmd.RunCmdTests.test_stdin": {
    "duration": 0.01041722297668457,
    "status": "PASSED"
   },
   "runcmd.RunCmdTests.test_stdin_timeout": {
    "duration": 10.00698471069336,
    "status": "PASSED"
   },
   "runcmd.RunCmdTests.test_timeout": {
    "duration": 10.007204532623291,
    "status": "PASSED"
   },
   "runcmd.RunCmdTests.test_timeout_split": {
    "duration": 10.008587121963501,
    "status": "PASSED"
   },
   "runqemu.RunqemuTests.test_boot_compressed_wic_by_path": {
    "duration": 140.12156987190247,
    "oetags": [
     "runqemu"
    ],
    "status": "PASSED"
   },
   "runqemu.RunqemuTests.test_boot_compressed_wic_by_recipe": {
    "duration": 32.432066679000854,
    "oetags": [
     "runqemu"
    ],
    "status": "PASSED"
   },
   "runqemu.RunqemuTests.test_boot_deploy": {
    "duration": 22.534022331237793,
    "oetags": [
     "runqemu"
    ],
    "status": "PASSED"
   },
   "runqemu.RunqemuTests.test_boot_deploy_hddimg": {
    "duration": 22.088787317276,
    "oetags": [
     "runqemu"
    ],
    "status": "PASSED"
   },
   "runqemu.RunqemuTests.test_boot_machine": {
    "duration": 26.554158210754395,
    "oetags": [
     "runqemu"
    ],
    "status": "PASSED"
   },
   "runqemu.RunqemuTests.test_boot_machine_ext4": {
    "duration": 27.443479537963867,
    "oetags": [
     "runqemu"
    ],
    "status": "PASSED"
   },
   "runqemu.RunqemuTests.test_boot_machine_iso": {
    "duration": 24.959150552749634,
    "oetags": [
     "runqemu"
    ],
    "status": "PASSED"
   },
   "runqemu.RunqemuTests.test_boot_machine_slirp": {
    "duration": 27.7433123588562,
    "oetags": [
     "runqemu"
    ],
    "status": "PASSED"
   },
   "runqemu.RunqemuTests.test_boot_machine_slirp_qcow2": {
    "duration": 25.550394773483276,
    "oetags": [
     "runqemu"
    ],
    "status": "PASSED"
   },
   "runqemu.RunqemuTests.test_boot_qemu_boot": {
    "duration": 22.201282262802124,
    "oetags": [
     "runqemu"
    ],
    "status": "PASSED"
   },
   "runqemu.RunqemuTests.test_boot_recipe_image": {
    "duration": 29.186690092086792,
    "oetags": [
     "runqemu"
    ],
    "status": "PASSED"
   },
   "runqemu.RunqemuTests.test_boot_recipe_image_vdi": {
    "duration": 30.706719875335693,
    "oetags": [
     "runqemu"
    ],
    "status": "PASSED"
   },
   "runqemu.RunqemuTests.test_boot_recipe_image_vmdk": {
    "duration": 28.810584783554077,
    "oetags": [
     "runqemu"
    ],
    "status": "PASSED"
   },
   "runqemu.RunqemuTests.test_boot_rootfs": {
    "duration": 21.402740478515625,
    "oetags": [
     "runqemu"
    ],
    "status": "PASSED"
   },
   "runtime_test.Postinst.test_failing_postinst": {
    "duration": 216.53574514389038,
    "oetags": [
     "runqemu"
    ],
    "status": "PASSED"
   },
   "runtime_test.Postinst.test_postinst_rootfs_and_boot_systemd": {
    "duration": 358.800972700119,
    "oetags": [
     "runqemu"
    ],
    "status": "PASSED"
   },
   "runtime_test.Postinst.test_postinst_rootfs_and_boot_sysvinit": {
    "duration": 275.1253728866577,
    "oetags": [
     "runqemu"
    ],
    "status": "PASSED"
   },
   "runtime_test.RustKernel.test_kernel_rust_sample": {
    "duration": 90.79578161239624,
    "oetags": [
     "runqemu"
    ],
    "status": "PASSED"
   },
   "runtime_test.SystemTap.test_crosstap_helloworld": {
    "duration": 164.79789280891418,
    "oetags": [
     "runqemu"
    ],
    "status": "PASSED"
   },
   "runtime_test.SystemTap.test_crosstap_pstree": {
    "duration": 47.12362837791443,
    "oetags": [
     "runqemu"
    ],
    "status": "PASSED"
   },
   "runtime_test.SystemTap.test_crosstap_syscalls_by_pid": {
    "duration": 49.19422745704651,
    "oetags": [
     "runqemu"
    ],
    "status": "PASSED"
   },
   "runtime_test.SystemTap.test_crosstap_syscalls_by_proc": {
    "duration": 44.395416021347046,
    "oetags": [
     "runqemu"
    ],
    "status": "PASSED"
   },
   "runtime_test.TestExport.test_testexport_basic": {
    "duration": 141.00304555892944,
    "oetags": [
     "runqemu"
    ],
    "status": "PASSED"
   },
   "runtime_test.TestExport.test_testexport_sdk": {
    "duration": 118.64875221252441,
    "status": "PASSED"
   },
   "runtime_test.TestImage.test_testimage_apt": {
    "duration": 276.11556816101074,
    "oetags": [
     "runqemu"
    ],
    "status": "PASSED"
   },
   "runtime_test.TestImage.test_testimage_dnf": {
    "duration": 175.99541401863098,
    "oetags": [
     "runqemu"
    ],
    "status": "PASSED"
   },
   "runtime_test.TestImage.test_testimage_install": {
    "duration": 139.46330380439758,
    "oetags": [
     "runqemu"
    ],
    "status": "PASSED"
   },
   "runtime_test.TestImage.test_testimage_slirp": {
    "duration": 105.73590970039368,
    "oetags": [
     "runqemu"
    ],
    "status": "PASSED"
   },
   "runtime_test.TestImage.test_testimage_virgl_gtk_sdl": {
    "duration": 253.45794820785522,
    "oetags": [
     "runqemu"
    ],
    "status": "PASSED"
   },
   "runtime_test.TestImage.test_testimage_virgl_headless": {
    "duration": 84.26967811584473,
    "oetags": [
     "runqemu"
    ],
    "status": "PASSED"
   },
   "rust.RustStaticMuslTest.test_static_musl_linking": {
    "duration": 70.78829312324524,
    "status": "PASSED"
   },
   "sdk.SDKTests.test_sdk_manifests": {
    "duration": 487.1758186817169,
    "status": "PASSED"
   },
   "sdk.SDKTests.test_sdk_runqemu": {
    "duration": 485.57646131515503,
    "status": "PASSED"
   },
   "selftest.ExternalLayer.test_list_imported": {
    "duration": 0.014602184295654297,
    "status": "PASSED"
   },
   "signing.LockedSignatures.test_locked_signatures": {
    "duration": 97.14530682563782,
    "status": "PASSED"
   },
   "signing.Signing.test_signing_packages": {
    "duration": 179.43902707099915,
    "status": "PASSED"
   },
   "signing.Signing.test_signing_sstate_archive": {
    "duration": 189.45238256454468,
    "status": "PASSED"
   },
   "spdx.SPDX30Check.test_baremetal_helloworld": {
    "duration": 88.87357997894287,
    "status": "PASSED"
   },
   "spdx.SPDX30Check.test_base_files": {
    "duration": 56.57474756240845,
    "status": "PASSED"
   },
   "spdx.SPDX30Check.test_core_image_minimal": {
    "duration": 76.97020816802979,
    "status": "PASSED"
   },
   "spdx.SPDX30Check.test_core_image_minimal_sdk": {
    "duration": 332.61937618255615,
    "status": "PASSED"
   },
   "spdx.SPDX30Check.test_custom_annotation_vars": {
    "duration": 26.402698755264282,
    "status": "PASSED"
   },
   "spdx.SPDX30Check.test_download_location_defensive_handling": {
    "duration": 12.752963066101074,
    "status": "PASSED"
   },
   "spdx.SPDX30Check.test_extra_opts": {
    "duration": 139.89655113220215,
    "status": "PASSED"
   },
   "spdx.SPDX30Check.test_gcc_include_source": {
    "duration": 140.13174438476562,
    "status": "PASSED"
   },
   "spdx.SPDX30Check.test_kernel_config_spdx": {
    "duration": 242.2939167022705,
    "status": "PASSED"
   },
   "spdx.SPDX30Check.test_packageconfig_spdx": {
    "duration": 40.17436170578003,
    "status": "PASSED"
   },
   "spdx.SPDX30Check.test_version_extraction_patterns": {
    "duration": 16.743784427642822,
    "status": "PASSED"
   },
   "spdx.SPDX30Check.test_world_sbom": {
    "duration": 59.87465047836304,
    "status": "PASSED"
   },
   "sstatetests.SStateCacheManagement.test_sstate_cache_management_script_using_machine": {
    "duration": 190.46384692192078,
    "status": "PASSED"
   },
   "sstatetests.SStateCacheManagement.test_sstate_cache_management_script_using_pr_1": {
    "duration": 70.63844037055969,
    "status": "PASSED"
   },
   "sstatetests.SStateCacheManagement.test_sstate_cache_management_script_using_pr_2": {
    "duration": 99.43672704696655,
    "status": "PASSED"
   },
   "sstatetests.SStateCacheManagement.test_sstate_cache_management_script_using_pr_3": {
    "duration": 168.7557635307312,
    "status": "PASSED"
   },
   "sstatetests.SStateCleanup.test_cleansstate_task_distro_nonspecific": {
    "duration": 40.32405185699463,
    "status": "PASSED"
   },
   "sstatetests.SStateCleanup.test_cleansstate_task_distro_specific": {
    "duration": 39.88993573188782,
    "status": "PASSED"
   },
   "sstatetests.SStateCleanup.test_cleansstate_task_distro_specific_nonspecific": {
    "duration": 40.391770362854004,
    "status": "PASSED"
   },
   "sstatetests.SStateCreation.test_sstate_creation_distro_nonspecific": {
    "duration": 52.79462456703186,
    "status": "PASSED"
   },
   "sstatetests.SStateCreation.test_sstate_creation_distro_specific": {
    "duration": 49.377063035964966,
    "status": "PASSED"
   },
   "sstatetests.SStateDistroTests.test_rebuild_distro_specific_sstate_cross_native_targets": {
    "duration": 64.9871084690094,
    "status": "PASSED"
   },
   "sstatetests.SStateDistroTests.test_rebuild_distro_specific_sstate_cross_target": {
    "duration": 60.37432241439819,
    "status": "PASSED"
   },
   "sstatetests.SStateDistroTests.test_rebuild_distro_specific_sstate_native_target": {
    "duration": 63.62113857269287,
    "status": "PASSED"
   },
   "sstatetests.SStateFindSiginfo.test_sstate_compare_sigfiles_and_find_siginfo": {
    "duration": 296.5512127876282,
    "status": "PASSED"
   },
   "sstatetests.SStateHashSameSigs.test_sstate_32_64_same_hash": {
    "duration": 99.82217693328857,
    "status": "PASSED"
   },
   "sstatetests.SStateHashSameSigs.test_sstate_nativelsbstring_same_hash": {
    "duration": 99.7577612400055,
    "status": "PASSED"
   },
   "sstatetests.SStateHashSameSigs.test_sstate_sdk_arch_same_hash": {
    "duration": 108.32739043235779,
    "status": "PASSED"
   },
   "sstatetests.SStateHashSameSigs2.test_sstate_allarch_samesigs": {
    "duration": 127.23496103286743,
    "status": "PASSED"
   },
   "sstatetests.SStateHashSameSigs2.test_sstate_nativesdk_samesigs_multilib": {
    "duration": 151.59352660179138,
    "status": "PASSED"
   },
   "sstatetests.SStateHashSameSigs3.test_sstate_multilib_or_not_native_samesigs": {
    "duration": 92.36305522918701,
    "status": "PASSED"
   },
   "sstatetests.SStateHashSameSigs3.test_sstate_sametune_samesigs": {
    "duration": 216.20745658874512,
    "status": "PASSED"
   },
   "sstatetests.SStateHashSameSigs4.test_sstate_movelayer_samesigs": {
    "duration": 86.1729199886322,
    "status": "PASSED"
   },
   "sstatetests.SStateHashSameSigs4.test_sstate_noop_samesigs": {
    "duration": 149.16546249389648,
    "status": "PASSED"
   },
   "sstatetests.SStatePrintdiff.test_gcc_runtime_vs_gcc_source": {
    "duration": 455.601655960083,
    "status": "PASSED"
   },
   "sstatetests.SStatePrintdiff.test_image_minimal_vs_base_do_configure": {
    "duration": 526.8396627902985,
    "status": "PASSED"
   },
   "sstatetests.SStatePrintdiff.test_image_minimal_vs_perlcross": {
    "duration": 274.59670996665955,
    "status": "PASSED"
   },
   "sstatetests.SStateTests.test_autorev_sstate_works": {
    "duration": 84.00249433517456,
    "status": "PASSED"
   },
   "sysroot.SysrootTests.test_sysroot_cleanup": {
    "duration": 92.5507402420044,
    "status": "PASSED"
   },
   "sysroot.SysrootTests.test_sysroot_la": {
    "duration": 39.61996817588806,
    "status": "PASSED"
   },
   "sysroot.SysrootTests.test_sysroot_max_shebang": {
    "duration": 15.738198041915894,
    "status": "PASSED"
   },
   "sysroot.SysrootTests.test_sysroot_pkgconfig": {
    "duration": 32.68031406402588,
    "status": "PASSED"
   },
   "systemd_boot.Systemdboot.test_efi_systemdboot_images_can_be_built": {
    "duration": 186.14287161827087,
    "status": "PASSED"
   },
   "tinfoil.TinfoilTests.test_datastore_operations": {
    "duration": 0.9693126678466797,
    "status": "PASSED"
   },
   "tinfoil.TinfoilTests.test_expand": {
    "duration": 0.26143455505371094,
    "status": "PASSED"
   },
   "tinfoil.TinfoilTests.test_getvar": {
    "duration": 1.007744312286377,
    "status": "PASSED"
   },
   "tinfoil.TinfoilTests.test_getvar_bb_origenv": {
    "duration": 1.0127630233764648,
    "status": "PASSED"
   },
   "tinfoil.TinfoilTests.test_list_recipes": {
    "duration": 3.7373974323272705,
    "status": "PASSED"
   },
   "tinfoil.TinfoilTests.test_parse_recipe": {
    "duration": 3.8031857013702393,
    "status": "PASSED"
   },
   "tinfoil.TinfoilTests.test_parse_recipe_copy_expand": {
    "duration": 4.25859808921814,
    "status": "PASSED"
   },
   "tinfoil.TinfoilTests.test_parse_recipe_custom_data": {
    "duration": 3.2786717414855957,
    "status": "PASSED"
   },
   "tinfoil.TinfoilTests.test_parse_virtual_recipe": {
    "duration": 3.8103249073028564,
    "status": "PASSED"
   },
   "tinfoil.TinfoilTests.test_parse_virtual_recipe_custom_data": {
    "duration": 4.20423150062561,
    "status": "PASSED"
   },
   "tinfoil.TinfoilTests.test_setvariable_clean": {
    "duration": 3.019299030303955,
    "status": "PASSED"
   },
   "tinfoil.TinfoilTests.test_variable_history": {
    "duration": 3.856253147125244,
    "status": "PASSED"
   },
   "tinfoil.TinfoilTests.test_wait_event": {
    "duration": 2.0042836666107178,
    "status": "PASSED"
   },
   "toolchain.ToolchainTests.test_toolchain_switching": {
    "duration": 110.84834241867065,
    "status": "PASSED"
   },
   "uboot.UBootConfigTest.test_uboot_config_extract": {
    "duration": 30.237200260162354,
    "status": "PASSED"
   },
   "uboot.UBootConfigTest.test_uboot_config_extract_error_missing_config": {
    "duration": 25.627002239227295,
    "status": "PASSED"
   },
   "uboot.UBootConfigTest.test_uboot_config_extract_error_nothing_set": {
    "duration": 32.130213499069214,
    "status": "PASSED"
   },
   "uboot.UBootConfigTest.test_uboot_config_extract_error_set_both_config_and_machine": {
    "duration": 22.958120107650757,
    "status": "PASSED"
   },
   "uboot.UBootConfigTest.test_uboot_config_extract_error_set_uboot_config_binary": {
    "duration": 22.05613899230957,
    "status": "PASSED"
   },
   "uboot.UBootConfigTest.test_uboot_config_extract_error_set_uboot_config_fragments": {
    "duration": 24.14615297317505,
    "status": "PASSED"
   },
   "uboot.UBootConfigTest.test_uboot_config_extract_error_set_uboot_config_image_fstypes": {
    "duration": 25.866740226745605,
    "status": "PASSED"
   },
   "uboot.UBootConfigTest.test_uboot_config_extract_error_set_uboot_config_make_opts": {
    "duration": 23.754660606384277,
    "status": "PASSED"
   },
   "uboot.UBootConfigTest.test_uboot_config_extract_legacy": {
    "duration": 30.831605911254883,
    "status": "PASSED"
   },
   "uboot.UBootConfigTest.test_uboot_config_extract_single_config": {
    "duration": 30.05482029914856,
    "status": "PASSED"
   },
   "uboot.UBootTest.test_boot_uboot": {
    "duration": 0.0027055740356445312,
    "log": "Test skipped on x86_64\n",
    "oetags": [
     "runqemu"
    ],
    "status": "SKIPPED"
   },
   "uboot.UBootTest.test_boot_uboot_kvm_to_full_target": {
    "duration": 0.0037457942962646484,
    "log": "Test skipped on x86_64\n",
    "oetags": [
     "runqemu"
    ],
    "status": "SKIPPED"
   },
   "uboot.UBootTest.test_uboot_config_initial_env_binary": {
    "duration": 38.38453245162964,
    "status": "PASSED"
   },
   "uboot.UBootTest.test_uboot_initial_env_binary": {
    "duration": 34.22130012512207,
    "status": "PASSED"
   },
   "uki.UkiTest.test_uki_boot_systemd": {
    "duration": 149.23142766952515,
    "oetags": [
     "runqemu"
    ],
    "status": "PASSED"
   },
   "uki.UkiTest.test_uki_sysvinit": {
    "duration": 182.55820298194885,
    "oetags": [
     "runqemu"
    ],
    "status": "PASSED"
   },
   "usergrouptests.UserGroupTests.test_add_task_between_p_sysroot_and_package": {
    "duration": 26.10841965675354,
    "status": "PASSED"
   },
   "usergrouptests.UserGroupTests.test_group_from_dep_package": {
    "duration": 39.81920075416565,
    "status": "PASSED"
   },
   "usergrouptests.UserGroupTests.test_postinst_order": {
    "duration": 11.854610681533813,
    "status": "PASSED"
   },
   "usergrouptests.UserGroupTests.test_static_useradd_from_dynamic": {
    "duration": 154.41084671020508,
    "status": "PASSED"
   },
   "usergrouptests.UserGroupTests.test_useradd_depends_only": {
    "duration": 15.115505933761597,
    "status": "PASSED"
   },
   "wic.CLITests.test_createhelp": {
    "duration": 57.34276461601257,
    "status": "PASSED"
   },
   "wic.CLITests.test_help": {
    "duration": 5.054025888442993,
    "status": "PASSED"
   },
   "wic.CLITests.test_help_create": {
    "duration": 3.035362482070923,
    "status": "PASSED"
   },
   "wic.CLITests.test_help_kickstart": {
    "duration": 3.097137689590454,
    "status": "PASSED"
   },
   "wic.CLITests.test_help_list": {
    "duration": 4.338902473449707,
    "status": "PASSED"
   },
   "wic.CLITests.test_help_overview": {
    "duration": 4.336208343505859,
    "status": "PASSED"
   },
   "wic.CLITests.test_help_plugins": {
    "duration": 3.0111117362976074,
    "status": "PASSED"
   },
   "wic.CLITests.test_list_images": {
    "duration": 7.532020568847656,
    "status": "PASSED"
   },
   "wic.CLITests.test_list_source_plugins": {
    "duration": 8.012525081634521,
    "status": "PASSED"
   },
   "wic.CLITests.test_listed_images_help": {
    "duration": 63.30058455467224,
    "status": "PASSED"
   },
   "wic.CLITests.test_listhelp": {
    "duration": 2.4268317222595215,
    "status": "PASSED"
   },
   "wic.CLITests.test_no_command": {
    "duration": 4.950058698654175,
    "status": "PASSED"
   },
   "wic.CLITests.test_unsupported_subcommand": {
    "duration": 4.114974737167358,
    "status": "PASSED"
   },
   "wic.CLITests.test_version": {
    "duration": 4.141171932220459,
    "status": "PASSED"
   },
   "wic.ModifyTests.test_wic_cp": {
    "duration": 110.14462733268738,
    "status": "PASSED"
   },
   "wic.ModifyTests.test_wic_cp_ext": {
    "duration": 52.477248191833496,
    "status": "PASSED"
   },
   "wic.ModifyTests.test_wic_ls": {
    "duration": 33.548715114593506,
    "status": "PASSED"
   },
   "wic.ModifyTests.test_wic_ls_ext": {
    "duration": 36.985065937042236,
    "status": "PASSED"
   },
   "wic.ModifyTests.test_wic_rm": {
    "duration": 49.29343843460083,
    "status": "PASSED"
   },
   "wic.ModifyTests.test_wic_rm_ext": {
    "duration": 52.73039245605469,
    "status": "PASSED"
   },
   "wic.Wic.test_bootloader_config": {
    "duration": 163.8913812637329,
    "status": "PASSED"
   },
   "wic.Wic.test_build_artifacts": {
    "duration": 19.035548210144043,
    "status": "PASSED"
   },
   "wic.Wic.test_build_image_name": {
    "duration": 27.350024938583374,
    "status": "PASSED"
   },
   "wic.Wic.test_build_rootfs_long": {
    "duration": 66.34284329414368,
    "status": "PASSED"
   },
   "wic.Wic.test_build_rootfs_short": {
    "duration": 36.86218571662903,
    "status": "PASSED"
   },
   "wic.Wic.test_change_directory": {
    "duration": 30.897937297821045,
    "status": "PASSED"
   },
   "wic.Wic.test_change_directory_errors": {
    "duration": 53.421305894851685,
    "status": "PASSED"
   },
   "wic.Wic.test_compress_bzip2": {
    "duration": 36.04104924201965,
    "status": "PASSED"
   },
   "wic.Wic.test_compress_gzip": {
    "duration": 32.69555330276489,
    "status": "PASSED"
   },
   "wic.Wic.test_compress_xz": {
    "duration": 37.62657332420349,
    "status": "PASSED"
   },
   "wic.Wic.test_debug_long": {
    "duration": 27.221380710601807,
    "status": "PASSED"
   },
   "wic.Wic.test_debug_short": {
    "duration": 24.788326740264893,
    "status": "PASSED"
   },
   "wic.Wic.test_default_output_dir": {
    "duration": 75.49288058280945,
    "status": "PASSED"
   },
   "wic.Wic.test_efi_bootpart": {
    "duration": 54.50566792488098,
    "status": "PASSED"
   },
   "wic.Wic.test_exclude_path": {
    "duration": 38.51637816429138,
    "status": "PASSED"
   },
   "wic.Wic.test_exclude_path_errors": {
    "duration": 48.922353744506836,
    "status": "PASSED"
   },
   "wic.Wic.test_exclude_path_with_extra_space": {
    "duration": 86.40367150306702,
    "status": "PASSED"
   },
   "wic.Wic.test_extra_space": {
    "duration": 24.494956016540527,
    "status": "PASSED"
   },
   "wic.Wic.test_gpt_image": {
    "duration": 26.063542366027832,
    "status": "PASSED"
   },
   "wic.Wic.test_grub_install_pcbios": {
    "duration": 93.6015191078186,
    "status": "PASSED"
   },
   "wic.Wic.test_include_path": {
    "duration": 37.15302133560181,
    "status": "PASSED"
   },
   "wic.Wic.test_include_path_embeded": {
    "duration": 39.791385889053345,
    "status": "PASSED"
   },
   "wic.Wic.test_include_path_errors": {
    "duration": 73.19472932815552,
    "status": "PASSED"
   },
   "wic.Wic.test_iso_image": {
    "duration": 91.75768375396729,
    "status": "PASSED"
   },
   "wic.Wic.test_kernel_install": {
    "duration": 32.63518929481506,
    "status": "PASSED"
   },
   "wic.Wic.test_mkefidisk": {
    "duration": 27.02088737487793,
    "status": "PASSED"
   },
   "wic.Wic.test_no_fstab_update": {
    "duration": 46.57070875167847,
    "status": "PASSED"
   },
   "wic.Wic.test_no_fstab_update_errors": {
    "duration": 46.50299024581909,
    "status": "PASSED"
   },
   "wic.Wic.test_no_table": {
    "duration": 28.17591094970703,
    "status": "PASSED"
   },
   "wic.Wic.test_partition_hidden_attributes": {
    "duration": 41.88577127456665,
    "status": "PASSED"
   },
   "wic.Wic.test_permissions": {
    "duration": 352.5718443393707,
    "status": "PASSED"
   },
   "wic.Wic.test_qemux86_directdisk": {
    "duration": 32.125527143478394,
    "status": "PASSED"
   },
   "wic.Wic.test_rootfs_artifacts": {
    "duration": 23.964773416519165,
    "status": "PASSED"
   },
   "wic.Wic.test_rootfs_indirect_recipes": {
    "duration": 34.287195920944214,
    "status": "PASSED"
   },
   "wic.Wic.test_sdimage_bootpart": {
    "duration": 55.67660069465637,
    "status": "PASSED"
   },
   "wic.Wic.test_skip_build_check_long": {
    "duration": 34.36707782745361,
    "status": "PASSED"
   },
   "wic.Wic.test_skip_build_check_short": {
    "duration": 32.19628643989563,
    "status": "PASSED"
   },
   "wic.Wic.test_skip_kernel_install": {
    "duration": 41.37575697898865,
    "status": "PASSED"
   },
   "wic.Wic.test_systemd_bootdisk": {
    "duration": 109.21688437461853,
    "status": "PASSED"
   },
   "wic.Wic.test_wic_sector_size_cli": {
    "duration": 94.86565685272217,
    "status": "PASSED"
   },
   "wic.Wic.test_wic_sector_size_env": {
    "duration": 88.85078716278076,
    "status": "PASSED"
   },
   "wic.Wic.test_wrong_compressor": {
    "duration": 5.14096212387085,
    "status": "PASSED"
   },
   "wic.Wic2.test_biosplusefi_plugin": {
    "duration": 219.3184871673584,
    "status": "PASSED"
   },
   "wic.Wic2.test_biosplusefi_plugin_qemu": {
    "duration": 39.318424463272095,
    "oetags": [
     "runqemu"
    ],
    "status": "PASSED"
   },
   "wic.Wic2.test_bmap_long": {
    "duration": 32.254231452941895,
    "status": "PASSED"
   },
   "wic.Wic2.test_bmap_short": {
    "duration": 30.073457717895508,
    "status": "PASSED"
   },
   "wic.Wic2.test_diskid_on_gpt_partition": {
    "duration": 32.13080048561096,
    "status": "PASSED"
   },
   "wic.Wic2.test_diskid_on_msdos_partition": {
    "duration": 32.10583734512329,
    "status": "PASSED"
   },
   "wic.Wic2.test_efi_plugin_plain_systemd_boot_qemu_aarch64": {
    "duration": 0.001405477523803711,
    "log": "Test skipped on x86_64\n",
    "oetags": [
     "runqemu"
    ],
    "status": "SKIPPED"
   },
   "wic.Wic2.test_efi_plugin_plain_systemd_boot_qemu_x86": {
    "duration": 185.1523313522339,
    "oetags": [
     "runqemu"
    ],
    "status": "PASSED"
   },
   "wic.Wic2.test_efi_plugin_unified_kernel_image_qemu": {
    "duration": 143.9878635406494,
    "oetags": [
     "runqemu"
    ],
    "status": "PASSED"
   },
   "wic.Wic2.test_empty_plugin": {
    "duration": 81.62919449806213,
    "status": "PASSED"
   },
   "wic.Wic2.test_empty_zeroize_plugin": {
    "duration": 45.83504867553711,
    "status": "PASSED"
   },
   "wic.Wic2.test_expand_mbr_image": {
    "duration": 76.1101565361023,
    "oetags": [
     "runqemu"
    ],
    "status": "PASSED"
   },
   "wic.Wic2.test_extra_filesystem_space": {
    "duration": 30.845959186553955,
    "status": "PASSED"
   },
   "wic.Wic2.test_extra_partition_plugin": {
    "duration": 78.51007223129272,
    "status": "PASSED"
   },
   "wic.Wic2.test_extra_partition_space": {
    "duration": 40.22124099731445,
    "status": "PASSED"
   },
   "wic.Wic2.test_fixed_size": {
    "duration": 43.42837834358215,
    "status": "PASSED"
   },
   "wic.Wic2.test_fixed_size_error": {
    "duration": 31.073812246322632,
    "status": "PASSED"
   },
   "wic.Wic2.test_fs_types": {
    "duration": 37.18392777442932,
    "status": "PASSED"
   },
   "wic.Wic2.test_gpt_partition_name": {
    "duration": 106.44327020645142,
    "status": "PASSED"
   },
   "wic.Wic2.test_image_bootpart_globbed": {
    "duration": 64.31205558776855,
    "status": "PASSED"
   },
   "wic.Wic2.test_image_env": {
    "duration": 58.60247850418091,
    "status": "PASSED"
   },
   "wic.Wic2.test_image_vars_dir_long": {
    "duration": 12.850297451019287,
    "status": "PASSED"
   },
   "wic.Wic2.test_image_vars_dir_short": {
    "duration": 11.038859844207764,
    "status": "PASSED"
   },
   "wic.Wic2.test_kickstart_parser": {
    "duration": 34.1563024520874,
    "status": "PASSED"
   },
   "wic.Wic2.test_mkfs_extraopts": {
    "duration": 35.025630235672,
    "status": "PASSED"
   },
   "wic.Wic2.test_offset": {
    "duration": 204.95859622955322,
    "status": "PASSED"
   },
   "wic.Wic2.test_qemu": {
    "duration": 135.57891964912415,
    "oetags": [
     "runqemu"
    ],
    "status": "PASSED"
   },
   "wic.Wic2.test_qemu_efi": {
    "duration": 111.22688937187195,
    "oetags": [
     "runqemu"
    ],
    "status": "PASSED"
   },
   "wic.Wic2.test_rawcopy_plugin": {
    "duration": 116.1887571811676,
    "status": "PASSED"
   },
   "wic.Wic2.test_rawcopy_plugin_qemu": {
    "duration": 125.67023658752441,
    "oetags": [
     "runqemu"
    ],
    "status": "PASSED"
   },
   "wic.Wic2.test_rawcopy_plugin_unpack": {
    "duration": 112.3394923210144,
    "status": "PASSED"
   },
   "wic.Wic2.test_uefi_kernel": {
    "duration": 132.78134512901306,
    "status": "PASSED"
   },
   "wic.Wic2.test_wic_image_type": {
    "duration": 76.16615891456604,
    "status": "PASSED"
   },
   "wrapper.WrapperTests.test_shebang_wrapper": {
    "duration": 33.56819939613342,
    "status": "PASSED"
   },
   "yoctotestresultsquerytests.TestResultsQueryTests.test_create_workdir": {
    "duration": 5.073606967926025,
    "status": "PASSED"
   },
   "yoctotestresultsquerytests.TestResultsQueryTests.test_get_sha1": {
    "duration": 0.09731197357177734,
    "status": "PASSED"
   }
  }
 }
}