{
 "runtime_core-image-minimal_qemuarmv5_20260902153947": {
  "configuration": {
   "DISTRO": "poky",
   "HOST_DISTRO": "ubuntu-25.04",
   "IMAGE_BASENAME": "core-image-minimal",
   "IMAGE_PKGTYPE": "rpm",
   "LAYERS": {
    "meta": {
     "branch": "mathieu/master-next",
     "commit": "a335dcb7911e689e2d30bee21409561b18d1aed1",
     "commit_count": 68653,
     "commit_time": 1788357671
    },
    "meta-poky": {
     "branch": "contrib/mathieu/master-next",
     "commit": "6ce984c0a3a68c2fdc3c32bc185b6729d09e7829",
     "commit_count": 1817,
     "commit_time": 1787392397
    },
    "meta-yocto-bsp": {
     "branch": "contrib/mathieu/master-next",
     "commit": "6ce984c0a3a68c2fdc3c32bc185b6729d09e7829",
     "commit_count": 1817,
     "commit_time": 1787392397
    }
   },
   "MACHINE": "qemuarmv5",
   "STARTTIME": "20260902153947",
   "TCLIBC": "glibc",
   "TEST_TYPE": "runtime"
  },
  "result": {
   "apt.AptRepoTest.test_apt_install_from_repo": {
    "duration": 0.0006372928619384766,
    "log": "Test requires apt to be installed",
    "status": "SKIPPED"
   },
   "buildcpio.BuildCpioTest.test_cpio": {
    "duration": 0.00027561187744140625,
    "log": "Test requires autoconf to be installed",
    "status": "SKIPPED"
   },
   "buildgalculator.GalculatorTest.test_galculator": {
    "duration": 0.001402139663696289,
    "log": "Test requires gtk+3 to be installed",
    "status": "SKIPPED"
   },
   "buildlzip.BuildLzipTest.test_lzip": {
    "duration": 0.00017905235290527344,
    "log": "Test requires autoconf to be installed",
    "status": "SKIPPED"
   },
   "connman.ConnmanTest.test_connmand_help": {
    "duration": 0.00013399124145507812,
    "log": "Test requires connman to be installed",
    "status": "SKIPPED"
   },
   "connman.ConnmanTest.test_connmand_running": {
    "duration": 0.00010180473327636719,
    "log": "Test case connman.ConnmanTest.test_connmand_running depends on connman.ConnmanTest.test_connmand_help but it didn't pass/run.",
    "status": "SKIPPED"
   },
   "date.DateTest.test_date": {
    "duration": 0.00014710426330566406,
    "log": "Test case date.DateTest.test_date depends on ssh.SSHTest.test_ssh but it didn't pass/run.",
    "status": "SKIPPED"
   },
   "df.DfTest.test_df": {
    "duration": 0.00017499923706054688,
    "log": "Test case df.DfTest.test_df depends on ssh.SSHTest.test_ssh but it didn't pass/run.",
    "status": "SKIPPED"
   },
   "dnf.DnfBasicTest.test_dnf_help": {
    "duration": 0.00011110305786132812,
    "log": "Test case dnf.DnfBasicTest.test_dnf_help depends on ssh.SSHTest.test_ssh but it didn't pass/run.",
    "status": "SKIPPED"
   },
   "dnf.DnfBasicTest.test_dnf_history": {
    "duration": 9.846687316894531e-05,
    "log": "Test case dnf.DnfBasicTest.test_dnf_history depends on dnf.DnfBasicTest.test_dnf_help but it didn't pass/run.",
    "status": "SKIPPED"
   },
   "dnf.DnfBasicTest.test_dnf_info": {
    "duration": 9.107589721679688e-05,
    "log": "Test case dnf.DnfBasicTest.test_dnf_info depends on dnf.DnfBasicTest.test_dnf_help but it didn't pass/run.",
    "status": "SKIPPED"
   },
   "dnf.DnfBasicTest.test_dnf_search": {
    "duration": 7.891654968261719e-05,
    "log": "Test case dnf.DnfBasicTest.test_dnf_search depends on dnf.DnfBasicTest.test_dnf_help but it didn't pass/run.",
    "status": "SKIPPED"
   },
   "dnf.DnfBasicTest.test_dnf_version": {
    "duration": 7.891654968261719e-05,
    "log": "Test case dnf.DnfBasicTest.test_dnf_version depends on dnf.DnfBasicTest.test_dnf_help but it didn't pass/run.",
    "status": "SKIPPED"
   },
   "dnf.DnfRepoTest.test_dnf_exclude": {
    "duration": 0.0001590251922607422,
    "log": "Test case dnf.DnfRepoTest.test_dnf_exclude depends on dnf.DnfRepoTest.test_dnf_makecache but it didn't pass/run.",
    "status": "SKIPPED"
   },
   "dnf.DnfRepoTest.test_dnf_install": {
    "duration": 0.00011968612670898438,
    "log": "Test case dnf.DnfRepoTest.test_dnf_install depends on dnf.DnfRepoTest.test_dnf_makecache but it didn't pass/run.",
    "status": "SKIPPED"
   },
   "dnf.DnfRepoTest.test_dnf_install_dependency": {
    "duration": 0.00011968612670898438,
    "log": "Test case dnf.DnfRepoTest.test_dnf_install_dependency depends on dnf.DnfRepoTest.test_dnf_install but it didn't pass/run.",
    "status": "SKIPPED"
   },
   "dnf.DnfRepoTest.test_dnf_install_from_disk": {
    "duration": 0.00010395050048828125,
    "log": "Test case dnf.DnfRepoTest.test_dnf_install_from_disk depends on dnf.DnfRepoTest.test_dnf_install_dependency but it didn't pass/run.",
    "status": "SKIPPED"
   },
   "dnf.DnfRepoTest.test_dnf_install_from_http": {
    "duration": 9.489059448242188e-05,
    "log": "Test case dnf.DnfRepoTest.test_dnf_install_from_http depends on dnf.DnfRepoTest.test_dnf_install_from_disk but it didn't pass/run.",
    "status": "SKIPPED"
   },
   "dnf.DnfRepoTest.test_dnf_installroot": {
    "duration": 0.0002493858337402344,
    "log": "Test case dnf.DnfRepoTest.test_dnf_installroot depends on dnf.DnfRepoTest.test_dnf_makecache but it didn't pass/run.",
    "status": "SKIPPED"
   },
   "dnf.DnfRepoTest.test_dnf_installroot_usrmerge": {
    "duration": 0.00017261505126953125,
    "log": "Test run when enable usrmerge",
    "status": "SKIPPED"
   },
   "dnf.DnfRepoTest.test_dnf_makecache": {
    "duration": 0.0004303455352783203,
    "log": "Test case dnf.DnfRepoTest.test_dnf_makecache depends on dnf.DnfBasicTest.test_dnf_help but it didn't pass/run.",
    "status": "SKIPPED"
   },
   "dnf.DnfRepoTest.test_dnf_reinstall": {
    "duration": 8.463859558105469e-05,
    "log": "Test case dnf.DnfRepoTest.test_dnf_reinstall depends on dnf.DnfRepoTest.test_dnf_install but it didn't pass/run.",
    "status": "SKIPPED"
   },
   "dnf.DnfRepoTest.test_dnf_repoinfo": {
    "duration": 8.988380432128906e-05,
    "log": "Test case dnf.DnfRepoTest.test_dnf_repoinfo depends on dnf.DnfRepoTest.test_dnf_makecache but it didn't pass/run.",
    "status": "SKIPPED"
   },
   "gcc.GccCompileTest.test_gcc_compile": {
    "duration": 0.00018858909606933594,
    "log": "Test requires gcc to be installed",
    "status": "SKIPPED"
   },
   "gcc.GccCompileTest.test_gpp2_compile": {
    "duration": 0.00013709068298339844,
    "log": "Test requires g++ to be installed",
    "status": "SKIPPED"
   },
   "gcc.GccCompileTest.test_gpp_compile": {
    "duration": 0.00011920928955078125,
    "log": "Test requires g++ to be installed",
    "status": "SKIPPED"
   },
   "gcc.GccCompileTest.test_make": {
    "duration": 0.00011301040649414062,
    "log": "Test requires make to be installed",
    "status": "SKIPPED"
   },
   "gi.GObjectIntrospectionTest.test_python": {
    "duration": 0.00014591217041015625,
    "log": "Test requires python3-pygobject to be installed",
    "status": "SKIPPED"
   },
   "go.CgoHelloworldTest.test_cgohelloworld": {
    "duration": 0.00015163421630859375,
    "log": "Test requires cgo-helloworld to be installed",
    "status": "SKIPPED"
   },
   "go.GoCompileTest.test_go_compile": {
    "duration": 0.00011682510375976562,
    "log": "Test requires go-runtime-dev to be installed",
    "status": "SKIPPED"
   },
   "go.GoCompileTest.test_go_module": {
    "duration": 0.00010538101196289062,
    "log": "Test requires go-runtime-dev to be installed",
    "status": "SKIPPED"
   },
   "go.GoHelloworldTest.test_gohelloworld": {
    "duration": 0.00012993812561035156,
    "log": "Test requires go-helloworld to be installed",
    "status": "SKIPPED"
   },
   "kernelmodule.KernelModuleTest.test_kernel_module": {
    "duration": 0.00015854835510253906,
    "log": "Test requires gcc to be installed",
    "status": "SKIPPED"
   },
   "ldd.LddTest.test_ldd": {
    "duration": 9.989738464355469e-05,
    "log": "Test case ldd.LddTest.test_ldd depends on ssh.SSHTest.test_ssh but it didn't pass/run.",
    "status": "SKIPPED"
   },
   "logrotate.LogrotateTest.test_logrotate_newlog": {
    "duration": 9.417533874511719e-05,
    "log": "Test case logrotate.LogrotateTest.test_logrotate_newlog depends on logrotate.LogrotateTest.test_logrotate_wtmp but it didn't pass/run.",
    "status": "SKIPPED"
   },
   "logrotate.LogrotateTest.test_logrotate_wtmp": {
    "duration": 0.00013589859008789062,
    "log": "Test requires logrotate to be installed",
    "status": "SKIPPED"
   },
   "oe_syslog.SyslogTest.test_syslog_running": {
    "duration": 0.00017571449279785156,
    "log": "Test case oe_syslog.SyslogTest.test_syslog_running depends on ssh.SSHTest.test_ssh but it didn't pass/run.",
    "status": "SKIPPED"
   },
   "oe_syslog.SyslogTestConfig.test_syslog_logger": {
    "duration": 0.00011301040649414062,
    "log": "Test case oe_syslog.SyslogTestConfig.test_syslog_logger depends on oe_syslog.SyslogTest.test_syslog_running but it didn't pass/run.",
    "status": "SKIPPED"
   },
   "oe_syslog.SyslogTestConfig.test_syslog_restart": {
    "duration": 9.083747863769531e-05,
    "log": "Test case oe_syslog.SyslogTestConfig.test_syslog_restart depends on oe_syslog.SyslogTest.test_syslog_running but it didn't pass/run.",
    "status": "SKIPPED"
   },
   "oe_syslog.SyslogTestConfig.test_syslog_startup_config": {
    "duration": 0.00021505355834960938,
    "log": "Test case oe_syslog.SyslogTestConfig.test_syslog_startup_config depends on oe_syslog.SyslogTestConfig.test_syslog_logger but it didn't pass/run.",
    "status": "SKIPPED"
   },
   "opkg.OpkgRepoTest.test_opkg_install_from_repo": {
    "duration": 0.0001983642578125,
    "log": "Test requires opkg to be installed",
    "status": "SKIPPED"
   },
   "pam.PamBasicTest.test_pam": {
    "duration": 0.0001735687255859375,
    "log": "Test requires shadow-base to be installed",
    "status": "SKIPPED"
   },
   "parselogs.ParseLogsTest.test_get_context": {
    "duration": 0.00023126602172851562,
    "status": "PASSED"
   },
   "parselogs.ParseLogsTest.test_parselogs": {
    "duration": 8.511543273925781e-05,
    "log": "Test case parselogs.ParseLogsTest.test_parselogs depends on ssh.SSHTest.test_ssh but it didn't pass/run.",
    "status": "SKIPPED"
   },
   "perl.PerlTest.test_perl_works": {
    "duration": 0.00010657310485839844,
    "log": "Test requires perl to be installed",
    "status": "SKIPPED"
   },
   "ping.PingTest.test_ping": {
    "duration": 0.030776023864746094,
    "status": "PASSED"
   },
   "ptest.PtestRunnerTest.test_ptestrunner_expectfail": {
    "duration": 0.00010895729064941406,
    "log": "Test requires ptest-runner to be installed",
    "status": "SKIPPED"
   },
   "ptest.PtestRunnerTest.test_ptestrunner_expectsuccess": {
    "duration": 8.678436279296875e-05,
    "log": "Test requires ptest-runner to be installed",
    "status": "SKIPPED"
   },
   "python.PythonTest.test_python3": {
    "duration": 0.00011372566223144531,
    "log": "Test requires python3-core to be installed",
    "status": "SKIPPED"
   },
   "rpm.RpmBasicTest.test_rpm_help": {
    "duration": 6.222724914550781e-05,
    "log": "Test case rpm.RpmBasicTest.test_rpm_help depends on ssh.SSHTest.test_ssh but it didn't pass/run.",
    "status": "SKIPPED"
   },
   "rpm.RpmBasicTest.test_rpm_query": {
    "duration": 5.6743621826171875e-05,
    "log": "Test case rpm.RpmBasicTest.test_rpm_query depends on rpm.RpmBasicTest.test_rpm_help but it didn't pass/run.",
    "status": "SKIPPED"
   },
   "rpm.RpmBasicTest.test_rpm_query_nonroot": {
    "duration": 5.507469177246094e-05,
    "log": "Test case rpm.RpmBasicTest.test_rpm_query_nonroot depends on rpm.RpmBasicTest.test_rpm_query but it didn't pass/run.",
    "status": "SKIPPED"
   },
   "rpm.RpmInstallRemoveTest.test_check_rpm_install_removal_log_file_size": {
    "duration": 6.127357482910156e-05,
    "log": "Test case rpm.RpmInstallRemoveTest.test_check_rpm_install_removal_log_file_size depends on rpm.RpmInstallRemoveTest.test_rpm_remove but it didn't pass/run.",
    "status": "SKIPPED"
   },
   "rpm.RpmInstallRemoveTest.test_rpm_install": {
    "duration": 5.412101745605469e-05,
    "log": "Test case rpm.RpmInstallRemoveTest.test_rpm_install depends on rpm.RpmBasicTest.test_rpm_query but it didn't pass/run.",
    "status": "SKIPPED"
   },
   "rpm.RpmInstallRemoveTest.test_rpm_remove": {
    "duration": 5.221366882324219e-05,
    "log": "Test case rpm.RpmInstallRemoveTest.test_rpm_remove depends on rpm.RpmInstallRemoveTest.test_rpm_install but it didn't pass/run.",
    "status": "SKIPPED"
   },
   "rust.RustCLibExampleTest.test_rust_c_lib_example": {
    "duration": 9.34600830078125e-05,
    "log": "Test requires rust-c-lib-example-bin to be installed",
    "status": "SKIPPED"
   },
   "rust.RustCompileTest.test_cargo_compile": {
    "duration": 9.059906005859375e-05,
    "log": "Test requires openssh-scp to be installed",
    "status": "SKIPPED"
   },
   "rust.RustCompileTest.test_rust_compile": {
    "duration": 7.581710815429688e-05,
    "log": "Test requires openssh-scp to be installed",
    "status": "SKIPPED"
   },
   "scp.ScpTest.test_scp_file": {
    "duration": 0.00012183189392089844,
    "log": "Test requires openssh-sftp-server, or openssh-scp to be installed",
    "status": "SKIPPED"
   },
   "ssh.SSHTest.test_ssh": {
    "duration": 0.00030422210693359375,
    "log": "Test requires openssh-sshd, or dropbear to be installed",
    "status": "SKIPPED"
   },
   "stap.StapTest.test_stap": {
    "duration": 0.00011301040649414062,
    "log": "Test requires kernel-devsrc to be installed",
    "status": "SKIPPED"
   },
   "systemd.SystemdBasicTests.test_systemd_basic": {
    "duration": 7.05718994140625e-05,
    "log": "Test case systemd.SystemdBasicTests.test_systemd_basic depends on ssh.SSHTest.test_ssh but it didn't pass/run.",
    "status": "SKIPPED"
   },
   "systemd.SystemdBasicTests.test_systemd_failed": {
    "duration": 6.079673767089844e-05,
    "log": "Test case systemd.SystemdBasicTests.test_systemd_failed depends on systemd.SystemdBasicTests.test_systemd_basic but it didn't pass/run.",
    "status": "SKIPPED"
   },
   "systemd.SystemdBasicTests.test_systemd_list": {
    "duration": 5.316734313964844e-05,
    "log": "Test case systemd.SystemdBasicTests.test_systemd_list depends on systemd.SystemdBasicTests.test_systemd_basic but it didn't pass/run.",
    "status": "SKIPPED"
   },
   "systemd.SystemdJournalTests.test_systemd_boot_time": {
    "duration": 9.465217590332031e-05,
    "log": "Test case systemd.SystemdJournalTests.test_systemd_boot_time depends on systemd.SystemdBasicTests.test_systemd_basic but it didn't pass/run.",
    "status": "SKIPPED"
   },
   "systemd.SystemdJournalTests.test_systemd_journal": {
    "duration": 9.608268737792969e-05,
    "log": "Test case systemd.SystemdJournalTests.test_systemd_journal depends on systemd.SystemdBasicTests.test_systemd_basic but it didn't pass/run.",
    "status": "SKIPPED"
   },
   "systemd.SystemdServiceTests.test_systemd_coredump_minidebuginfo": {
    "duration": 0.00014638900756835938,
    "log": "Test requires minidebuginfo to be in DISTRO_FEATURES",
    "status": "SKIPPED"
   },
   "systemd.SystemdServiceTests.test_systemd_disable_enable": {
    "duration": 8.535385131835938e-05,
    "log": "Test case systemd.SystemdServiceTests.test_systemd_disable_enable depends on systemd.SystemdServiceTests.test_systemd_status but it didn't pass/run.",
    "status": "SKIPPED"
   },
   "systemd.SystemdServiceTests.test_systemd_disable_enable_ro": {
    "duration": 8.702278137207031e-05,
    "log": "Test is only meant to run with read-only-rootfs in IMAGE_FEATURES",
    "status": "SKIPPED"
   },
   "systemd.SystemdServiceTests.test_systemd_status": {
    "duration": 5.817413330078125e-05,
    "log": "Test case systemd.SystemdServiceTests.test_systemd_status depends on systemd.SystemdBasicTests.test_systemd_basic but it didn't pass/run.",
    "status": "SKIPPED"
   },
   "systemd.SystemdServiceTests.test_systemd_stop_start": {
    "duration": 5.91278076171875e-05,
    "log": "Test case systemd.SystemdServiceTests.test_systemd_stop_start depends on systemd.SystemdServiceTests.test_systemd_status but it didn't pass/run.",
    "status": "SKIPPED"
   },
   "weston.WestonTest.test_wayland_info": {
    "duration": 8.392333984375e-05,
    "log": "Test requires wayland-utils to be installed",
    "status": "SKIPPED"
   },
   "weston.WestonTest.test_weston_can_initialize_new_wayland_compositor": {
    "duration": 7.62939453125e-05,
    "log": "Test requires weston to be installed",
    "status": "SKIPPED"
   },
   "weston.WestonTest.test_weston_running": {
    "duration": 7.915496826171875e-05,
    "log": "Test requires weston to be installed",
    "status": "SKIPPED"
   },
   "weston.WestonTest.test_weston_supports_xwayland": {
    "duration": 0.0004048347473144531,
    "log": "Test requires weston to be installed",
    "status": "SKIPPED"
   },
   "xorg.XorgTest.test_xorg_running": {
    "duration": 8.821487426757812e-05,
    "log": "Test requires xserver-nodm-init to be installed",
    "status": "SKIPPED"
   }
  }
 },
 "runtime_core-image-sato_qemuarmv5_20260902153947": {
  "configuration": {
   "DISTRO": "poky",
   "HOST_DISTRO": "ubuntu-25.04",
   "IMAGE_BASENAME": "core-image-sato",
   "IMAGE_PKGTYPE": "rpm",
   "LAYERS": {
    "meta": {
     "branch": "mathieu/master-next",
     "commit": "a335dcb7911e689e2d30bee21409561b18d1aed1",
     "commit_count": 68653,
     "commit_time": 1788357671
    },
    "meta-poky": {
     "branch": "contrib/mathieu/master-next",
     "commit": "6ce984c0a3a68c2fdc3c32bc185b6729d09e7829",
     "commit_count": 1817,
     "commit_time": 1787392397
    },
    "meta-yocto-bsp": {
     "branch": "contrib/mathieu/master-next",
     "commit": "6ce984c0a3a68c2fdc3c32bc185b6729d09e7829",
     "commit_count": 1817,
     "commit_time": 1787392397
    }
   },
   "MACHINE": "qemuarmv5",
   "STARTTIME": "20260902153947",
   "TCLIBC": "glibc",
   "TEST_TYPE": "runtime"
  },
  "result": {
   "apt.AptRepoTest.test_apt_install_from_repo": {
    "duration": 0.0007762908935546875,
    "log": "Test requires apt to be installed",
    "status": "SKIPPED"
   },
   "buildcpio.BuildCpioTest.test_cpio": {
    "duration": 0.0003707408905029297,
    "log": "Test requires autoconf to be installed",
    "status": "SKIPPED"
   },
   "buildgalculator.GalculatorTest.test_galculator": {
    "duration": 0.0003285408020019531,
    "log": "Test requires gtk+3 to be installed",
    "status": "SKIPPED"
   },
   "buildlzip.BuildLzipTest.test_lzip": {
    "duration": 0.001870870590209961,
    "log": "Test requires autoconf to be installed",
    "status": "SKIPPED"
   },
   "connman.ConnmanTest.test_connmand_help": {
    "duration": 1.054147481918335,
    "status": "PASSED"
   },
   "connman.ConnmanTest.test_connmand_running": {
    "duration": 1.0472924709320068,
    "status": "PASSED"
   },
   "date.DateTest.test_date": {
    "duration": 7.507471561431885,
    "status": "PASSED"
   },
   "df.DfTest.test_df": {
    "duration": 1.3590142726898193,
    "status": "PASSED"
   },
   "dnf.DnfBasicTest.test_dnf_help": {
    "duration": 34.28809881210327,
    "status": "PASSED"
   },
   "dnf.DnfBasicTest.test_dnf_history": {
    "duration": 12.120986700057983,
    "status": "PASSED"
   },
   "dnf.DnfBasicTest.test_dnf_info": {
    "duration": 10.870004892349243,
    "status": "PASSED"
   },
   "dnf.DnfBasicTest.test_dnf_search": {
    "duration": 5.9716198444366455,
    "status": "PASSED"
   },
   "dnf.DnfBasicTest.test_dnf_version": {
    "duration": 3.853276014328003,
    "status": "PASSED"
   },
   "dnf.DnfRepoTest.test_dnf_exclude": {
    "duration": 13.966448783874512,
    "status": "PASSED"
   },
   "dnf.DnfRepoTest.test_dnf_install": {
    "duration": 10.333162784576416,
    "status": "PASSED"
   },
   "dnf.DnfRepoTest.test_dnf_install_dependency": {
    "duration": 15.655818462371826,
    "status": "PASSED"
   },
   "dnf.DnfRepoTest.test_dnf_install_from_disk": {
    "duration": 16.50442624092102,
    "status": "PASSED"
   },
   "dnf.DnfRepoTest.test_dnf_install_from_http": {
    "duration": 10.206945896148682,
    "status": "PASSED"
   },
   "dnf.DnfRepoTest.test_dnf_installroot": {
    "duration": 76.04405498504639,
    "status": "PASSED"
   },
   "dnf.DnfRepoTest.test_dnf_installroot_usrmerge": {
    "duration": 0.00035858154296875,
    "log": "Test run when enable usrmerge",
    "status": "SKIPPED"
   },
   "dnf.DnfRepoTest.test_dnf_makecache": {
    "duration": 3.903254985809326,
    "status": "PASSED"
   },
   "dnf.DnfRepoTest.test_dnf_reinstall": {
    "duration": 5.468179941177368,
    "status": "PASSED"
   },
   "dnf.DnfRepoTest.test_dnf_repoinfo": {
    "duration": 4.096236705780029,
    "status": "PASSED"
   },
   "gcc.GccCompileTest.test_gcc_compile": {
    "duration": 0.0003445148468017578,
    "log": "Test requires gcc to be installed",
    "status": "SKIPPED"
   },
   "gcc.GccCompileTest.test_gpp2_compile": {
    "duration": 0.00026345252990722656,
    "log": "Test requires g++ to be installed",
    "status": "SKIPPED"
   },
   "gcc.GccCompileTest.test_gpp_compile": {
    "duration": 0.00020885467529296875,
    "log": "Test requires g++ to be installed",
    "status": "SKIPPED"
   },
   "gcc.GccCompileTest.test_make": {
    "duration": 0.0002155303955078125,
    "log": "Test requires make to be installed",
    "status": "SKIPPED"
   },
   "gi.GObjectIntrospectionTest.test_python": {
    "duration": 0.00022363662719726562,
    "log": "Test requires python3-pygobject to be installed",
    "status": "SKIPPED"
   },
   "go.CgoHelloworldTest.test_cgohelloworld": {
    "duration": 0.00022983551025390625,
    "log": "Test requires cgo-helloworld to be installed",
    "status": "SKIPPED"
   },
   "go.GoCompileTest.test_go_compile": {
    "duration": 0.00020933151245117188,
    "log": "Test requires go-runtime-dev to be installed",
    "status": "SKIPPED"
   },
   "go.GoCompileTest.test_go_module": {
    "duration": 0.00021076202392578125,
    "log": "Test requires go-runtime-dev to be installed",
    "status": "SKIPPED"
   },
   "go.GoHelloworldTest.test_gohelloworld": {
    "duration": 0.00021338462829589844,
    "log": "Test requires go-helloworld to be installed",
    "status": "SKIPPED"
   },
   "kernelmodule.KernelModuleTest.test_kernel_module": {
    "duration": 0.00024580955505371094,
    "log": "Test requires gcc to be installed",
    "status": "SKIPPED"
   },
   "ldd.LddTest.test_ldd": {
    "duration": 0.00023865699768066406,
    "log": "Test requires ldd to be installed",
    "status": "SKIPPED"
   },
   "logrotate.LogrotateTest.test_logrotate_newlog": {
    "duration": 0.00020384788513183594,
    "log": "Test case logrotate.LogrotateTest.test_logrotate_newlog depends on logrotate.LogrotateTest.test_logrotate_wtmp but it didn't pass/run.",
    "status": "SKIPPED"
   },
   "logrotate.LogrotateTest.test_logrotate_wtmp": {
    "duration": 0.00020194053649902344,
    "log": "Test requires logrotate to be installed",
    "status": "SKIPPED"
   },
   "oe_syslog.SyslogTest.test_syslog_running": {
    "duration": 0.7244491577148438,
    "status": "PASSED"
   },
   "oe_syslog.SyslogTestConfig.test_syslog_logger": {
    "duration": 2.1312479972839355,
    "status": "PASSED"
   },
   "oe_syslog.SyslogTestConfig.test_syslog_restart": {
    "duration": 6.419504642486572,
    "status": "PASSED"
   },
   "oe_syslog.SyslogTestConfig.test_syslog_startup_config": {
    "duration": 16.00189447402954,
    "status": "PASSED"
   },
   "opkg.OpkgRepoTest.test_opkg_install_from_repo": {
    "duration": 0.00045752525329589844,
    "log": "Test requires opkg to be installed",
    "status": "SKIPPED"
   },
   "pam.PamBasicTest.test_pam": {
    "duration": 0.0007135868072509766,
    "log": "Test requires pam to be in DISTRO_FEATURES",
    "status": "SKIPPED"
   },
   "parselogs.ParseLogsTest.test_get_context": {
    "duration": 0.0005037784576416016,
    "status": "PASSED"
   },
   "parselogs.ParseLogsTest.test_parselogs": {
    "duration": 5.040002822875977,
    "status": "PASSED"
   },
   "perl.PerlTest.test_perl_works": {
    "duration": 0.7322700023651123,
    "status": "PASSED"
   },
   "ping.PingTest.test_ping": {
    "duration": 0.017254114151000977,
    "status": "PASSED"
   },
   "ptest.PtestRunnerTest.test_ptestrunner_expectfail": {
    "duration": 0.00029206275939941406,
    "log": "Test requires ptest-runner to be installed",
    "status": "SKIPPED"
   },
   "ptest.PtestRunnerTest.test_ptestrunner_expectsuccess": {
    "duration": 0.00021767616271972656,
    "log": "Test requires ptest-runner to be installed",
    "status": "SKIPPED"
   },
   "python.PythonTest.test_python3": {
    "duration": 0.8653156757354736,
    "status": "PASSED"
   },
   "rpm.RpmBasicTest.test_rpm_help": {
    "duration": 0.7146642208099365,
    "status": "PASSED"
   },
   "rpm.RpmBasicTest.test_rpm_query": {
    "duration": 1.4216694831848145,
    "status": "PASSED"
   },
   "rpm.RpmBasicTest.test_rpm_query_nonroot": {
    "duration": 5.28657603263855,
    "status": "PASSED"
   },
   "rpm.RpmInstallRemoveTest.test_check_rpm_install_removal_log_file_size": {
    "duration": 25.410093784332275,
    "status": "PASSED"
   },
   "rpm.RpmInstallRemoveTest.test_rpm_install": {
    "duration": 2.0908894538879395,
    "status": "PASSED"
   },
   "rpm.RpmInstallRemoveTest.test_rpm_remove": {
    "duration": 1.0195591449737549,
    "status": "PASSED"
   },
   "rust.RustCLibExampleTest.test_rust_c_lib_example": {
    "duration": 0.0003578662872314453,
    "log": "Test requires rust-c-lib-example-bin to be installed",
    "status": "SKIPPED"
   },
   "rust.RustCompileTest.test_cargo_compile": {
    "duration": 0.00022983551025390625,
    "log": "Test requires openssh-scp to be installed",
    "status": "SKIPPED"
   },
   "rust.RustCompileTest.test_rust_compile": {
    "duration": 0.0002009868621826172,
    "log": "Test requires openssh-scp to be installed",
    "status": "SKIPPED"
   },
   "scp.ScpTest.test_scp_file": {
    "duration": 2.0375287532806396,
    "status": "PASSED"
   },
   "ssh.SSHTest.test_ssh": {
    "duration": 1.0069046020507812,
    "status": "PASSED"
   },
   "stap.StapTest.test_stap": {
    "duration": 0.00012874603271484375,
    "log": "Test requires kernel-devsrc to be installed",
    "status": "SKIPPED"
   },
   "systemd.SystemdBasicTests.test_systemd_basic": {
    "duration": 0.00015616416931152344,
    "log": "systemd is not the init manager for this image",
    "status": "SKIPPED"
   },
   "systemd.SystemdBasicTests.test_systemd_failed": {
    "duration": 9.059906005859375e-05,
    "log": "Test case systemd.SystemdBasicTests.test_systemd_failed depends on systemd.SystemdBasicTests.test_systemd_basic but it didn't pass/run.",
    "status": "SKIPPED"
   },
   "systemd.SystemdBasicTests.test_systemd_list": {
    "duration": 6.008148193359375e-05,
    "log": "Test case systemd.SystemdBasicTests.test_systemd_list depends on systemd.SystemdBasicTests.test_systemd_basic but it didn't pass/run.",
    "status": "SKIPPED"
   },
   "systemd.SystemdJournalTests.test_systemd_boot_time": {
    "duration": 7.486343383789062e-05,
    "log": "Test case systemd.SystemdJournalTests.test_systemd_boot_time depends on systemd.SystemdBasicTests.test_systemd_basic but it didn't pass/run.",
    "status": "SKIPPED"
   },
   "systemd.SystemdJournalTests.test_systemd_journal": {
    "duration": 5.745887756347656e-05,
    "log": "Test case systemd.SystemdJournalTests.test_systemd_journal depends on systemd.SystemdBasicTests.test_systemd_basic but it didn't pass/run.",
    "status": "SKIPPED"
   },
   "systemd.SystemdServiceTests.test_systemd_coredump_minidebuginfo": {
    "duration": 0.00011610984802246094,
    "log": "Test requires minidebuginfo to be in DISTRO_FEATURES",
    "status": "SKIPPED"
   },
   "systemd.SystemdServiceTests.test_systemd_disable_enable": {
    "duration": 9.298324584960938e-05,
    "log": "Test case systemd.SystemdServiceTests.test_systemd_disable_enable depends on systemd.SystemdServiceTests.test_systemd_status but it didn't pass/run.",
    "status": "SKIPPED"
   },
   "systemd.SystemdServiceTests.test_systemd_disable_enable_ro": {
    "duration": 0.00010704994201660156,
    "log": "Test is only meant to run with read-only-rootfs in IMAGE_FEATURES",
    "status": "SKIPPED"
   },
   "systemd.SystemdServiceTests.test_systemd_status": {
    "duration": 5.984306335449219e-05,
    "log": "Test case systemd.SystemdServiceTests.test_systemd_status depends on systemd.SystemdBasicTests.test_systemd_basic but it didn't pass/run.",
    "status": "SKIPPED"
   },
   "systemd.SystemdServiceTests.test_systemd_stop_start": {
    "duration": 6.0558319091796875e-05,
    "log": "Test case systemd.SystemdServiceTests.test_systemd_stop_start depends on systemd.SystemdServiceTests.test_systemd_status but it didn't pass/run.",
    "status": "SKIPPED"
   },
   "weston.WestonTest.test_wayland_info": {
    "duration": 8.296966552734375e-05,
    "log": "Test requires wayland-utils to be installed",
    "status": "SKIPPED"
   },
   "weston.WestonTest.test_weston_can_initialize_new_wayland_compositor": {
    "duration": 7.534027099609375e-05,
    "log": "Test requires weston to be installed",
    "status": "SKIPPED"
   },
   "weston.WestonTest.test_weston_running": {
    "duration": 7.581710815429688e-05,
    "log": "Test requires weston to be installed",
    "status": "SKIPPED"
   },
   "weston.WestonTest.test_weston_supports_xwayland": {
    "duration": 7.224082946777344e-05,
    "log": "Test requires weston to be installed",
    "status": "SKIPPED"
   },
   "xorg.XorgTest.test_xorg_running": {
    "duration": 1.4720344543457031,
    "status": "PASSED"
   }
  }
 },
 "sdk_core-image-sato_x86_64_qemuarmv5_20260902153947": {
  "configuration": {
   "HOST_DISTRO": "ubuntu-25.04",
   "IMAGE_BASENAME": "core-image-sato",
   "IMAGE_PKGTYPE": "rpm",
   "LAYERS": {
    "meta": {
     "branch": "mathieu/master-next",
     "commit": "a335dcb7911e689e2d30bee21409561b18d1aed1",
     "commit_count": 68653,
     "commit_time": 1788357671
    },
    "meta-poky": {
     "branch": "contrib/mathieu/master-next",
     "commit": "6ce984c0a3a68c2fdc3c32bc185b6729d09e7829",
     "commit_count": 1817,
     "commit_time": 1787392397
    },
    "meta-yocto-bsp": {
     "branch": "contrib/mathieu/master-next",
     "commit": "6ce984c0a3a68c2fdc3c32bc185b6729d09e7829",
     "commit_count": 1817,
     "commit_time": 1787392397
    }
   },
   "MACHINE": "qemuarmv5",
   "SDKMACHINE": "x86_64",
   "STARTTIME": "20260902153947",
   "TEST_TYPE": "sdk"
  },
  "result": {
   "autotools.AutotoolsTest.test_cpio": {
    "duration": 23.747110605239868,
    "status": "PASSED"
   },
   "cmake.CMakeTest.test_assimp": {
    "duration": 71.73699426651001,
    "status": "PASSED"
   },
   "gcc.GccCompileTest.test_gcc_compile": {
    "duration": 0.07481646537780762,
    "status": "PASSED"
   },
   "gcc.GccCompileTest.test_gpp2_compile": {
    "duration": 0.07860016822814941,
    "status": "PASSED"
   },
   "gcc.GccCompileTest.test_gpp_compile": {
    "duration": 0.23840832710266113,
    "status": "PASSED"
   },
   "gcc.GccCompileTest.test_make": {
    "duration": 0.0789952278137207,
    "status": "PASSED"
   },
   "go.GoCompileTest.test_go_build": {
    "duration": 0.00637054443359375,
    "log": "GoCompileTest class: go command not available: Command '. /srv/pokybuild/yocto-worker/qemuarmv5/build/build/tmp/work/qemuarmv5-poky-linux-gnueabi/core-image-sato/1.0/testimage-sdk/environment-setup-armv5e-poky-linux-gnueabi > /dev/null; which go;' returned non-zero exit status 1.\nStandard Output: ",
    "status": "SKIPPED"
   },
   "go.GoCompileTest.test_go_module": {
    "duration": 0.005467653274536133,
    "log": "GoCompileTest class: go command not available: Command '. /srv/pokybuild/yocto-worker/qemuarmv5/build/build/tmp/work/qemuarmv5-poky-linux-gnueabi/core-image-sato/1.0/testimage-sdk/environment-setup-armv5e-poky-linux-gnueabi > /dev/null; which go;' returned non-zero exit status 1.\nStandard Output: ",
    "status": "SKIPPED"
   },
   "go.GoHostCompileTest.test_go_cross_compile": {
    "duration": 0.006328582763671875,
    "log": "GoHostCompileTest class: go command not available: Command '. /srv/pokybuild/yocto-worker/qemuarmv5/build/build/tmp/work/qemuarmv5-poky-linux-gnueabi/core-image-sato/1.0/testimage-sdk/environment-setup-armv5e-poky-linux-gnueabi > /dev/null; which go;' returned non-zero exit status 1.\nStandard Output: ",
    "status": "SKIPPED"
   },
   "go.GoHostCompileTest.test_go_module_cross_compile": {
    "duration": 0.00672149658203125,
    "log": "GoHostCompileTest class: go command not available: Command '. /srv/pokybuild/yocto-worker/qemuarmv5/build/build/tmp/work/qemuarmv5-poky-linux-gnueabi/core-image-sato/1.0/testimage-sdk/environment-setup-armv5e-poky-linux-gnueabi > /dev/null; which go;' returned non-zero exit status 1.\nStandard Output: ",
    "status": "SKIPPED"
   },
   "gtk3.GTK3Test.test_libhandy": {
    "duration": 4.672053337097168,
    "status": "PASSED"
   },
   "kmod.KernelModuleTest.test_cryptodev": {
    "duration": 0.00013399124145507812,
    "log": "Test kmod.KernelModuleTest.test_cryptodev needs one of kernel-devsrc",
    "status": "SKIPPED"
   },
   "makefile.MakefileTest.test_lzip": {
    "duration": 1.366666316986084,
    "status": "PASSED"
   },
   "manifest.ManifestTest.test_manifests": {
    "duration": 0.00010228157043457031,
    "status": "PASSED"
   },
   "maturin.MaturinDevelopTest.test_maturin_develop": {
    "duration": 9.632110595703125e-05,
    "log": "Test maturin.MaturinDevelopTest.test_maturin_develop needs one of python3-maturin",
    "status": "SKIPPED"
   },
   "maturin.MaturinTest.test_maturin_list_python": {
    "duration": 8.654594421386719e-05,
    "log": "Test maturin.MaturinTest.test_maturin_list_python needs one of python3-maturin",
    "status": "SKIPPED"
   },
   "meson.MesonTest.test_iputils": {
    "duration": 2.8514392375946045,
    "status": "PASSED"
   },
   "perl.PerlTest.test_perl": {
    "duration": 0.012353658676147461,
    "status": "PASSED"
   },
   "python.Python3Test.test_python3": {
    "duration": 0.024384737014770508,
    "status": "PASSED"
   },
   "rust.RustCompileTest.test_cargo_build": {
    "duration": 13.271422147750854,
    "status": "PASSED"
   },
   "rust.RustHostCompileTest.test_cargo_build": {
    "duration": 13.755016565322876,
    "status": "PASSED"
   }
  }
 },
 "sdkext_core-image-minimal_x86_64_qemuarmv5_20260902153947": {
  "configuration": {
   "HOST_DISTRO": "ubuntu-25.04",
   "IMAGE_BASENAME": "core-image-minimal",
   "IMAGE_PKGTYPE": "rpm",
   "LAYERS": {
    "meta": {
     "branch": "mathieu/master-next",
     "commit": "a335dcb7911e689e2d30bee21409561b18d1aed1",
     "commit_count": 68653,
     "commit_time": 1788357671
    },
    "meta-poky": {
     "branch": "contrib/mathieu/master-next",
     "commit": "6ce984c0a3a68c2fdc3c32bc185b6729d09e7829",
     "commit_count": 1817,
     "commit_time": 1787392397
    },
    "meta-yocto-bsp": {
     "branch": "contrib/mathieu/master-next",
     "commit": "6ce984c0a3a68c2fdc3c32bc185b6729d09e7829",
     "commit_count": 1817,
     "commit_time": 1787392397
    }
   },
   "MACHINE": "qemuarmv5",
   "SDKMACHINE": "x86_64",
   "STARTTIME": "20260902153947",
   "TEST_TYPE": "sdkext"
  },
  "result": {
   "autotools.AutotoolsTest.test_cpio": {
    "duration": 25.201599836349487,
    "status": "PASSED"
   },
   "cmake.CMakeTest.test_assimp": {
    "duration": 71.96493887901306,
    "status": "PASSED"
   },
   "devtool.DevtoolTest.test_devtool_add_reset": {
    "duration": 12.43361234664917,
    "status": "PASSED"
   },
   "devtool.DevtoolTest.test_devtool_build_cmake": {
    "duration": 30.563051223754883,
    "status": "PASSED"
   },
   "devtool.DevtoolTest.test_devtool_build_esdk_package": {
    "duration": 24.010300159454346,
    "status": "PASSED"
   },
   "devtool.DevtoolTest.test_devtool_build_make": {
    "duration": 27.585017919540405,
    "status": "PASSED"
   },
   "devtool.DevtoolTest.test_devtool_kernelmodule": {
    "duration": 297.73804211616516,
    "log": "Traceback (most recent call last):\n  File \"/srv/pokybuild/yocto-worker/qemuarmv5/build/layers/openembedded-core/meta/lib/oeqa/sdkext/cases/devtool.py\", line 85, in test_devtool_kernelmodule\n    self._run('devtool build %s' % recipe)\n    ~~~~~~~~~^^^^^^^^^^^^^^^^^^^^^^^^^^^^^\n  File \"/srv/pokybuild/yocto-worker/qemuarmv5/build/layers/openembedded-core/meta/lib/oeqa/sdkext/case.py\", line 22, in _run\n    return subprocess.check_output(\". %s > /dev/null;\"\\\n           ~~~~~~~~~~~~~~~~~~~~~~~^^^^^^^^^^^^^^^^^^^^^\n        \" %s;\" % (self.tc.sdk_env, cmd), stderr=subprocess.STDOUT,\n        ^^^^^^^^^^^^^^^^^^^^^^^^^^^^^^^^^^^^^^^^^^^^^^^^^^^^^^^^^^\n        shell=True, env=env, universal_newlines=True)\n        ^^^^^^^^^^^^^^^^^^^^^^^^^^^^^^^^^^^^^^^^^^^^^\n  File \"/usr/lib/python3.13/subprocess.py\", line 472, in check_output\n    return run(*popenargs, stdout=PIPE, timeout=timeout, check=True,\n           ~~~^^^^^^^^^^^^^^^^^^^^^^^^^^^^^^^^^^^^^^^^^^^^^^^^^^^^^^\n               **kwargs).stdout\n               ^^^^^^^^^\n  File \"/usr/lib/python3.13/subprocess.py\", line 577, in run\n    raise CalledProcessError(retcode, process.args,\n                             output=stdout, stderr=stderr)\noeqa.utils.subprocesstweak.OETestCalledProcessError: Command '. /srv/pokybuild/yocto-worker/qemuarmv5/build/build/tmp/work/qemuarmv5-poky-linux-gnueabi/core-image-minimal/1.0/testsdkext/environment-setup-armv5e-poky-linux-gnueabi > /dev/null; devtool build kernel-module-hello-world;' returned non-zero exit status 1.\nStandard Output: NOTE: Reconnecting to bitbake server...\nLoading cache...done.\nLoaded 1988 entries from dependency cache.\nParsing recipes...done.\nParsing of 957 .bb files complete (956 cached, 1 parsed). 1989 targets, 65 skipped, 0 masked, 0 errors.\nRemoving 1 recipes from the armv5e sysroot...done.\nNOTE: Reconnecting to bitbake server...\nLoading cache...done.\nLoaded 1988 entries from dependency cache.\nParsing recipes...done.\nParsing of 957 .bb files complete (956 cached, 1 parsed). 1989 targets, 65 skipped, 0 masked, 0 errors.\nNOTE: Resolving any missing task queue dependencies\nInitialising tasks...done.\nChecking sstate mirror object availability...WARNING: /srv/pokybuild/yocto-worker/qemuarmv5/build/build/tmp/work/qemuarmv5-poky-linux-gnueabi/core-image-minimal/1.0/testsdkext/buildtools/sysroots/x86_64-pokysdk-linux/usr/lib/python3.14/tempfile.py:484: ResourceWarning: Implicitly cleaning up <HTTPError 404: 'Not Found'>\n  _warnings.warn(self.warn_message, ResourceWarning)\n\ndone.\nSstate summary: Wanted 137 Local 34 Mirrors 96 Missed 7 Current 127 (94% match, 97% complete)\nNOTE: Executing Tasks\nNOTE: Running setscene task 211 of 264 (virtual:native:/srv/pokybuild/yocto-worker/qemuarmv5/build/build/tmp/work/qemuarmv5-poky-linux-gnueabi/core-image-minimal/1.0/testsdkext/layers/openembedded-core/meta/recipes-core/util-linux/util-linux_2.42.2.bb:do_populate_sysroot_setscene)\nNOTE: Running setscene task 212 of 264 (/srv/pokybuild/yocto-worker/qemuarmv5/build/build/tmp/work/qemuarmv5-poky-linux-gnueabi/core-image-minimal/1.0/testsdkext/layers/openembedded-core/meta/recipes-kernel/linux/linux-yocto_6.18.bb:do_deploy_source_date_epoch_setscene)\nNOTE: Running setscene task 215 of 264 (virtual:native:/srv/pokybuild/yocto-worker/qemuarmv5/build/build/tmp/work/qemuarmv5-poky-linux-gnueabi/core-image-minimal/1.0/testsdkext/layers/openembedded-core/meta/recipes-kernel/kmod/kmod_34.2.bb:do_populate_sysroot_setscene)\nNOTE: Running setscene task 219 of 264 (virtual:native:/srv/pokybuild/yocto-worker/qemuarmv5/build/build/tmp/work/qemuarmv5-poky-linux-gnueabi/core-image-minimal/1.0/testsdkext/layers/openembedded-core/meta/recipes-devtools/bison/bison_3.8.2.bb:do_populate_sysroot_setscene)\nNOTE: Running setscene task 220 of 264 (virtual:native:/srv/pokybuild/yocto-worker/qemuarmv5/build/build/tmp/work/qemuarmv5-poky-linux-gnueabi/core-image-minimal/1.0/testsdkext/layers/openembedded-core/meta/recipes-extended/bc/bc_1.08.2.bb:do_populate_sysroot_setscene)\nNOTE: Running task 202 of 884 (/srv/pokybuild/yocto-worker/qemuarmv5/build/build/tmp/work/qemuarmv5-poky-linux-gnueabi/core-image-minimal/1.0/testsdkext/layers/openembedded-core/meta/recipes-kernel/make-mod-scripts/make-mod-scripts_1.0.bb:do_recipe_qa)\nNOTE: Running task 221 of 884 (/srv/pokybuild/yocto-worker/qemuarmv5/build/build/tmp/work/qemuarmv5-poky-linux-gnueabi/core-image-minimal/1.0/testsdkext/workspace/recipes/kernel-module-hello-world/kernel-module-hello-world_git.bb:do_deploy_source_date_epoch)\nNOTE: recipe linux-yocto-6.18.44+git-r0: task do_deploy_source_date_epoch_setscene: Started\nNOTE: recipe make-mod-scripts-1.0-r0: task do_recipe_qa: Started\nNOTE: recipe bison-native-3.8.2-r0: task do_populate_sysroot_setscene: Started\nNOTE: recipe bc-native-1.08.2-r0: task do_populate_sysroot_setscene: Started\nNOTE: recipe kmod-native-34.2-r0: task do_populate_sysroot_setscene: Started\nNOTE: recipe util-linux-native-2.42.2-r0: task do_populate_sysroot_setscene: Started\nNOTE: recipe bison-native-3.8.2-r0: task do_populate_sysroot_setscene: Succeeded\nNOTE: Running setscene task 224 of 264 (virtual:native:/srv/pokybuild/yocto-worker/qemuarmv5/build/build/tmp/work/qemuarmv5-poky-linux-gnueabi/core-image-minimal/1.0/testsdkext/layers/openembedded-core/meta/recipes-devtools/bison/bison_3.8.2.bb:do_recipe_qa_setscene)\nNOTE: recipe linux-yocto-6.18.44+git-r0: task do_deploy_source_date_epoch_setscene: Succeeded\nNOTE: recipe bc-native-1.08.2-r0: task do_populate_sysroot_setscene: Succeeded\nNOTE: recipe kmod-native-34.2-r0: task do_populate_sysroot_setscene: Succeeded\nNOTE: Running setscene task 225 of 264 (virtual:native:/srv/pokybuild/yocto-worker/qemuarmv5/build/build/tmp/work/qemuarmv5-poky-linux-gnueabi/core-image-minimal/1.0/testsdkext/layers/openembedded-core/meta/recipes-devtools/patch/patch_2.8.bb:do_populate_sysroot_setscene)\nNOTE: Running setscene task 226 of 264 (/srv/pokybuild/yocto-worker/qemuarmv5/build/build/tmp/work/qemuarmv5-poky-linux-gnueabi/core-image-minimal/1.0/testsdkext/layers/openembedded-core/meta/recipes-kernel/kern-tools/kern-tools-native_git.bb:do_populate_sysroot_setscene)\nNOTE: Running setscene task 227 of 264 (/srv/pokybuild/yocto-worker/qemuarmv5/build/build/tmp/work/qemuarmv5-poky-linux-gnueabi/core-image-minimal/1.0/testsdkext/layers/openembedded-core/meta/recipes-kernel/linux/linux-yocto_6.18.bb:do_recipe_qa_setscene)\nNOTE: Running setscene task 229 of 264 (virtual:native:/srv/pokybuild/yocto-worker/qemuarmv5/build/build/tmp/work/qemuarmv5-poky-linux-gnueabi/core-image-minimal/1.0/testsdkext/layers/openembedded-core/meta/recipes-extended/bc/bc_1.08.2.bb:do_recipe_qa_setscene)\nNOTE: Running setscene task 231 of 264 (virtual:native:/srv/pokybuild/yocto-worker/qemuarmv5/build/build/tmp/work/qemuarmv5-poky-linux-gnueabi/core-image-minimal/1.0/testsdkext/layers/openembedded-core/meta/recipes-kernel/kmod/kmod_34.2.bb:do_recipe_qa_setscene)\nNOTE: recipe make-mod-scripts-1.0-r0: task do_recipe_qa: Succeeded\nNOTE: Running task 223 of 884 (/srv/pokybuild/yocto-worker/qemuarmv5/build/build/tmp/work/qemuarmv5-poky-linux-gnueabi/core-image-minimal/1.0/testsdkext/layers/openembedded-core/meta/recipes-kernel/make-mod-scripts/make-mod-scripts_1.0.bb:do_fetch)\nNOTE: recipe kern-tools-native-0.3+git-r0: task do_populate_sysroot_setscene: Started\nNOTE: recipe bison-native-3.8.2-r0: task do_recipe_qa_setscene: Started\nNOTE: recipe patch-native-2.8-r0: task do_populate_sysroot_setscene: Started\nNOTE: recipe linux-yocto-6.18.44+git-r0: task do_recipe_qa_setscene: Started\nNOTE: recipe bc-native-1.08.2-r0: task do_recipe_qa_setscene: Started\nNOTE: recipe make-mod-scripts-1.0-r0: task do_fetch: Started\nNOTE: recipe kern-tools-native-0.3+git-r0: task do_populate_sysroot_setscene: Succeeded\nNOTE: recipe make-mod-scripts-1.0-r0: task do_fetch: Succeeded\nNOTE: Running setscene task 232 of 264 (virtual:native:/srv/pokybuild/yocto-worker/qemuarmv5/build/build/tmp/work/qemuarmv5-poky-linux-gnueabi/core-image-minimal/1.0/testsdkext/layers/openembedded-core/meta/recipes-devtools/git/git_2.55.0.bb:do_populate_sysroot_setscene)\nNOTE: Running setscene task 234 of 264 (/srv/pokybuild/yocto-worker/qemuarmv5/build/build/tmp/work/qemuarmv5-poky-linux-gnueabi/core-image-minimal/1.0/testsdkext/layers/openembedded-core/meta/recipes-kernel/kern-tools/kern-tools-native_git.bb:do_recipe_qa_setscene)\nNOTE: recipe bison-native-3.8.2-r0: task do_recipe_qa_setscene: Succeeded\nNOTE: recipe kmod-native-34.2-r0: task do_recipe_qa_setscene: Started\nNOTE: Running task 227 of 884 (/srv/pokybuild/yocto-worker/qemuarmv5/build/build/tmp/work/qemuarmv5-poky-linux-gnueabi/core-image-minimal/1.0/testsdkext/layers/openembedded-core/meta/recipes-kernel/make-mod-scripts/make-mod-scripts_1.0.bb:do_unpack)\nNOTE: recipe patch-native-2.8-r0: task do_populate_sysroot_setscene: Succeeded\nNOTE: recipe bc-native-1.08.2-r0: task do_recipe_qa_setscene: Succeeded\nNOTE: Running setscene task 236 of 264 (virtual:native:/srv/pokybuild/yocto-worker/qemuarmv5/build/build/tmp/work/qemuarmv5-poky-linux-gnueabi/core-image-minimal/1.0/testsdkext/layers/openembedded-core/meta/recipes-devtools/patch/patch_2.8.bb:do_recipe_qa_setscene)\nNOTE: recipe linux-yocto-6.18.44+git-r0: task do_recipe_qa_setscene: Succeeded\nNOTE: recipe kmod-native-34.2-r0: task do_recipe_qa_setscene: Succeeded\nNOTE: Running task 232 of 884 (/srv/pokybuild/yocto-worker/qemuarmv5/build/build/tmp/work/qemuarmv5-poky-linux-gnueabi/core-image-minimal/1.0/testsdkext/layers/openembedded-core/meta/recipes-kernel/linux/linux-yocto_6.18.bb:do_fetch)\nNOTE: recipe kern-tools-native-0.3+git-r0: task do_recipe_qa_setscene: Started\nNOTE: recipe make-mod-scripts-1.0-r0: task do_unpack: Started\nNOTE: recipe make-mod-scripts-1.0-r0: task do_unpack: Succeeded\nNOTE: recipe git-native-2.55.0-r0: task do_populate_sysroot_setscene: Started\nNOTE: recipe kern-tools-native-0.3+git-r0: task do_recipe_qa_setscene: Succeeded\nNOTE: recipe util-linux-native-2.42.2-r0: task do_populate_sysroot_setscene: Succeeded\nNOTE: Running setscene task 237 of 264 (virtual:native:/srv/pokybuild/yocto-worker/qemuarmv5/build/build/tmp/work/qemuarmv5-poky-linux-gnueabi/core-image-minimal/1.0/testsdkext/layers/openembedded-core/meta/recipes-support/libcap-ng/libcap-ng_0.9.5.bb:do_populate_sysroot_setscene)\nNOTE: Running setscene task 242 of 264 (virtual:native:/srv/pokybuild/yocto-worker/qemuarmv5/build/build/tmp/work/qemuarmv5-poky-linux-gnueabi/core-image-minimal/1.0/testsdkext/layers/openembedded-core/meta/recipes-core/util-linux/util-linux_2.42.2.bb:do_recipe_qa_setscene)\nNOTE: recipe patch-native-2.8-r0: task do_recipe_qa_setscene: Started\nNOTE: recipe linux-yocto-6.18.44+git-r0: task do_fetch: Started\nNOTE: recipe patch-native-2.8-r0: task do_recipe_qa_setscene: Succeeded\nNOTE: recipe libcap-ng-native-0.9.5-r0: task do_populate_sysroot_setscene: Started\nNOTE: recipe util-linux-native-2.42.2-r0: task do_recipe_qa_setscene: Started\nNOTE: recipe libcap-ng-native-0.9.5-r0: task do_populate_sysroot_setscene: Succeeded\nNOTE: Running setscene task 249 of 264 (virtual:native:/srv/pokybuild/yocto-worker/qemuarmv5/build/build/tmp/work/qemuarmv5-poky-linux-gnueabi/core-image-minimal/1.0/testsdkext/layers/openembedded-core/meta/recipes-devtools/pkgconf/pkgconf_3.0.6.bb:do_populate_sysroot_setscene)\nNOTE: Running setscene task 251 of 264 (virtual:native:/srv/pokybuild/yocto-worker/qemuarmv5/build/build/tmp/work/qemuarmv5-poky-linux-gnueabi/core-image-minimal/1.0/testsdkext/layers/openembedded-core/meta/recipes-support/libcap-ng/libcap-ng_0.9.5.bb:do_recipe_qa_setscene)\nNOTE: recipe util-linux-native-2.42.2-r0: task do_recipe_qa_setscene: Succeeded\nNOTE: recipe pkgconf-native-3.0.6-r0: task do_populate_sysroot_setscene: Started\nNOTE: recipe libcap-ng-native-0.9.5-r0: task do_recipe_qa_setscene: Started\nNOTE: recipe kernel-module-hello-world-1.0+git-r0: task do_deploy_source_date_epoch: Started\nNOTE: recipe libcap-ng-native-0.9.5-r0: task do_recipe_qa_setscene: Succeeded\nNOTE: recipe kernel-module-hello-world-1.0+git-r0: task do_deploy_source_date_epoch: Succeeded\nNOTE: recipe pkgconf-native-3.0.6-r0: task do_populate_sysroot_setscene: Succeeded\nNOTE: Running setscene task 253 of 264 (virtual:native:/srv/pokybuild/yocto-worker/qemuarmv5/build/build/tmp/work/qemuarmv5-poky-linux-gnueabi/core-image-minimal/1.0/testsdkext/layers/openembedded-core/meta/recipes-devtools/pkgconf/pkgconf_3.0.6.bb:do_recipe_qa_setscene)\nNOTE: recipe pkgconf-native-3.0.6-r0: task do_recipe_qa_setscene: Started\nNOTE: recipe pkgconf-native-3.0.6-r0: task do_recipe_qa_setscene: Succeeded\nNOTE: recipe git-native-2.55.0-r0: task do_populate_sysroot_setscene: Succeeded\nNOTE: Running setscene task 255 of 264 (virtual:native:/srv/pokybuild/yocto-worker/qemuarmv5/build/build/tmp/work/qemuarmv5-poky-linux-gnueabi/core-image-minimal/1.0/testsdkext/layers/openembedded-core/meta/recipes-devtools/git/git_2.55.0.bb:do_recipe_qa_setscene)\nNOTE: Running setscene task 262 of 264 (/srv/pokybuild/yocto-worker/qemuarmv5/build/build/tmp/work/qemuarmv5-poky-linux-gnueabi/core-image-minimal/1.0/testsdkext/layers/openembedded-core/meta/recipes-devtools/quilt/quilt-native_0.69.bb:do_populate_sysroot_setscene)\nNOTE: recipe quilt-native-0.69-r0: task do_populate_sysroot_setscene: Started\nNOTE: recipe git-native-2.55.0-r0: task do_recipe_qa_setscene: Started\nNOTE: recipe quilt-native-0.69-r0: task do_populate_sysroot_setscene: Succeeded\nNOTE: Running setscene task 264 of 264 (/srv/pokybuild/yocto-worker/qemuarmv5/build/build/tmp/work/qemuarmv5-poky-linux-gnueabi/core-image-minimal/1.0/testsdkext/layers/openembedded-core/meta/recipes-devtools/quilt/quilt-native_0.69.bb:do_recipe_qa_setscene)\nNOTE: recipe git-native-2.55.0-r0: task do_recipe_qa_setscene: Succeeded\nNOTE: recipe quilt-native-0.69-r0: task do_recipe_qa_setscene: Started\nNOTE: recipe quilt-native-0.69-r0: task do_recipe_qa_setscene: Succeeded\nNOTE: Running task 780 of 884 (/srv/pokybuild/yocto-worker/qemuarmv5/build/build/tmp/work/qemuarmv5-poky-linux-gnueabi/core-image-minimal/1.0/testsdkext/layers/openembedded-core/meta/recipes-kernel/make-mod-scripts/make-mod-scripts_1.0.bb:do_patch)\nNOTE: Running task 829 of 884 (/srv/pokybuild/yocto-worker/qemuarmv5/build/build/tmp/work/qemuarmv5-poky-linux-gnueabi/core-image-minimal/1.0/testsdkext/layers/openembedded-core/meta/recipes-kernel/make-mod-scripts/make-mod-scripts_1.0.bb:do_prepare_recipe_sysroot)\nNOTE: Running task 832 of 884 (/srv/pokybuild/yocto-worker/qemuarmv5/build/build/tmp/work/qemuarmv5-poky-linux-gnueabi/core-image-minimal/1.0/testsdkext/workspace/recipes/kernel-module-hello-world/kernel-module-hello-world_git.bb:do_prepare_recipe_sysroot)\nNOTE: recipe make-mod-scripts-1.0-r0: task do_patch: Started\nNOTE: recipe make-mod-scripts-1.0-r0: task do_prepare_recipe_sysroot: Started\nNOTE: recipe make-mod-scripts-1.0-r0: task do_patch: Succeeded\nNOTE: Running task 861 of 884 (/srv/pokybuild/yocto-worker/qemuarmv5/build/build/tmp/work/qemuarmv5-poky-linux-gnueabi/core-image-minimal/1.0/testsdkext/layers/openembedded-core/meta/recipes-kernel/make-mod-scripts/make-mod-scripts_1.0.bb:do_deploy_source_date_epoch)\nNOTE: recipe make-mod-scripts-1.0-r0: task do_prepare_recipe_sysroot: Succeeded\nNOTE: recipe make-mod-scripts-1.0-r0: task do_deploy_source_date_epoch: Started\nNOTE: recipe make-mod-scripts-1.0-r0: task do_deploy_source_date_epoch: Succeeded\nNOTE: recipe kernel-module-hello-world-1.0+git-r0: task do_prepare_recipe_sysroot: Started\nNOTE: recipe kernel-module-hello-world-1.0+git-r0: task do_prepare_recipe_sysroot: Succeeded\nNOTE: recipe linux-yocto-6.18.44+git-r0: task do_fetch: Succeeded\nNOTE: Running task 862 of 884 (/srv/pokybuild/yocto-worker/qemuarmv5/build/build/tmp/work/qemuarmv5-poky-linux-gnueabi/core-image-minimal/1.0/testsdkext/layers/openembedded-core/meta/recipes-kernel/linux/linux-yocto_6.18.bb:do_unpack)\nNOTE: I/O pressure (>20000.0us) is limiting task startup\nNOTE: No pressure is limiting task startup\nNOTE: Running task 863 of 884 (/srv/pokybuild/yocto-worker/qemuarmv5/build/build/tmp/work/qemuarmv5-poky-linux-gnueabi/core-image-minimal/1.0/testsdkext/layers/openembedded-core/meta/recipes-kernel/linux/linux-yocto_6.18.bb:do_prepare_recipe_sysroot)\nNOTE: recipe linux-yocto-6.18.44+git-r0: task do_unpack: Started\nNOTE: recipe linux-yocto-6.18.44+git-r0: task do_prepare_recipe_sysroot: Started\nNOTE: recipe linux-yocto-6.18.44+git-r0: task do_prepare_recipe_sysroot: Succeeded\nNOTE: recipe linux-yocto-6.18.44+git-r0: task do_unpack: Succeeded\nNOTE: Running task 864 of 884 (/srv/pokybuild/yocto-worker/qemuarmv5/build/build/tmp/work/qemuarmv5-poky-linux-gnueabi/core-image-minimal/1.0/testsdkext/layers/openembedded-core/meta/recipes-kernel/linux/linux-yocto_6.18.bb:do_symlink_kernsrc)\nNOTE: recipe linux-yocto-6.18.44+git-r0: task do_symlink_kernsrc: Started\nNOTE: recipe linux-yocto-6.18.44+git-r0: task do_symlink_kernsrc: Succeeded\nNOTE: Running task 865 of 884 (/srv/pokybuild/yocto-worker/qemuarmv5/build/build/tmp/work/qemuarmv5-poky-linux-gnueabi/core-image-minimal/1.0/testsdkext/layers/openembedded-core/meta/recipes-kernel/linux/linux-yocto_6.18.bb:do_kernel_checkout)\nNOTE: recipe linux-yocto-6.18.44+git-r0: task do_kernel_checkout: Started\nNOTE: recipe linux-yocto-6.18.44+git-r0: task do_kernel_checkout: Succeeded\nNOTE: Running task 866 of 884 (/srv/pokybuild/yocto-worker/qemuarmv5/build/build/tmp/work/qemuarmv5-poky-linux-gnueabi/core-image-minimal/1.0/testsdkext/layers/openembedded-core/meta/recipes-kernel/linux/linux-yocto_6.18.bb:do_validate_branches)\nNOTE: recipe linux-yocto-6.18.44+git-r0: task do_validate_branches: Started\nNOTE: recipe linux-yocto-6.18.44+git-r0: task do_validate_branches: Succeeded\nNOTE: Running task 867 of 884 (/srv/pokybuild/yocto-worker/qemuarmv5/build/build/tmp/work/qemuarmv5-poky-linux-gnueabi/core-image-minimal/1.0/testsdkext/layers/openembedded-core/meta/recipes-kernel/linux/linux-yocto_6.18.bb:do_kernel_metadata)\nNOTE: recipe linux-yocto-6.18.44+git-r0: task do_kernel_metadata: Started\nNOTE: recipe linux-yocto-6.18.44+git-r0: task do_kernel_metadata: Succeeded\nNOTE: Running task 868 of 884 (/srv/pokybuild/yocto-worker/qemuarmv5/build/build/tmp/work/qemuarmv5-poky-linux-gnueabi/core-image-minimal/1.0/testsdkext/layers/openembedded-core/meta/recipes-kernel/linux/linux-yocto_6.18.bb:do_patch)\nNOTE: Running task 869 of 884 (/srv/pokybuild/yocto-worker/qemuarmv5/build/build/tmp/work/qemuarmv5-poky-linux-gnueabi/core-image-minimal/1.0/testsdkext/layers/openembedded-core/meta/recipes-kernel/linux/linux-yocto_6.18.bb:do_kernel_version_sanity_check)\nNOTE: recipe linux-yocto-6.18.44+git-r0: task do_patch: Started\nNOTE: recipe linux-yocto-6.18.44+git-r0: task do_kernel_version_sanity_check: Started\nNOTE: recipe linux-yocto-6.18.44+git-r0: task do_kernel_version_sanity_check: Succeeded\nNOTE: recipe linux-yocto-6.18.44+git-r0: task do_patch: Succeeded\nNOTE: Running task 870 of 884 (/srv/pokybuild/yocto-worker/qemuarmv5/build/build/tmp/work/qemuarmv5-poky-linux-gnueabi/core-image-minimal/1.0/testsdkext/layers/openembedded-core/meta/recipes-kernel/linux/linux-yocto_6.18.bb:do_kernel_configme)\nNOTE: recipe linux-yocto-6.18.44+git-r0: task do_kernel_configme: Started\nNOTE: recipe linux-yocto-6.18.44+git-r0: task do_kernel_configme: Succeeded\nNOTE: Running task 872 of 884 (/srv/pokybuild/yocto-worker/qemuarmv5/build/build/tmp/work/qemuarmv5-poky-linux-gnueabi/core-image-minimal/1.0/testsdkext/layers/openembedded-core/meta/recipes-kernel/linux/linux-yocto_6.18.bb:do_configure)\nNOTE: recipe linux-yocto-6.18.44+git-r0: task do_configure: Started\nNOTE: recipe linux-yocto-6.18.44+git-r0: task do_configure: Succeeded\nNOTE: Running task 873 of 884 (/srv/pokybuild/yocto-worker/qemuarmv5/build/build/tmp/work/qemuarmv5-poky-linux-gnueabi/core-image-minimal/1.0/testsdkext/layers/openembedded-core/meta/recipes-kernel/linux/linux-yocto_6.18.bb:do_kernel_configcheck)\nNOTE: recipe linux-yocto-6.18.44+git-r0: task do_kernel_configcheck: Started\nNOTE: recipe linux-yocto-6.18.44+git-r0: task do_kernel_configcheck: Succeeded\nNOTE: Running task 874 of 884 (/srv/pokybuild/yocto-worker/qemuarmv5/build/build/tmp/work/qemuarmv5-poky-linux-gnueabi/core-image-minimal/1.0/testsdkext/layers/openembedded-core/meta/recipes-kernel/linux/linux-yocto_6.18.bb:do_compile)\nNOTE: recipe linux-yocto-6.18.44+git-r0: task do_compile: Started\nNOTE: recipe linux-yocto-6.18.44+git-r0: task do_compile: Succeeded\nNOTE: Running task 875 of 884 (/srv/pokybuild/yocto-worker/qemuarmv5/build/build/tmp/work/qemuarmv5-poky-linux-gnueabi/core-image-minimal/1.0/testsdkext/layers/openembedded-core/meta/recipes-kernel/linux/linux-yocto_6.18.bb:do_shared_workdir)\nNOTE: recipe linux-yocto-6.18.44+git-r0: task do_shared_workdir: Started\nNOTE: recipe linux-yocto-6.18.44+git-r0: task do_shared_workdir: Succeeded\nNOTE: Running task 876 of 884 (/srv/pokybuild/yocto-worker/qemuarmv5/build/build/tmp/work/qemuarmv5-poky-linux-gnueabi/core-image-minimal/1.0/testsdkext/layers/openembedded-core/meta/recipes-kernel/linux/linux-yocto_6.18.bb:do_compile_kernelmodules)\nNOTE: Running task 877 of 884 (/srv/pokybuild/yocto-worker/qemuarmv5/build/build/tmp/work/qemuarmv5-poky-linux-gnueabi/core-image-minimal/1.0/testsdkext/layers/openembedded-core/meta/recipes-kernel/make-mod-scripts/make-mod-scripts_1.0.bb:do_configure)\nNOTE: recipe make-mod-scripts-1.0-r0: task do_configure: Started\nNOTE: recipe linux-yocto-6.18.44+git-r0: task do_compile_kernelmodules: Started\nNOTE: recipe make-mod-scripts-1.0-r0: task do_configure: Succeeded\nNOTE: recipe linux-yocto-6.18.44+git-r0: task do_compile_kernelmodules: Succeeded\nNOTE: Running task 878 of 884 (/srv/pokybuild/yocto-worker/qemuarmv5/build/build/tmp/work/qemuarmv5-poky-linux-gnueabi/core-image-minimal/1.0/testsdkext/layers/openembedded-core/meta/recipes-kernel/make-mod-scripts/make-mod-scripts_1.0.bb:do_compile)\nNOTE: recipe make-mod-scripts-1.0-r0: task do_compile: Started\nNOTE: recipe make-mod-scripts-1.0-r0: task do_compile: Succeeded\nNOTE: Running task 879 of 884 (/srv/pokybuild/yocto-worker/qemuarmv5/build/build/tmp/work/qemuarmv5-poky-linux-gnueabi/core-image-minimal/1.0/testsdkext/workspace/recipes/kernel-module-hello-world/kernel-module-hello-world_git.bb:do_configure)\nNOTE: recipe kernel-module-hello-world-1.0+git-r0: task do_configure: Started\nNOTE: recipe kernel-module-hello-world-1.0+git-r0: task do_configure: Succeeded\nNOTE: Running task 880 of 884 (/srv/pokybuild/yocto-worker/qemuarmv5/build/build/tmp/work/qemuarmv5-poky-linux-gnueabi/core-image-minimal/1.0/testsdkext/workspace/recipes/kernel-module-hello-world/kernel-module-hello-world_git.bb:do_compile)\nNOTE: recipe kernel-module-hello-world-1.0+git-r0: task do_compile: Started\nNOTE: kernel-module-hello-world: compiling from external source tree /srv/pokybuild/yocto-worker/qemuarmv5/build/build/tmp/work/qemuarmv5-poky-linux-gnueabi/core-image-minimal/1.0/testsdkext/workspace/sources/kernel-module-hello-world\nNOTE: recipe kernel-module-hello-world-1.0+git-r0: task do_compile: Succeeded\nNOTE: Running task 881 of 884 (/srv/pokybuild/yocto-worker/qemuarmv5/build/build/tmp/work/qemuarmv5-poky-linux-gnueabi/core-image-minimal/1.0/testsdkext/workspace/recipes/kernel-module-hello-world/kernel-module-hello-world_git.bb:do_install)\nNOTE: recipe kernel-module-hello-world-1.0+git-r0: task do_install: Started\nERROR: kernel-module-hello-world-1.0+git-r0 do_install: oe_runmake failed\nERROR: kernel-module-hello-world-1.0+git-r0 do_install: Execution of '/srv/pokybuild/yocto-worker/qemuarmv5/build/build/tmp/work/qemuarmv5-poky-linux-gnueabi/core-image-minimal/1.0/testsdkext/tmp/work/qemuarmv5-poky-linux-gnueabi/kernel-module-hello-world/1.0+git/temp/run.do_install.1835605' failed with exit code 1\nERROR: Logfile of failure stored in: /srv/pokybuild/yocto-worker/qemuarmv5/build/build/tmp/work/qemuarmv5-poky-linux-gnueabi/core-image-minimal/1.0/testsdkext/tmp/work/qemuarmv5-poky-linux-gnueabi/kernel-module-hello-world/1.0+git/temp/log.do_install.1835605\nLog data follows:\n| DEBUG: Executing python function extend_recipe_sysroot\n| NOTE: Direct dependencies are ['/srv/pokybuild/yocto-worker/qemuarmv5/build/build/tmp/work/qemuarmv5-poky-linux-gnueabi/core-image-minimal/1.0/testsdkext/layers/openembedded-core/meta/recipes-devtools/binutils/binutils-cross_2.47.bb:do_populate_sysroot', '/srv/pokybuild/yocto-worker/qemuarmv5/build/build/tmp/work/qemuarmv5-poky-linux-gnueabi/core-image-minimal/1.0/testsdkext/layers/openembedded-core/meta/recipes-devtools/gcc/gcc-cross_16.2.bb:do_populate_sysroot', '/srv/pokybuild/yocto-worker/qemuarmv5/build/build/tmp/work/qemuarmv5-poky-linux-gnueabi/core-image-minimal/1.0/testsdkext/layers/openembedded-core/meta/recipes-devtools/quilt/quilt-native_0.69.bb:do_populate_sysroot', '/srv/pokybuild/yocto-worker/qemuarmv5/build/build/tmp/work/qemuarmv5-poky-linux-gnueabi/core-image-minimal/1.0/testsdkext/layers/openembedded-core/meta/recipes-kernel/kern-tools/kern-tools-native_git.bb:do_populate_sysroot', 'virtual:native:/srv/pokybuild/yocto-worker/qemuarmv5/build/build/tmp/work/qemuarmv5-poky-linux-gnueabi/core-image-minimal/1.0/testsdkext/layers/openembedded-core/meta/recipes-connectivity/openssl/openssl_3.5.8.bb:do_populate_sysroot', 'virtual:native:/srv/pokybuild/yocto-worker/qemuarmv5/build/build/tmp/work/qemuarmv5-poky-linux-gnueabi/core-image-minimal/1.0/testsdkext/layers/openembedded-core/meta/recipes-core/util-linux/util-linux_2.42.2.bb:do_populate_sysroot', 'virtual:native:/srv/pokybuild/yocto-worker/qemuarmv5/build/build/tmp/work/qemuarmv5-poky-linux-gnueabi/core-image-minimal/1.0/testsdkext/layers/openembedded-core/meta/recipes-devtools/bison/bison_3.8.2.bb:do_populate_sysroot', 'virtual:native:/srv/pokybuild/yocto-worker/qemuarmv5/build/build/tmp/work/qemuarmv5-poky-linux-gnueabi/core-image-minimal/1.0/testsdkext/layers/openembedded-core/meta/recipes-devtools/patch/patch_2.8.bb:do_populate_sysroot', 'virtual:native:/srv/pokybuild/yocto-worker/qemuarmv5/build/build/tmp/work/qemuarmv5-poky-linux-gnueabi/core-image-minimal/1.0/testsdkext/layers/openembedded-core/meta/recipes-devtools/pkgconf/pkgconf_3.0.6.bb:do_populate_sysroot', 'virtual:native:/srv/pokybuild/yocto-worker/qemuarmv5/build/build/tmp/work/qemuarmv5-poky-linux-gnueabi/core-image-minimal/1.0/testsdkext/layers/openembedded-core/meta/recipes-devtools/pseudo/pseudo_git.bb:do_populate_sysroot', 'virtual:native:/srv/pokybuild/yocto-worker/qemuarmv5/build/build/tmp/work/qemuarmv5-poky-linux-gnueabi/core-image-minimal/1.0/testsdkext/layers/openembedded-core/meta/recipes-extended/bc/bc_1.08.2.bb:do_populate_sysroot', 'virtual:native:/srv/pokybuild/yocto-worker/qemuarmv5/build/build/tmp/work/qemuarmv5-poky-linux-gnueabi/core-image-minimal/1.0/testsdkext/layers/openembedded-core/meta/recipes-extended/xz/xz_5.8.3.bb:do_populate_sysroot', 'virtual:native:/srv/pokybuild/yocto-worker/qemuarmv5/build/build/tmp/work/qemuarmv5-poky-linux-gnueabi/core-image-minimal/1.0/testsdkext/layers/openembedded-core/meta/recipes-kernel/kmod/kmod_34.2.bb:do_populate_sysroot', 'virtual:native:/srv/pokybuild/yocto-worker/qemuarmv5/build/build/tmp/work/qemuarmv5-poky-linux-gnueabi/core-image-minimal/1.0/testsdkext/layers/openembedded-core/meta/recipes-support/gmp/gmp_6.3.0.bb:do_populate_sysroot', 'virtual:native:/srv/pokybuild/yocto-worker/qemuarmv5/build/build/tmp/work/qemuarmv5-poky-linux-gnueabi/core-image-minimal/1.0/testsdkext/layers/openembedded-core/meta/recipes-support/libmpc/libmpc_1.4.1.bb:do_populate_sysroot']\n| NOTE: Installed into sysroot: []\n| NOTE: Skipping as already exists in sysroot: ['gettext-minimal-native', 'binutils-cross-arm', 'cmake-native', 'gcc-cross-arm', 'libtool-native', 'm4-native', 'quilt-native', 'texinfo-dummy-native', 'kern-tools-native', 'linux-libc-headers', 'openssl-native', 'expat-native', 'ncurses-native', 'readline-native', 'util-linux-libuuid-native', 'util-linux-native', 'zlib-native', 'bison-native', 'flex-native', 'git-native', 'gnu-config-native', 'libedit-native', 'make-native', 'patch-native', 'perl-native', 'pkgconf-native', 'pseudo-native', 'python3-native', 'bc-native', 'bzip2-native', 'xz-native', 'zstd-native', 'kmod-native', 'attr-native', 'curl-native', 'gdbm-native', 'gmp-native', 'libcap-ng-native', 'libffi-native', 'libmpc-native', 'libpcre2-native', 'mpfr-native', 'sqlite3-native']\n| DEBUG: Python function extend_recipe_sysroot finished\n| DEBUG: Executing shell function do_install\n| NOTE: make -j 16 -l 75 KERNEL_SRC=/srv/pokybuild/yocto-worker/qemuarmv5/build/build/tmp/work/qemuarmv5-poky-linux-gnueabi/core-image-minimal/1.0/testsdkext/tmp/work-shared/qemuarmv5/kernel-source DEPMOD=echo MODLIB=/srv/pokybuild/yocto-worker/qemuarmv5/build/build/tmp/work/qemuarmv5-poky-linux-gnueabi/core-image-minimal/1.0/testsdkext/tmp/work/qemuarmv5-poky-linux-gnueabi/kernel-module-hello-world/1.0+git/image/lib/modules/6.18.44-yocto-standard INSTALL_FW_PATH=/srv/pokybuild/yocto-worker/qemuarmv5/build/build/tmp/work/qemuarmv5-poky-linux-gnueabi/core-image-minimal/1.0/testsdkext/tmp/work/qemuarmv5-poky-linux-gnueabi/kernel-module-hello-world/1.0+git/image/lib/firmware CC=arm-poky-linux-gnueabi-gcc  -mno-thumb-interwork -marm  -fuse-ld=bfd -fcanon-prefix-map  -ffile-prefix-map=/srv/pokybuild/yocto-worker/qemuarmv5/build/build/tmp/work/qemuarmv5-poky-linux-gnueabi/core-image-minimal/1.0/testsdkext/workspace/sources/kernel-module-hello-world=/usr/src/debug/kernel-module-hello-world/1.0+git  -ffile-prefix-map=/srv/pokybuild/yocto-worker/qemuarmv5/build/build/tmp/work/qemuarmv5-poky-linux-gnueabi/core-image-minimal/1.0/testsdkext/workspace/sources/kernel-module-hello-world=/usr/src/debug/kernel-module-hello-world/1.0+git  -ffile-prefix-map=/srv/pokybuild/yocto-worker/qemuarmv5/build/build/tmp/work/qemuarmv5-poky-linux-gnueabi/core-image-minimal/1.0/testsdkext/tmp/work/qemuarmv5-poky-linux-gnueabi/kernel-module-hello-world/1.0+git/recipe-sysroot=  -ffile-prefix-map=/srv/pokybuild/yocto-worker/qemuarmv5/build/build/tmp/work/qemuarmv5-poky-linux-gnueabi/core-image-minimal/1.0/testsdkext/tmp/work/qemuarmv5-poky-linux-gnueabi/kernel-module-hello-world/1.0+git/recipe-sysroot-native=   -ffile-prefix-map=/srv/pokybuild/yocto-worker/qemuarmv5/build/build/tmp/work/qemuarmv5-poky-linux-gnueabi/core-image-minimal/1.0/testsdkext/tmp/work-shared/qemuarmv5/kernel-source=/usr/src/kernel  -ffile-prefix-map=/srv/pokybuild/yocto-worker/qemuarmv5/build/build/tmp/work/qemuarmv5-poky-linux-gnueabi/core-image-minimal/1.0/testsdkext/tmp/work-shared/qemuarmv5/kernel-build-artifacts=/usr/src/kernel  LD=arm-poky-linux-gnueabi-ld.bfd   OBJCOPY=arm-poky-linux-gnueabi-objcopy  STRIP=arm-poky-linux-gnueabi-strip O=/srv/pokybuild/yocto-worker/qemuarmv5/build/build/tmp/work/qemuarmv5-poky-linux-gnueabi/core-image-minimal/1.0/testsdkext/tmp/work-shared/qemuarmv5/kernel-build-artifacts KBUILD_EXTRA_SYMBOLS= modules_install\n| make -C /srv/pokybuild/yocto-worker/qemuarmv5/build/build/tmp/work/qemuarmv5-poky-linux-gnueabi/core-image-minimal/1.0/testsdkext/tmp/work-shared/qemuarmv5/kernel-source M=/srv/pokybuild/yocto-worker/qemuarmv5/build/build/tmp/work/qemuarmv5-poky-linux-gnueabi/core-image-minimal/1.0/testsdkext/workspace/sources/kernel-module-hello-world modules_install\n| make[1]: Entering directory '/srv/pokybuild/yocto-worker/qemuarmv5/build/build/tmp/work/qemuarmv5-poky-linux-gnueabi/core-image-minimal/1.0/testsdkext/tmp/work-shared/qemuarmv5/kernel-source'\n| make[2]: Entering directory '/srv/pokybuild/yocto-worker/qemuarmv5/build/build/tmp/work/qemuarmv5-poky-linux-gnueabi/core-image-minimal/1.0/testsdkext/workspace/sources/kernel-module-hello-world'\n| make[4]: *** No rule to make target '/srv/pokybuild/yocto-worker/qemuarmv5/build/build/tmp/work/qemuarmv5-poky-linux-gnueabi/core-image-minimal/1.0/testsdkext/tmp/work/qemuarmv5-poky-linux-gnueabi/kernel-module-hello-world/1.0+git/image/lib/modules/6.18.44-yocto-standard/updates/hello-world.ko', needed by '__modinst'.  Stop.\n| make[3]: *** [/srv/pokybuild/yocto-worker/qemuarmv5/build/build/tmp/work/qemuarmv5-poky-linux-gnueabi/core-image-minimal/1.0/testsdkext/tmp/work-shared/qemuarmv5/kernel-source/Makefile:1956: modules_install] Error 2\n| make[2]: Leaving directory '/srv/pokybuild/yocto-worker/qemuarmv5/build/build/tmp/work/qemuarmv5-poky-linux-gnueabi/core-image-minimal/1.0/testsdkext/workspace/sources/kernel-module-hello-world'\n| make[2]: *** [/srv/pokybuild/yocto-worker/qemuarmv5/build/build/tmp/work/qemuarmv5-poky-linux-gnueabi/core-image-minimal/1.0/testsdkext/tmp/work-shared/qemuarmv5/kernel-source/Makefile:248: __sub-make] Error 2\n| make[1]: *** [Makefile:248: __sub-make] Error 2\n| make[1]: Leaving directory '/srv/pokybuild/yocto-worker/qemuarmv5/build/build/tmp/work/qemuarmv5-poky-linux-gnueabi/core-image-minimal/1.0/testsdkext/tmp/work-shared/qemuarmv5/kernel-source'\n| make: *** [Makefile:9: modules_install] Error 2\n| ERROR: oe_runmake failed\n| WARNING: exit code 1 from a shell command.\nNOTE: recipe kernel-module-hello-world-1.0+git-r0: task do_install: Failed\nERROR: Task (/srv/pokybuild/yocto-worker/qemuarmv5/build/build/tmp/work/qemuarmv5-poky-linux-gnueabi/core-image-minimal/1.0/testsdkext/workspace/recipes/kernel-module-hello-world/kernel-module-hello-world_git.bb:do_install) failed with exit code '1'\nNOTE: Tasks Summary: Attempted 881 tasks of which 853 didn't need to be rerun and 1 failed.\nNOTE: The errors for this build are stored in /srv/pokybuild/yocto-worker/qemuarmv5/build/build/tmp/work/qemuarmv5-poky-linux-gnueabi/core-image-minimal/1.0/testsdkext/tmp/log/error-report/error_report_20260902154634.txt\nYou can send the errors to a reports server by running:\n  send-error-report /srv/pokybuild/yocto-worker/qemuarmv5/build/build/tmp/work/qemuarmv5-poky-linux-gnueabi/core-image-minimal/1.0/testsdkext/tmp/log/error-report/error_report_20260902154634.txt [-s server]\nNOTE: The contents of these logs will be posted in public if you use the above command with the default server. Please ensure you remove any identifying or proprietary information when prompted before sending.\n\nSummary: 1 task failed:\n  /srv/pokybuild/yocto-worker/qemuarmv5/build/build/tmp/work/qemuarmv5-poky-linux-gnueabi/core-image-minimal/1.0/testsdkext/workspace/recipes/kernel-module-hello-world/kernel-module-hello-world_git.bb:do_install\n    log: /srv/pokybuild/yocto-worker/qemuarmv5/build/build/tmp/work/qemuarmv5-poky-linux-gnueabi/core-image-minimal/1.0/testsdkext/tmp/work/qemuarmv5-poky-linux-gnueabi/kernel-module-hello-world/1.0+git/temp/log.do_install.1835605\nSummary: There was 1 WARNING message.\nSummary: There were 2 ERROR messages, returning a non-zero exit code.\n\n",
    "status": "ERROR"
   },
   "devtool.DevtoolTest.test_devtool_location": {
    "duration": 0.013162851333618164,
    "status": "PASSED"
   },
   "devtool.DevtoolTest.test_extend_autotools_recipe_creation": {
    "duration": 157.24265456199646,
    "status": "PASSED"
   },
   "devtool.DevtoolTest.test_recipes_for_nodejs": {
    "duration": 25.109110116958618,
    "status": "PASSED"
   },
   "devtool.SdkUpdateTest.test_sdk_update_http": {
    "duration": 0.7938218116760254,
    "status": "PASSED"
   },
   "gcc.GccCompileTest.test_gcc_compile": {
    "duration": 0.08989500999450684,
    "status": "PASSED"
   },
   "gcc.GccCompileTest.test_gpp2_compile": {
    "duration": 0.08491158485412598,
    "status": "PASSED"
   },
   "gcc.GccCompileTest.test_gpp_compile": {
    "duration": 0.25298070907592773,
    "status": "PASSED"
   },
   "gcc.GccCompileTest.test_make": {
    "duration": 0.09330391883850098,
    "status": "PASSED"
   },
   "go.GoCompileTest.test_go_build": {
    "duration": 0.0001418590545654297,
    "log": "GoCompileTest class: SDK doesn't contain a Go cross-canadian toolchain",
    "status": "SKIPPED"
   },
   "go.GoCompileTest.test_go_module": {
    "duration": 7.176399230957031e-05,
    "log": "GoCompileTest class: SDK doesn't contain a Go cross-canadian toolchain",
    "status": "SKIPPED"
   },
   "go.GoHostCompileTest.test_go_cross_compile": {
    "duration": 9.226799011230469e-05,
    "log": "GoHostCompileTest class: SDK doesn't contain a Go cross-canadian toolchain",
    "status": "SKIPPED"
   },
   "go.GoHostCompileTest.test_go_module_cross_compile": {
    "duration": 5.984306335449219e-05,
    "log": "GoHostCompileTest class: SDK doesn't contain a Go cross-canadian toolchain",
    "status": "SKIPPED"
   },
   "gtk3.GTK3Test.test_libhandy": {
    "duration": 8.797645568847656e-05,
    "log": "gtk3.GTK3Test.test_libhandy does not support eSDK (https://bugzilla.yoctoproject.org/show_bug.cgi?id=15854)",
    "status": "SKIPPED"
   },
   "kmod.KernelModuleTest.test_cryptodev": {
    "duration": 6.532669067382812e-05,
    "log": "kmod.KernelModuleTest.test_cryptodev does not support eSDK (https://bugzilla.yoctoproject.org/show_bug.cgi?id=15850)",
    "status": "SKIPPED"
   },
   "makefile.MakefileTest.test_lzip": {
    "duration": 1.566269874572754,
    "status": "PASSED"
   },
   "manifest.ManifestTest.test_manifests": {
    "duration": 0.00010442733764648438,
    "status": "PASSED"
   },
   "maturin.MaturinDevelopTest.test_maturin_develop": {
    "duration": 24.088646173477173,
    "log": "Testing 'maturin develop' requires Rust cross-canadian in the SDK",
    "status": "SKIPPED"
   },
   "maturin.MaturinTest.test_maturin_list_python": {
    "duration": 17.439536094665527,
    "status": "PASSED"
   },
   "meson.MesonTest.test_iputils": {
    "duration": 0.00025343894958496094,
    "log": "meson.MesonTest.test_iputils does not support eSDK (https://bugzilla.yoctoproject.org/show_bug.cgi?id=15854)",
    "status": "SKIPPED"
   },
   "perl.PerlTest.test_perl": {
    "duration": 0.019800662994384766,
    "status": "PASSED"
   },
   "python.Python3Test.test_python3": {
    "duration": 17.446704626083374,
    "status": "PASSED"
   },
   "rust.RustCompileTest.test_cargo_build": {
    "duration": 0.00026726722717285156,
    "log": "RustCompileTest class: SDK doesn't contain a Rust cross-canadian toolchain",
    "status": "SKIPPED"
   },
   "rust.RustHostCompileTest.test_cargo_build": {
    "duration": 0.0002460479736328125,
    "log": "RustCompileTest class: SDK doesn't contain a Rust cross-canadian toolchain",
    "status": "SKIPPED"
   }
  }
 },
 "sdkext_core-image-sato_x86_64_qemuarmv5_20260902153947": {
  "configuration": {
   "HOST_DISTRO": "ubuntu-25.04",
   "IMAGE_BASENAME": "core-image-sato",
   "IMAGE_PKGTYPE": "rpm",
   "LAYERS": {
    "meta": {
     "branch": "mathieu/master-next",
     "commit": "a335dcb7911e689e2d30bee21409561b18d1aed1",
     "commit_count": 68653,
     "commit_time": 1788357671
    },
    "meta-poky": {
     "branch": "contrib/mathieu/master-next",
     "commit": "6ce984c0a3a68c2fdc3c32bc185b6729d09e7829",
     "commit_count": 1817,
     "commit_time": 1787392397
    },
    "meta-yocto-bsp": {
     "branch": "contrib/mathieu/master-next",
     "commit": "6ce984c0a3a68c2fdc3c32bc185b6729d09e7829",
     "commit_count": 1817,
     "commit_time": 1787392397
    }
   },
   "MACHINE": "qemuarmv5",
   "SDKMACHINE": "x86_64",
   "STARTTIME": "20260902153947",
   "TEST_TYPE": "sdkext"
  },
  "result": {
   "autotools.AutotoolsTest.test_cpio": {
    "duration": 25.3693265914917,
    "status": "PASSED"
   },
   "cmake.CMakeTest.test_assimp": {
    "duration": 72.19336819648743,
    "status": "PASSED"
   },
   "devtool.DevtoolTest.test_devtool_add_reset": {
    "duration": 12.39366364479065,
    "status": "PASSED"
   },
   "devtool.DevtoolTest.test_devtool_build_cmake": {
    "duration": 29.585543394088745,
    "status": "PASSED"
   },
   "devtool.DevtoolTest.test_devtool_build_esdk_package": {
    "duration": 23.904724836349487,
    "status": "PASSED"
   },
   "devtool.DevtoolTest.test_devtool_build_make": {
    "duration": 27.933138132095337,
    "status": "PASSED"
   },
   "devtool.DevtoolTest.test_devtool_kernelmodule": {
    "duration": 298.62571954727173,
    "log": "Traceback (most recent call last):\n  File \"/srv/pokybuild/yocto-worker/qemuarmv5/build/layers/openembedded-core/meta/lib/oeqa/sdkext/cases/devtool.py\", line 85, in test_devtool_kernelmodule\n    self._run('devtool build %s' % recipe)\n    ~~~~~~~~~^^^^^^^^^^^^^^^^^^^^^^^^^^^^^\n  File \"/srv/pokybuild/yocto-worker/qemuarmv5/build/layers/openembedded-core/meta/lib/oeqa/sdkext/case.py\", line 22, in _run\n    return subprocess.check_output(\". %s > /dev/null;\"\\\n           ~~~~~~~~~~~~~~~~~~~~~~~^^^^^^^^^^^^^^^^^^^^^\n        \" %s;\" % (self.tc.sdk_env, cmd), stderr=subprocess.STDOUT,\n        ^^^^^^^^^^^^^^^^^^^^^^^^^^^^^^^^^^^^^^^^^^^^^^^^^^^^^^^^^^\n        shell=True, env=env, universal_newlines=True)\n        ^^^^^^^^^^^^^^^^^^^^^^^^^^^^^^^^^^^^^^^^^^^^^\n  File \"/usr/lib/python3.13/subprocess.py\", line 472, in check_output\n    return run(*popenargs, stdout=PIPE, timeout=timeout, check=True,\n           ~~~^^^^^^^^^^^^^^^^^^^^^^^^^^^^^^^^^^^^^^^^^^^^^^^^^^^^^^\n               **kwargs).stdout\n               ^^^^^^^^^\n  File \"/usr/lib/python3.13/subprocess.py\", line 577, in run\n    raise CalledProcessError(retcode, process.args,\n                             output=stdout, stderr=stderr)\noeqa.utils.subprocesstweak.OETestCalledProcessError: Command '. /srv/pokybuild/yocto-worker/qemuarmv5/build/build/tmp/work/qemuarmv5-poky-linux-gnueabi/core-image-sato/1.0/testsdkext/environment-setup-armv5e-poky-linux-gnueabi > /dev/null; devtool build kernel-module-hello-world;' returned non-zero exit status 1.\nStandard Output: NOTE: Reconnecting to bitbake server...\nLoading cache...done.\nLoaded 1988 entries from dependency cache.\nParsing recipes...done.\nParsing of 957 .bb files complete (956 cached, 1 parsed). 1989 targets, 65 skipped, 0 masked, 0 errors.\nRemoving 1 recipes from the armv5e sysroot...done.\nNOTE: Reconnecting to bitbake server...\nLoading cache...done.\nLoaded 1988 entries from dependency cache.\nParsing recipes...done.\nParsing of 957 .bb files complete (956 cached, 1 parsed). 1989 targets, 65 skipped, 0 masked, 0 errors.\nNOTE: Resolving any missing task queue dependencies\nInitialising tasks...done.\nChecking sstate mirror object availability...WARNING: /srv/pokybuild/yocto-worker/qemuarmv5/build/build/tmp/work/qemuarmv5-poky-linux-gnueabi/core-image-sato/1.0/testsdkext/buildtools/sysroots/x86_64-pokysdk-linux/usr/lib/python3.14/tempfile.py:484: ResourceWarning: Implicitly cleaning up <HTTPError 404: 'Not Found'>\n  _warnings.warn(self.warn_message, ResourceWarning)\n\ndone.\nSstate summary: Wanted 137 Local 34 Mirrors 96 Missed 7 Current 127 (94% match, 97% complete)\nNOTE: Executing Tasks\nNOTE: Running setscene task 204 of 264 (/srv/pokybuild/yocto-worker/qemuarmv5/build/build/tmp/work/qemuarmv5-poky-linux-gnueabi/core-image-sato/1.0/testsdkext/layers/openembedded-core/meta/recipes-kernel/linux/linux-yocto_6.18.bb:do_deploy_source_date_epoch_setscene)\nNOTE: Running setscene task 213 of 264 (virtual:native:/srv/pokybuild/yocto-worker/qemuarmv5/build/build/tmp/work/qemuarmv5-poky-linux-gnueabi/core-image-sato/1.0/testsdkext/layers/openembedded-core/meta/recipes-core/util-linux/util-linux_2.42.2.bb:do_populate_sysroot_setscene)\nNOTE: Running setscene task 215 of 264 (virtual:native:/srv/pokybuild/yocto-worker/qemuarmv5/build/build/tmp/work/qemuarmv5-poky-linux-gnueabi/core-image-sato/1.0/testsdkext/layers/openembedded-core/meta/recipes-devtools/bison/bison_3.8.2.bb:do_populate_sysroot_setscene)\nNOTE: Running setscene task 217 of 264 (virtual:native:/srv/pokybuild/yocto-worker/qemuarmv5/build/build/tmp/work/qemuarmv5-poky-linux-gnueabi/core-image-sato/1.0/testsdkext/layers/openembedded-core/meta/recipes-extended/bc/bc_1.08.2.bb:do_populate_sysroot_setscene)\nNOTE: Running setscene task 218 of 264 (virtual:native:/srv/pokybuild/yocto-worker/qemuarmv5/build/build/tmp/work/qemuarmv5-poky-linux-gnueabi/core-image-sato/1.0/testsdkext/layers/openembedded-core/meta/recipes-kernel/kmod/kmod_34.2.bb:do_populate_sysroot_setscene)\nNOTE: Running task 202 of 884 (/srv/pokybuild/yocto-worker/qemuarmv5/build/build/tmp/work/qemuarmv5-poky-linux-gnueabi/core-image-sato/1.0/testsdkext/layers/openembedded-core/meta/recipes-kernel/make-mod-scripts/make-mod-scripts_1.0.bb:do_recipe_qa)\nNOTE: Running task 221 of 884 (/srv/pokybuild/yocto-worker/qemuarmv5/build/build/tmp/work/qemuarmv5-poky-linux-gnueabi/core-image-sato/1.0/testsdkext/workspace/recipes/kernel-module-hello-world/kernel-module-hello-world_git.bb:do_deploy_source_date_epoch)\nNOTE: recipe linux-yocto-6.18.44+git-r0: task do_deploy_source_date_epoch_setscene: Started\nNOTE: recipe make-mod-scripts-1.0-r0: task do_recipe_qa: Started\nNOTE: recipe bison-native-3.8.2-r0: task do_populate_sysroot_setscene: Started\nNOTE: recipe bc-native-1.08.2-r0: task do_populate_sysroot_setscene: Started\nNOTE: recipe kmod-native-34.2-r0: task do_populate_sysroot_setscene: Started\nNOTE: recipe util-linux-native-2.42.2-r0: task do_populate_sysroot_setscene: Started\nNOTE: recipe linux-yocto-6.18.44+git-r0: task do_deploy_source_date_epoch_setscene: Succeeded\nNOTE: recipe bison-native-3.8.2-r0: task do_populate_sysroot_setscene: Succeeded\nNOTE: Running setscene task 223 of 264 (/srv/pokybuild/yocto-worker/qemuarmv5/build/build/tmp/work/qemuarmv5-poky-linux-gnueabi/core-image-sato/1.0/testsdkext/layers/openembedded-core/meta/recipes-kernel/kern-tools/kern-tools-native_git.bb:do_populate_sysroot_setscene)\nNOTE: Running setscene task 224 of 264 (/srv/pokybuild/yocto-worker/qemuarmv5/build/build/tmp/work/qemuarmv5-poky-linux-gnueabi/core-image-sato/1.0/testsdkext/layers/openembedded-core/meta/recipes-kernel/linux/linux-yocto_6.18.bb:do_recipe_qa_setscene)\nNOTE: Running setscene task 225 of 264 (virtual:native:/srv/pokybuild/yocto-worker/qemuarmv5/build/build/tmp/work/qemuarmv5-poky-linux-gnueabi/core-image-sato/1.0/testsdkext/layers/openembedded-core/meta/recipes-devtools/patch/patch_2.8.bb:do_populate_sysroot_setscene)\nNOTE: Running setscene task 227 of 264 (virtual:native:/srv/pokybuild/yocto-worker/qemuarmv5/build/build/tmp/work/qemuarmv5-poky-linux-gnueabi/core-image-sato/1.0/testsdkext/layers/openembedded-core/meta/recipes-devtools/bison/bison_3.8.2.bb:do_recipe_qa_setscene)\nNOTE: recipe bc-native-1.08.2-r0: task do_populate_sysroot_setscene: Succeeded\nNOTE: Running setscene task 229 of 264 (virtual:native:/srv/pokybuild/yocto-worker/qemuarmv5/build/build/tmp/work/qemuarmv5-poky-linux-gnueabi/core-image-sato/1.0/testsdkext/layers/openembedded-core/meta/recipes-extended/bc/bc_1.08.2.bb:do_recipe_qa_setscene)\nNOTE: recipe kmod-native-34.2-r0: task do_populate_sysroot_setscene: Succeeded\nNOTE: Running setscene task 231 of 264 (virtual:native:/srv/pokybuild/yocto-worker/qemuarmv5/build/build/tmp/work/qemuarmv5-poky-linux-gnueabi/core-image-sato/1.0/testsdkext/layers/openembedded-core/meta/recipes-kernel/kmod/kmod_34.2.bb:do_recipe_qa_setscene)\nNOTE: recipe make-mod-scripts-1.0-r0: task do_recipe_qa: Succeeded\nNOTE: recipe kern-tools-native-0.3+git-r0: task do_populate_sysroot_setscene: Started\nNOTE: Running task 223 of 884 (/srv/pokybuild/yocto-worker/qemuarmv5/build/build/tmp/work/qemuarmv5-poky-linux-gnueabi/core-image-sato/1.0/testsdkext/layers/openembedded-core/meta/recipes-kernel/make-mod-scripts/make-mod-scripts_1.0.bb:do_fetch)\nNOTE: recipe linux-yocto-6.18.44+git-r0: task do_recipe_qa_setscene: Started\nNOTE: recipe bison-native-3.8.2-r0: task do_recipe_qa_setscene: Started\nNOTE: recipe patch-native-2.8-r0: task do_populate_sysroot_setscene: Started\nNOTE: recipe kern-tools-native-0.3+git-r0: task do_populate_sysroot_setscene: Succeeded\nNOTE: Running setscene task 233 of 264 (virtual:native:/srv/pokybuild/yocto-worker/qemuarmv5/build/build/tmp/work/qemuarmv5-poky-linux-gnueabi/core-image-sato/1.0/testsdkext/layers/openembedded-core/meta/recipes-devtools/git/git_2.55.0.bb:do_populate_sysroot_setscene)\nNOTE: Running setscene task 234 of 264 (/srv/pokybuild/yocto-worker/qemuarmv5/build/build/tmp/work/qemuarmv5-poky-linux-gnueabi/core-image-sato/1.0/testsdkext/layers/openembedded-core/meta/recipes-kernel/kern-tools/kern-tools-native_git.bb:do_recipe_qa_setscene)\nNOTE: recipe bc-native-1.08.2-r0: task do_recipe_qa_setscene: Started\nNOTE: recipe make-mod-scripts-1.0-r0: task do_fetch: Started\nNOTE: recipe kmod-native-34.2-r0: task do_recipe_qa_setscene: Started\nNOTE: recipe make-mod-scripts-1.0-r0: task do_fetch: Succeeded\nNOTE: Running task 224 of 884 (/srv/pokybuild/yocto-worker/qemuarmv5/build/build/tmp/work/qemuarmv5-poky-linux-gnueabi/core-image-sato/1.0/testsdkext/layers/openembedded-core/meta/recipes-kernel/make-mod-scripts/make-mod-scripts_1.0.bb:do_unpack)\nNOTE: recipe bison-native-3.8.2-r0: task do_recipe_qa_setscene: Succeeded\nNOTE: recipe linux-yocto-6.18.44+git-r0: task do_recipe_qa_setscene: Succeeded\nNOTE: recipe patch-native-2.8-r0: task do_populate_sysroot_setscene: Succeeded\nNOTE: recipe kern-tools-native-0.3+git-r0: task do_recipe_qa_setscene: Started\nNOTE: Running task 229 of 884 (/srv/pokybuild/yocto-worker/qemuarmv5/build/build/tmp/work/qemuarmv5-poky-linux-gnueabi/core-image-sato/1.0/testsdkext/layers/openembedded-core/meta/recipes-kernel/linux/linux-yocto_6.18.bb:do_fetch)\nNOTE: recipe bc-native-1.08.2-r0: task do_recipe_qa_setscene: Succeeded\nNOTE: Running setscene task 236 of 264 (virtual:native:/srv/pokybuild/yocto-worker/qemuarmv5/build/build/tmp/work/qemuarmv5-poky-linux-gnueabi/core-image-sato/1.0/testsdkext/layers/openembedded-core/meta/recipes-devtools/patch/patch_2.8.bb:do_recipe_qa_setscene)\nNOTE: recipe kmod-native-34.2-r0: task do_recipe_qa_setscene: Succeeded\nNOTE: recipe make-mod-scripts-1.0-r0: task do_unpack: Started\nNOTE: recipe git-native-2.55.0-r0: task do_populate_sysroot_setscene: Started\nNOTE: recipe make-mod-scripts-1.0-r0: task do_unpack: Succeeded\nNOTE: recipe kern-tools-native-0.3+git-r0: task do_recipe_qa_setscene: Succeeded\nNOTE: recipe linux-yocto-6.18.44+git-r0: task do_fetch: Started\nNOTE: recipe patch-native-2.8-r0: task do_recipe_qa_setscene: Started\nNOTE: recipe util-linux-native-2.42.2-r0: task do_populate_sysroot_setscene: Succeeded\nNOTE: Running setscene task 237 of 264 (virtual:native:/srv/pokybuild/yocto-worker/qemuarmv5/build/build/tmp/work/qemuarmv5-poky-linux-gnueabi/core-image-sato/1.0/testsdkext/layers/openembedded-core/meta/recipes-support/libcap-ng/libcap-ng_0.9.5.bb:do_populate_sysroot_setscene)\nNOTE: Running setscene task 240 of 264 (virtual:native:/srv/pokybuild/yocto-worker/qemuarmv5/build/build/tmp/work/qemuarmv5-poky-linux-gnueabi/core-image-sato/1.0/testsdkext/layers/openembedded-core/meta/recipes-core/util-linux/util-linux_2.42.2.bb:do_recipe_qa_setscene)\nNOTE: I/O pressure (>20000.0us) is limiting task startup\nNOTE: recipe patch-native-2.8-r0: task do_recipe_qa_setscene: Succeeded\nNOTE: recipe libcap-ng-native-0.9.5-r0: task do_populate_sysroot_setscene: Started\nNOTE: recipe util-linux-native-2.42.2-r0: task do_recipe_qa_setscene: Started\nNOTE: recipe libcap-ng-native-0.9.5-r0: task do_populate_sysroot_setscene: Succeeded\nNOTE: Running setscene task 250 of 264 (virtual:native:/srv/pokybuild/yocto-worker/qemuarmv5/build/build/tmp/work/qemuarmv5-poky-linux-gnueabi/core-image-sato/1.0/testsdkext/layers/openembedded-core/meta/recipes-support/libcap-ng/libcap-ng_0.9.5.bb:do_recipe_qa_setscene)\nNOTE: Running setscene task 251 of 264 (virtual:native:/srv/pokybuild/yocto-worker/qemuarmv5/build/build/tmp/work/qemuarmv5-poky-linux-gnueabi/core-image-sato/1.0/testsdkext/layers/openembedded-core/meta/recipes-devtools/pkgconf/pkgconf_3.0.6.bb:do_populate_sysroot_setscene)\nNOTE: recipe util-linux-native-2.42.2-r0: task do_recipe_qa_setscene: Succeeded\nNOTE: No pressure is limiting task startup\nNOTE: recipe kernel-module-hello-world-1.0+git-r0: task do_deploy_source_date_epoch: Started\nNOTE: recipe libcap-ng-native-0.9.5-r0: task do_recipe_qa_setscene: Started\nNOTE: recipe pkgconf-native-3.0.6-r0: task do_populate_sysroot_setscene: Started\nNOTE: recipe kernel-module-hello-world-1.0+git-r0: task do_deploy_source_date_epoch: Succeeded\nNOTE: recipe libcap-ng-native-0.9.5-r0: task do_recipe_qa_setscene: Succeeded\nNOTE: recipe pkgconf-native-3.0.6-r0: task do_populate_sysroot_setscene: Succeeded\nNOTE: Running setscene task 253 of 264 (virtual:native:/srv/pokybuild/yocto-worker/qemuarmv5/build/build/tmp/work/qemuarmv5-poky-linux-gnueabi/core-image-sato/1.0/testsdkext/layers/openembedded-core/meta/recipes-devtools/pkgconf/pkgconf_3.0.6.bb:do_recipe_qa_setscene)\nNOTE: recipe pkgconf-native-3.0.6-r0: task do_recipe_qa_setscene: Started\nNOTE: recipe pkgconf-native-3.0.6-r0: task do_recipe_qa_setscene: Succeeded\nNOTE: recipe git-native-2.55.0-r0: task do_populate_sysroot_setscene: Succeeded\nNOTE: Running setscene task 255 of 264 (virtual:native:/srv/pokybuild/yocto-worker/qemuarmv5/build/build/tmp/work/qemuarmv5-poky-linux-gnueabi/core-image-sato/1.0/testsdkext/layers/openembedded-core/meta/recipes-devtools/git/git_2.55.0.bb:do_recipe_qa_setscene)\nNOTE: Running setscene task 262 of 264 (/srv/pokybuild/yocto-worker/qemuarmv5/build/build/tmp/work/qemuarmv5-poky-linux-gnueabi/core-image-sato/1.0/testsdkext/layers/openembedded-core/meta/recipes-devtools/quilt/quilt-native_0.69.bb:do_populate_sysroot_setscene)\nNOTE: recipe quilt-native-0.69-r0: task do_populate_sysroot_setscene: Started\nNOTE: recipe git-native-2.55.0-r0: task do_recipe_qa_setscene: Started\nNOTE: recipe quilt-native-0.69-r0: task do_populate_sysroot_setscene: Succeeded\nNOTE: Running setscene task 264 of 264 (/srv/pokybuild/yocto-worker/qemuarmv5/build/build/tmp/work/qemuarmv5-poky-linux-gnueabi/core-image-sato/1.0/testsdkext/layers/openembedded-core/meta/recipes-devtools/quilt/quilt-native_0.69.bb:do_recipe_qa_setscene)\nNOTE: recipe git-native-2.55.0-r0: task do_recipe_qa_setscene: Succeeded\nNOTE: recipe quilt-native-0.69-r0: task do_recipe_qa_setscene: Started\nNOTE: recipe quilt-native-0.69-r0: task do_recipe_qa_setscene: Succeeded\nNOTE: Running task 780 of 884 (/srv/pokybuild/yocto-worker/qemuarmv5/build/build/tmp/work/qemuarmv5-poky-linux-gnueabi/core-image-sato/1.0/testsdkext/layers/openembedded-core/meta/recipes-kernel/make-mod-scripts/make-mod-scripts_1.0.bb:do_patch)\nNOTE: Running task 829 of 884 (/srv/pokybuild/yocto-worker/qemuarmv5/build/build/tmp/work/qemuarmv5-poky-linux-gnueabi/core-image-sato/1.0/testsdkext/layers/openembedded-core/meta/recipes-kernel/make-mod-scripts/make-mod-scripts_1.0.bb:do_prepare_recipe_sysroot)\nNOTE: Running task 832 of 884 (/srv/pokybuild/yocto-worker/qemuarmv5/build/build/tmp/work/qemuarmv5-poky-linux-gnueabi/core-image-sato/1.0/testsdkext/workspace/recipes/kernel-module-hello-world/kernel-module-hello-world_git.bb:do_prepare_recipe_sysroot)\nNOTE: recipe make-mod-scripts-1.0-r0: task do_patch: Started\nNOTE: recipe make-mod-scripts-1.0-r0: task do_prepare_recipe_sysroot: Started\nNOTE: recipe make-mod-scripts-1.0-r0: task do_patch: Succeeded\nNOTE: Running task 861 of 884 (/srv/pokybuild/yocto-worker/qemuarmv5/build/build/tmp/work/qemuarmv5-poky-linux-gnueabi/core-image-sato/1.0/testsdkext/layers/openembedded-core/meta/recipes-kernel/make-mod-scripts/make-mod-scripts_1.0.bb:do_deploy_source_date_epoch)\nNOTE: recipe make-mod-scripts-1.0-r0: task do_prepare_recipe_sysroot: Succeeded\nNOTE: recipe make-mod-scripts-1.0-r0: task do_deploy_source_date_epoch: Started\nNOTE: recipe make-mod-scripts-1.0-r0: task do_deploy_source_date_epoch: Succeeded\nNOTE: recipe kernel-module-hello-world-1.0+git-r0: task do_prepare_recipe_sysroot: Started\nNOTE: recipe kernel-module-hello-world-1.0+git-r0: task do_prepare_recipe_sysroot: Succeeded\nNOTE: recipe linux-yocto-6.18.44+git-r0: task do_fetch: Succeeded\nNOTE: Running task 862 of 884 (/srv/pokybuild/yocto-worker/qemuarmv5/build/build/tmp/work/qemuarmv5-poky-linux-gnueabi/core-image-sato/1.0/testsdkext/layers/openembedded-core/meta/recipes-kernel/linux/linux-yocto_6.18.bb:do_unpack)\nNOTE: I/O pressure (>20000.0us) is limiting task startup\nNOTE: No pressure is limiting task startup\nNOTE: Running task 863 of 884 (/srv/pokybuild/yocto-worker/qemuarmv5/build/build/tmp/work/qemuarmv5-poky-linux-gnueabi/core-image-sato/1.0/testsdkext/layers/openembedded-core/meta/recipes-kernel/linux/linux-yocto_6.18.bb:do_prepare_recipe_sysroot)\nNOTE: recipe linux-yocto-6.18.44+git-r0: task do_unpack: Started\nNOTE: recipe linux-yocto-6.18.44+git-r0: task do_prepare_recipe_sysroot: Started\nNOTE: recipe linux-yocto-6.18.44+git-r0: task do_prepare_recipe_sysroot: Succeeded\nNOTE: recipe linux-yocto-6.18.44+git-r0: task do_unpack: Succeeded\nNOTE: Running task 864 of 884 (/srv/pokybuild/yocto-worker/qemuarmv5/build/build/tmp/work/qemuarmv5-poky-linux-gnueabi/core-image-sato/1.0/testsdkext/layers/openembedded-core/meta/recipes-kernel/linux/linux-yocto_6.18.bb:do_symlink_kernsrc)\nNOTE: recipe linux-yocto-6.18.44+git-r0: task do_symlink_kernsrc: Started\nNOTE: recipe linux-yocto-6.18.44+git-r0: task do_symlink_kernsrc: Succeeded\nNOTE: Running task 865 of 884 (/srv/pokybuild/yocto-worker/qemuarmv5/build/build/tmp/work/qemuarmv5-poky-linux-gnueabi/core-image-sato/1.0/testsdkext/layers/openembedded-core/meta/recipes-kernel/linux/linux-yocto_6.18.bb:do_kernel_checkout)\nNOTE: recipe linux-yocto-6.18.44+git-r0: task do_kernel_checkout: Started\nNOTE: recipe linux-yocto-6.18.44+git-r0: task do_kernel_checkout: Succeeded\nNOTE: Running task 866 of 884 (/srv/pokybuild/yocto-worker/qemuarmv5/build/build/tmp/work/qemuarmv5-poky-linux-gnueabi/core-image-sato/1.0/testsdkext/layers/openembedded-core/meta/recipes-kernel/linux/linux-yocto_6.18.bb:do_validate_branches)\nNOTE: recipe linux-yocto-6.18.44+git-r0: task do_validate_branches: Started\nNOTE: recipe linux-yocto-6.18.44+git-r0: task do_validate_branches: Succeeded\nNOTE: Running task 867 of 884 (/srv/pokybuild/yocto-worker/qemuarmv5/build/build/tmp/work/qemuarmv5-poky-linux-gnueabi/core-image-sato/1.0/testsdkext/layers/openembedded-core/meta/recipes-kernel/linux/linux-yocto_6.18.bb:do_kernel_metadata)\nNOTE: recipe linux-yocto-6.18.44+git-r0: task do_kernel_metadata: Started\nNOTE: recipe linux-yocto-6.18.44+git-r0: task do_kernel_metadata: Succeeded\nNOTE: Running task 868 of 884 (/srv/pokybuild/yocto-worker/qemuarmv5/build/build/tmp/work/qemuarmv5-poky-linux-gnueabi/core-image-sato/1.0/testsdkext/layers/openembedded-core/meta/recipes-kernel/linux/linux-yocto_6.18.bb:do_patch)\nNOTE: Running task 869 of 884 (/srv/pokybuild/yocto-worker/qemuarmv5/build/build/tmp/work/qemuarmv5-poky-linux-gnueabi/core-image-sato/1.0/testsdkext/layers/openembedded-core/meta/recipes-kernel/linux/linux-yocto_6.18.bb:do_kernel_version_sanity_check)\nNOTE: recipe linux-yocto-6.18.44+git-r0: task do_patch: Started\nNOTE: recipe linux-yocto-6.18.44+git-r0: task do_kernel_version_sanity_check: Started\nNOTE: recipe linux-yocto-6.18.44+git-r0: task do_kernel_version_sanity_check: Succeeded\nNOTE: recipe linux-yocto-6.18.44+git-r0: task do_patch: Succeeded\nNOTE: Running task 870 of 884 (/srv/pokybuild/yocto-worker/qemuarmv5/build/build/tmp/work/qemuarmv5-poky-linux-gnueabi/core-image-sato/1.0/testsdkext/layers/openembedded-core/meta/recipes-kernel/linux/linux-yocto_6.18.bb:do_kernel_configme)\nNOTE: recipe linux-yocto-6.18.44+git-r0: task do_kernel_configme: Started\nNOTE: recipe linux-yocto-6.18.44+git-r0: task do_kernel_configme: Succeeded\nNOTE: Running task 872 of 884 (/srv/pokybuild/yocto-worker/qemuarmv5/build/build/tmp/work/qemuarmv5-poky-linux-gnueabi/core-image-sato/1.0/testsdkext/layers/openembedded-core/meta/recipes-kernel/linux/linux-yocto_6.18.bb:do_configure)\nNOTE: recipe linux-yocto-6.18.44+git-r0: task do_configure: Started\nNOTE: recipe linux-yocto-6.18.44+git-r0: task do_configure: Succeeded\nNOTE: Running task 873 of 884 (/srv/pokybuild/yocto-worker/qemuarmv5/build/build/tmp/work/qemuarmv5-poky-linux-gnueabi/core-image-sato/1.0/testsdkext/layers/openembedded-core/meta/recipes-kernel/linux/linux-yocto_6.18.bb:do_kernel_configcheck)\nNOTE: recipe linux-yocto-6.18.44+git-r0: task do_kernel_configcheck: Started\nNOTE: recipe linux-yocto-6.18.44+git-r0: task do_kernel_configcheck: Succeeded\nNOTE: Running task 874 of 884 (/srv/pokybuild/yocto-worker/qemuarmv5/build/build/tmp/work/qemuarmv5-poky-linux-gnueabi/core-image-sato/1.0/testsdkext/layers/openembedded-core/meta/recipes-kernel/linux/linux-yocto_6.18.bb:do_compile)\nNOTE: recipe linux-yocto-6.18.44+git-r0: task do_compile: Started\nNOTE: recipe linux-yocto-6.18.44+git-r0: task do_compile: Succeeded\nNOTE: Running task 875 of 884 (/srv/pokybuild/yocto-worker/qemuarmv5/build/build/tmp/work/qemuarmv5-poky-linux-gnueabi/core-image-sato/1.0/testsdkext/layers/openembedded-core/meta/recipes-kernel/linux/linux-yocto_6.18.bb:do_shared_workdir)\nNOTE: recipe linux-yocto-6.18.44+git-r0: task do_shared_workdir: Started\nNOTE: recipe linux-yocto-6.18.44+git-r0: task do_shared_workdir: Succeeded\nNOTE: Running task 876 of 884 (/srv/pokybuild/yocto-worker/qemuarmv5/build/build/tmp/work/qemuarmv5-poky-linux-gnueabi/core-image-sato/1.0/testsdkext/layers/openembedded-core/meta/recipes-kernel/linux/linux-yocto_6.18.bb:do_compile_kernelmodules)\nNOTE: Running task 877 of 884 (/srv/pokybuild/yocto-worker/qemuarmv5/build/build/tmp/work/qemuarmv5-poky-linux-gnueabi/core-image-sato/1.0/testsdkext/layers/openembedded-core/meta/recipes-kernel/make-mod-scripts/make-mod-scripts_1.0.bb:do_configure)\nNOTE: recipe make-mod-scripts-1.0-r0: task do_configure: Started\nNOTE: recipe linux-yocto-6.18.44+git-r0: task do_compile_kernelmodules: Started\nNOTE: recipe make-mod-scripts-1.0-r0: task do_configure: Succeeded\nNOTE: recipe linux-yocto-6.18.44+git-r0: task do_compile_kernelmodules: Succeeded\nNOTE: Running task 878 of 884 (/srv/pokybuild/yocto-worker/qemuarmv5/build/build/tmp/work/qemuarmv5-poky-linux-gnueabi/core-image-sato/1.0/testsdkext/layers/openembedded-core/meta/recipes-kernel/make-mod-scripts/make-mod-scripts_1.0.bb:do_compile)\nNOTE: recipe make-mod-scripts-1.0-r0: task do_compile: Started\nNOTE: recipe make-mod-scripts-1.0-r0: task do_compile: Succeeded\nNOTE: Running task 879 of 884 (/srv/pokybuild/yocto-worker/qemuarmv5/build/build/tmp/work/qemuarmv5-poky-linux-gnueabi/core-image-sato/1.0/testsdkext/workspace/recipes/kernel-module-hello-world/kernel-module-hello-world_git.bb:do_configure)\nNOTE: recipe kernel-module-hello-world-1.0+git-r0: task do_configure: Started\nNOTE: recipe kernel-module-hello-world-1.0+git-r0: task do_configure: Succeeded\nNOTE: Running task 880 of 884 (/srv/pokybuild/yocto-worker/qemuarmv5/build/build/tmp/work/qemuarmv5-poky-linux-gnueabi/core-image-sato/1.0/testsdkext/workspace/recipes/kernel-module-hello-world/kernel-module-hello-world_git.bb:do_compile)\nNOTE: recipe kernel-module-hello-world-1.0+git-r0: task do_compile: Started\nNOTE: kernel-module-hello-world: compiling from external source tree /srv/pokybuild/yocto-worker/qemuarmv5/build/build/tmp/work/qemuarmv5-poky-linux-gnueabi/core-image-sato/1.0/testsdkext/workspace/sources/kernel-module-hello-world\nNOTE: recipe kernel-module-hello-world-1.0+git-r0: task do_compile: Succeeded\nNOTE: Running task 881 of 884 (/srv/pokybuild/yocto-worker/qemuarmv5/build/build/tmp/work/qemuarmv5-poky-linux-gnueabi/core-image-sato/1.0/testsdkext/workspace/recipes/kernel-module-hello-world/kernel-module-hello-world_git.bb:do_install)\nNOTE: recipe kernel-module-hello-world-1.0+git-r0: task do_install: Started\nERROR: kernel-module-hello-world-1.0+git-r0 do_install: oe_runmake failed\nERROR: kernel-module-hello-world-1.0+git-r0 do_install: Execution of '/srv/pokybuild/yocto-worker/qemuarmv5/build/build/tmp/work/qemuarmv5-poky-linux-gnueabi/core-image-sato/1.0/testsdkext/tmp/work/qemuarmv5-poky-linux-gnueabi/kernel-module-hello-world/1.0+git/temp/run.do_install.1835604' failed with exit code 1\nERROR: Logfile of failure stored in: /srv/pokybuild/yocto-worker/qemuarmv5/build/build/tmp/work/qemuarmv5-poky-linux-gnueabi/core-image-sato/1.0/testsdkext/tmp/work/qemuarmv5-poky-linux-gnueabi/kernel-module-hello-world/1.0+git/temp/log.do_install.1835604\nLog data follows:\n| DEBUG: Executing python function extend_recipe_sysroot\n| NOTE: Direct dependencies are ['/srv/pokybuild/yocto-worker/qemuarmv5/build/build/tmp/work/qemuarmv5-poky-linux-gnueabi/core-image-sato/1.0/testsdkext/layers/openembedded-core/meta/recipes-devtools/binutils/binutils-cross_2.47.bb:do_populate_sysroot', '/srv/pokybuild/yocto-worker/qemuarmv5/build/build/tmp/work/qemuarmv5-poky-linux-gnueabi/core-image-sato/1.0/testsdkext/layers/openembedded-core/meta/recipes-devtools/gcc/gcc-cross_16.2.bb:do_populate_sysroot', '/srv/pokybuild/yocto-worker/qemuarmv5/build/build/tmp/work/qemuarmv5-poky-linux-gnueabi/core-image-sato/1.0/testsdkext/layers/openembedded-core/meta/recipes-devtools/quilt/quilt-native_0.69.bb:do_populate_sysroot', '/srv/pokybuild/yocto-worker/qemuarmv5/build/build/tmp/work/qemuarmv5-poky-linux-gnueabi/core-image-sato/1.0/testsdkext/layers/openembedded-core/meta/recipes-kernel/kern-tools/kern-tools-native_git.bb:do_populate_sysroot', 'virtual:native:/srv/pokybuild/yocto-worker/qemuarmv5/build/build/tmp/work/qemuarmv5-poky-linux-gnueabi/core-image-sato/1.0/testsdkext/layers/openembedded-core/meta/recipes-connectivity/openssl/openssl_3.5.8.bb:do_populate_sysroot', 'virtual:native:/srv/pokybuild/yocto-worker/qemuarmv5/build/build/tmp/work/qemuarmv5-poky-linux-gnueabi/core-image-sato/1.0/testsdkext/layers/openembedded-core/meta/recipes-core/util-linux/util-linux_2.42.2.bb:do_populate_sysroot', 'virtual:native:/srv/pokybuild/yocto-worker/qemuarmv5/build/build/tmp/work/qemuarmv5-poky-linux-gnueabi/core-image-sato/1.0/testsdkext/layers/openembedded-core/meta/recipes-devtools/bison/bison_3.8.2.bb:do_populate_sysroot', 'virtual:native:/srv/pokybuild/yocto-worker/qemuarmv5/build/build/tmp/work/qemuarmv5-poky-linux-gnueabi/core-image-sato/1.0/testsdkext/layers/openembedded-core/meta/recipes-devtools/patch/patch_2.8.bb:do_populate_sysroot', 'virtual:native:/srv/pokybuild/yocto-worker/qemuarmv5/build/build/tmp/work/qemuarmv5-poky-linux-gnueabi/core-image-sato/1.0/testsdkext/layers/openembedded-core/meta/recipes-devtools/pkgconf/pkgconf_3.0.6.bb:do_populate_sysroot', 'virtual:native:/srv/pokybuild/yocto-worker/qemuarmv5/build/build/tmp/work/qemuarmv5-poky-linux-gnueabi/core-image-sato/1.0/testsdkext/layers/openembedded-core/meta/recipes-devtools/pseudo/pseudo_git.bb:do_populate_sysroot', 'virtual:native:/srv/pokybuild/yocto-worker/qemuarmv5/build/build/tmp/work/qemuarmv5-poky-linux-gnueabi/core-image-sato/1.0/testsdkext/layers/openembedded-core/meta/recipes-extended/bc/bc_1.08.2.bb:do_populate_sysroot', 'virtual:native:/srv/pokybuild/yocto-worker/qemuarmv5/build/build/tmp/work/qemuarmv5-poky-linux-gnueabi/core-image-sato/1.0/testsdkext/layers/openembedded-core/meta/recipes-extended/xz/xz_5.8.3.bb:do_populate_sysroot', 'virtual:native:/srv/pokybuild/yocto-worker/qemuarmv5/build/build/tmp/work/qemuarmv5-poky-linux-gnueabi/core-image-sato/1.0/testsdkext/layers/openembedded-core/meta/recipes-kernel/kmod/kmod_34.2.bb:do_populate_sysroot', 'virtual:native:/srv/pokybuild/yocto-worker/qemuarmv5/build/build/tmp/work/qemuarmv5-poky-linux-gnueabi/core-image-sato/1.0/testsdkext/layers/openembedded-core/meta/recipes-support/gmp/gmp_6.3.0.bb:do_populate_sysroot', 'virtual:native:/srv/pokybuild/yocto-worker/qemuarmv5/build/build/tmp/work/qemuarmv5-poky-linux-gnueabi/core-image-sato/1.0/testsdkext/layers/openembedded-core/meta/recipes-support/libmpc/libmpc_1.4.1.bb:do_populate_sysroot']\n| NOTE: Installed into sysroot: []\n| NOTE: Skipping as already exists in sysroot: ['gettext-minimal-native', 'binutils-cross-arm', 'cmake-native', 'gcc-cross-arm', 'libtool-native', 'm4-native', 'quilt-native', 'texinfo-dummy-native', 'kern-tools-native', 'linux-libc-headers', 'openssl-native', 'expat-native', 'ncurses-native', 'readline-native', 'util-linux-libuuid-native', 'util-linux-native', 'zlib-native', 'bison-native', 'flex-native', 'git-native', 'gnu-config-native', 'libedit-native', 'make-native', 'patch-native', 'perl-native', 'pkgconf-native', 'pseudo-native', 'python3-native', 'bc-native', 'bzip2-native', 'xz-native', 'zstd-native', 'kmod-native', 'attr-native', 'curl-native', 'gdbm-native', 'gmp-native', 'libcap-ng-native', 'libffi-native', 'libmpc-native', 'libpcre2-native', 'mpfr-native', 'sqlite3-native']\n| DEBUG: Python function extend_recipe_sysroot finished\n| DEBUG: Executing shell function do_install\n| NOTE: make -j 16 -l 75 KERNEL_SRC=/srv/pokybuild/yocto-worker/qemuarmv5/build/build/tmp/work/qemuarmv5-poky-linux-gnueabi/core-image-sato/1.0/testsdkext/tmp/work-shared/qemuarmv5/kernel-source DEPMOD=echo MODLIB=/srv/pokybuild/yocto-worker/qemuarmv5/build/build/tmp/work/qemuarmv5-poky-linux-gnueabi/core-image-sato/1.0/testsdkext/tmp/work/qemuarmv5-poky-linux-gnueabi/kernel-module-hello-world/1.0+git/image/lib/modules/6.18.44-yocto-standard INSTALL_FW_PATH=/srv/pokybuild/yocto-worker/qemuarmv5/build/build/tmp/work/qemuarmv5-poky-linux-gnueabi/core-image-sato/1.0/testsdkext/tmp/work/qemuarmv5-poky-linux-gnueabi/kernel-module-hello-world/1.0+git/image/lib/firmware CC=arm-poky-linux-gnueabi-gcc  -mno-thumb-interwork -marm  -fuse-ld=bfd -fcanon-prefix-map  -ffile-prefix-map=/srv/pokybuild/yocto-worker/qemuarmv5/build/build/tmp/work/qemuarmv5-poky-linux-gnueabi/core-image-sato/1.0/testsdkext/workspace/sources/kernel-module-hello-world=/usr/src/debug/kernel-module-hello-world/1.0+git  -ffile-prefix-map=/srv/pokybuild/yocto-worker/qemuarmv5/build/build/tmp/work/qemuarmv5-poky-linux-gnueabi/core-image-sato/1.0/testsdkext/workspace/sources/kernel-module-hello-world=/usr/src/debug/kernel-module-hello-world/1.0+git  -ffile-prefix-map=/srv/pokybuild/yocto-worker/qemuarmv5/build/build/tmp/work/qemuarmv5-poky-linux-gnueabi/core-image-sato/1.0/testsdkext/tmp/work/qemuarmv5-poky-linux-gnueabi/kernel-module-hello-world/1.0+git/recipe-sysroot=  -ffile-prefix-map=/srv/pokybuild/yocto-worker/qemuarmv5/build/build/tmp/work/qemuarmv5-poky-linux-gnueabi/core-image-sato/1.0/testsdkext/tmp/work/qemuarmv5-poky-linux-gnueabi/kernel-module-hello-world/1.0+git/recipe-sysroot-native=   -ffile-prefix-map=/srv/pokybuild/yocto-worker/qemuarmv5/build/build/tmp/work/qemuarmv5-poky-linux-gnueabi/core-image-sato/1.0/testsdkext/tmp/work-shared/qemuarmv5/kernel-source=/usr/src/kernel  -ffile-prefix-map=/srv/pokybuild/yocto-worker/qemuarmv5/build/build/tmp/work/qemuarmv5-poky-linux-gnueabi/core-image-sato/1.0/testsdkext/tmp/work-shared/qemuarmv5/kernel-build-artifacts=/usr/src/kernel  LD=arm-poky-linux-gnueabi-ld.bfd   OBJCOPY=arm-poky-linux-gnueabi-objcopy  STRIP=arm-poky-linux-gnueabi-strip O=/srv/pokybuild/yocto-worker/qemuarmv5/build/build/tmp/work/qemuarmv5-poky-linux-gnueabi/core-image-sato/1.0/testsdkext/tmp/work-shared/qemuarmv5/kernel-build-artifacts KBUILD_EXTRA_SYMBOLS= modules_install\n| make -C /srv/pokybuild/yocto-worker/qemuarmv5/build/build/tmp/work/qemuarmv5-poky-linux-gnueabi/core-image-sato/1.0/testsdkext/tmp/work-shared/qemuarmv5/kernel-source M=/srv/pokybuild/yocto-worker/qemuarmv5/build/build/tmp/work/qemuarmv5-poky-linux-gnueabi/core-image-sato/1.0/testsdkext/workspace/sources/kernel-module-hello-world modules_install\n| make[1]: Entering directory '/srv/pokybuild/yocto-worker/qemuarmv5/build/build/tmp/work/qemuarmv5-poky-linux-gnueabi/core-image-sato/1.0/testsdkext/tmp/work-shared/qemuarmv5/kernel-source'\n| make[2]: Entering directory '/srv/pokybuild/yocto-worker/qemuarmv5/build/build/tmp/work/qemuarmv5-poky-linux-gnueabi/core-image-sato/1.0/testsdkext/workspace/sources/kernel-module-hello-world'\n| make[4]: *** No rule to make target '/srv/pokybuild/yocto-worker/qemuarmv5/build/build/tmp/work/qemuarmv5-poky-linux-gnueabi/core-image-sato/1.0/testsdkext/tmp/work/qemuarmv5-poky-linux-gnueabi/kernel-module-hello-world/1.0+git/image/lib/modules/6.18.44-yocto-standard/updates/hello-world.ko', needed by '__modinst'.  Stop.\n| make[3]: *** [/srv/pokybuild/yocto-worker/qemuarmv5/build/build/tmp/work/qemuarmv5-poky-linux-gnueabi/core-image-sato/1.0/testsdkext/tmp/work-shared/qemuarmv5/kernel-source/Makefile:1956: modules_install] Error 2\n| make[2]: *** [/srv/pokybuild/yocto-worker/qemuarmv5/build/build/tmp/work/qemuarmv5-poky-linux-gnueabi/core-image-sato/1.0/testsdkext/tmp/work-shared/qemuarmv5/kernel-source/Makefile:248: __sub-make] Error 2\n| make[2]: Leaving directory '/srv/pokybuild/yocto-worker/qemuarmv5/build/build/tmp/work/qemuarmv5-poky-linux-gnueabi/core-image-sato/1.0/testsdkext/workspace/sources/kernel-module-hello-world'\n| make[1]: Leaving directory '/srv/pokybuild/yocto-worker/qemuarmv5/build/build/tmp/work/qemuarmv5-poky-linux-gnueabi/core-image-sato/1.0/testsdkext/tmp/work-shared/qemuarmv5/kernel-source'\n| make[1]: *** [Makefile:248: __sub-make] Error 2\n| make: *** [Makefile:9: modules_install] Error 2\n| ERROR: oe_runmake failed\n| WARNING: exit code 1 from a shell command.\nNOTE: recipe kernel-module-hello-world-1.0+git-r0: task do_install: Failed\nERROR: Task (/srv/pokybuild/yocto-worker/qemuarmv5/build/build/tmp/work/qemuarmv5-poky-linux-gnueabi/core-image-sato/1.0/testsdkext/workspace/recipes/kernel-module-hello-world/kernel-module-hello-world_git.bb:do_install) failed with exit code '1'\nNOTE: Tasks Summary: Attempted 881 tasks of which 853 didn't need to be rerun and 1 failed.\nNOTE: The errors for this build are stored in /srv/pokybuild/yocto-worker/qemuarmv5/build/build/tmp/work/qemuarmv5-poky-linux-gnueabi/core-image-sato/1.0/testsdkext/tmp/log/error-report/error_report_20260902154635.txt\nYou can send the errors to a reports server by running:\n  send-error-report /srv/pokybuild/yocto-worker/qemuarmv5/build/build/tmp/work/qemuarmv5-poky-linux-gnueabi/core-image-sato/1.0/testsdkext/tmp/log/error-report/error_report_20260902154635.txt [-s server]\nNOTE: The contents of these logs will be posted in public if you use the above command with the default server. Please ensure you remove any identifying or proprietary information when prompted before sending.\n\nSummary: 1 task failed:\n  /srv/pokybuild/yocto-worker/qemuarmv5/build/build/tmp/work/qemuarmv5-poky-linux-gnueabi/core-image-sato/1.0/testsdkext/workspace/recipes/kernel-module-hello-world/kernel-module-hello-world_git.bb:do_install\n    log: /srv/pokybuild/yocto-worker/qemuarmv5/build/build/tmp/work/qemuarmv5-poky-linux-gnueabi/core-image-sato/1.0/testsdkext/tmp/work/qemuarmv5-poky-linux-gnueabi/kernel-module-hello-world/1.0+git/temp/log.do_install.1835604\nSummary: There was 1 WARNING message.\nSummary: There were 2 ERROR messages, returning a non-zero exit code.\n\n",
    "status": "ERROR"
   },
   "devtool.DevtoolTest.test_devtool_location": {
    "duration": 0.012804746627807617,
    "status": "PASSED"
   },
   "devtool.DevtoolTest.test_extend_autotools_recipe_creation": {
    "duration": 160.4677219390869,
    "status": "PASSED"
   },
   "devtool.DevtoolTest.test_recipes_for_nodejs": {
    "duration": 25.197545766830444,
    "status": "PASSED"
   },
   "devtool.SdkUpdateTest.test_sdk_update_http": {
    "duration": 1.0326361656188965,
    "status": "PASSED"
   },
   "gcc.GccCompileTest.test_gcc_compile": {
    "duration": 0.0879814624786377,
    "status": "PASSED"
   },
   "gcc.GccCompileTest.test_gpp2_compile": {
    "duration": 0.08563518524169922,
    "status": "PASSED"
   },
   "gcc.GccCompileTest.test_gpp_compile": {
    "duration": 0.25666332244873047,
    "status": "PASSED"
   },
   "gcc.GccCompileTest.test_make": {
    "duration": 0.08988809585571289,
    "status": "PASSED"
   },
   "go.GoCompileTest.test_go_build": {
    "duration": 0.00030303001403808594,
    "log": "GoCompileTest class: SDK doesn't contain a Go cross-canadian toolchain",
    "status": "SKIPPED"
   },
   "go.GoCompileTest.test_go_module": {
    "duration": 0.0001761913299560547,
    "log": "GoCompileTest class: SDK doesn't contain a Go cross-canadian toolchain",
    "status": "SKIPPED"
   },
   "go.GoHostCompileTest.test_go_cross_compile": {
    "duration": 0.00020766258239746094,
    "log": "GoHostCompileTest class: SDK doesn't contain a Go cross-canadian toolchain",
    "status": "SKIPPED"
   },
   "go.GoHostCompileTest.test_go_module_cross_compile": {
    "duration": 0.00014829635620117188,
    "log": "GoHostCompileTest class: SDK doesn't contain a Go cross-canadian toolchain",
    "status": "SKIPPED"
   },
   "gtk3.GTK3Test.test_libhandy": {
    "duration": 0.0002052783966064453,
    "log": "gtk3.GTK3Test.test_libhandy does not support eSDK (https://bugzilla.yoctoproject.org/show_bug.cgi?id=15854)",
    "status": "SKIPPED"
   },
   "kmod.KernelModuleTest.test_cryptodev": {
    "duration": 0.00017142295837402344,
    "log": "kmod.KernelModuleTest.test_cryptodev does not support eSDK (https://bugzilla.yoctoproject.org/show_bug.cgi?id=15850)",
    "status": "SKIPPED"
   },
   "makefile.MakefileTest.test_lzip": {
    "duration": 1.568444013595581,
    "status": "PASSED"
   },
   "manifest.ManifestTest.test_manifests": {
    "duration": 0.00010824203491210938,
    "status": "PASSED"
   },
   "maturin.MaturinDevelopTest.test_maturin_develop": {
    "duration": 24.235267639160156,
    "log": "Testing 'maturin develop' requires Rust cross-canadian in the SDK",
    "status": "SKIPPED"
   },
   "maturin.MaturinTest.test_maturin_list_python": {
    "duration": 16.50093722343445,
    "status": "PASSED"
   },
   "meson.MesonTest.test_iputils": {
    "duration": 0.0002522468566894531,
    "log": "meson.MesonTest.test_iputils does not support eSDK (https://bugzilla.yoctoproject.org/show_bug.cgi?id=15854)",
    "status": "SKIPPED"
   },
   "perl.PerlTest.test_perl": {
    "duration": 0.015317440032958984,
    "status": "PASSED"
   },
   "python.Python3Test.test_python3": {
    "duration": 17.450642108917236,
    "status": "PASSED"
   },
   "rust.RustCompileTest.test_cargo_build": {
    "duration": 0.0002903938293457031,
    "log": "RustCompileTest class: SDK doesn't contain a Rust cross-canadian toolchain",
    "status": "SKIPPED"
   },
   "rust.RustHostCompileTest.test_cargo_build": {
    "duration": 0.00023984909057617188,
    "log": "RustCompileTest class: SDK doesn't contain a Rust cross-canadian toolchain",
    "status": "SKIPPED"
   }
  }
 }
}