{
 "oeselftest_rocky-8.10_qemux86-64_20260913101638": {
  "configuration": {
   "HOST_DISTRO": "rocky-8.10",
   "HOST_NAME": "rocky8-vk-1",
   "LAYERS": {
    "meta": {
     "branch": "master-next",
     "commit": "fee85dccc1c49058c7db895f913af8fe43416efa",
     "commit_count": 68823,
     "commit_time": 1789293269
    },
    "meta-poky": {
     "branch": "master",
     "commit": "7e41504cd63b099b214f10d92cfdaf358ab98c5f",
     "commit_count": 1821,
     "commit_time": 1788885316
    },
    "meta-selftest": {
     "branch": "master-next",
     "commit": "fee85dccc1c49058c7db895f913af8fe43416efa",
     "commit_count": 68823,
     "commit_time": 1789293269
    },
    "meta-yocto-bsp": {
     "branch": "master",
     "commit": "7e41504cd63b099b214f10d92cfdaf358ab98c5f",
     "commit_count": 1821,
     "commit_time": 1788885316
    }
   },
   "MACHINE": "qemux86-64",
   "OESELFTEST_METADATA": {
    "exclude_tags": [
     "yocto-mirrors",
     "machine",
     "toolchain-user",
     "toolchain-system"
    ],
    "run_all_tests": true,
    "run_tests": null,
    "select_tags": null,
    "skips": [
     "distrodata.Distrodata.test_checkpkg",
     "reproducible"
    ]
   },
   "STARTTIME": "20260913101638",
   "TESTSERIES": "oeqa",
   "TEST_TYPE": "oeselftest"
  },
  "result": {
   "archiver.Archiver.test_archiver_allows_to_filter_on_recipe_name": {
    "duration": 44.009,
    "status": "PASSED"
   },
   "archiver.Archiver.test_archiver_cleanup": {
    "duration": 81.991,
    "status": "PASSED"
   },
   "archiver.Archiver.test_archiver_filters_by_type": {
    "duration": 34.18,
    "status": "PASSED"
   },
   "archiver.Archiver.test_archiver_filters_by_type_and_name": {
    "duration": 34.002,
    "status": "PASSED"
   },
   "archiver.Archiver.test_archiver_mode_configured": {
    "duration": 35.185,
    "status": "PASSED"
   },
   "archiver.Archiver.test_archiver_mode_diff": {
    "duration": 37.066,
    "status": "PASSED"
   },
   "archiver.Archiver.test_archiver_mode_dumpdata": {
    "duration": 14.536,
    "status": "PASSED"
   },
   "archiver.Archiver.test_archiver_mode_mirror": {
    "duration": 33.572,
    "status": "PASSED"
   },
   "archiver.Archiver.test_archiver_mode_mirror_combined": {
    "duration": 44.479,
    "status": "PASSED"
   },
   "archiver.Archiver.test_archiver_mode_mirror_excludes": {
    "duration": 33.208,
    "status": "PASSED"
   },
   "archiver.Archiver.test_archiver_mode_mirror_gitsm": {
    "duration": 26.56,
    "status": "PASSED"
   },
   "archiver.Archiver.test_archiver_mode_mirror_gitsm_shallow": {
    "duration": 53.105,
    "status": "PASSED"
   },
   "archiver.Archiver.test_archiver_mode_original": {
    "duration": 37.04,
    "status": "PASSED"
   },
   "archiver.Archiver.test_archiver_mode_patched": {
    "duration": 20.395,
    "status": "PASSED"
   },
   "archiver.Archiver.test_archiver_mode_recipe": {
    "duration": 44.721,
    "status": "PASSED"
   },
   "archiver.Archiver.test_archiver_multiconfig_shared_unpack_and_patch": {
    "duration": 170.116,
    "status": "PASSED"
   },
   "barebox.BareboxTest.test_boot_barebox": {
    "duration": 0.003516,
    "log": "Test skipped on x86_64\n",
    "oetags": [
     "runqemu"
    ],
    "status": "SKIPPED"
   },
   "baremetal.BaremetalTest.test_baremetal": {
    "duration": 4434.869,
    "status": "PASSED"
   },
   "bbclasses.Systemd.test_systemd_in_distro": {
    "duration": 84.843,
    "status": "PASSED"
   },
   "bbclasses.Systemd.test_sysvinit_in_distro": {
    "duration": 41.497,
    "status": "PASSED"
   },
   "bblayers.BitbakeConfigBuild.test_enable_disable_builtin_fragments": {
    "duration": 23.586,
    "status": "PASSED"
   },
   "bblayers.BitbakeConfigBuild.test_enable_disable_fragments": {
    "duration": 19.591,
    "status": "PASSED"
   },
   "bblayers.BitbakeConfigBuild.test_show_fragment": {
    "duration": 2.058,
    "status": "PASSED"
   },
   "bblayers.BitbakeLayers.test_bitbakelayers_add_remove": {
    "duration": 9.512,
    "status": "PASSED"
   },
   "bblayers.BitbakeLayers.test_bitbakelayers_createlayer": {
    "duration": 7.626,
    "status": "PASSED"
   },
   "bblayers.BitbakeLayers.test_bitbakelayers_flatten": {
    "duration": 51.212,
    "status": "PASSED"
   },
   "bblayers.BitbakeLayers.test_bitbakelayers_layerindexshowdepends": {
    "duration": 1.695,
    "status": "PASSED"
   },
   "bblayers.BitbakeLayers.test_bitbakelayers_setup": {
    "duration": 33.756,
    "status": "PASSED"
   },
   "bblayers.BitbakeLayers.test_bitbakelayers_showappends": {
    "duration": 12.298,
    "status": "PASSED"
   },
   "bblayers.BitbakeLayers.test_bitbakelayers_showcrossdepends": {
    "duration": 32.992,
    "status": "PASSED"
   },
   "bblayers.BitbakeLayers.test_bitbakelayers_showlayers": {
    "duration": 1.128,
    "status": "PASSED"
   },
   "bblayers.BitbakeLayers.test_bitbakelayers_showoverlayed": {
    "duration": 4.206,
    "status": "PASSED"
   },
   "bblayers.BitbakeLayers.test_bitbakelayers_showrecipes": {
    "duration": 32.007,
    "status": "PASSED"
   },
   "bblayers.BitbakeLayers.test_bitbakelayers_updatelayer": {
    "duration": 6.598,
    "status": "PASSED"
   },
   "bblayers.BitbakeLayers.test_validate_bitbake_setup_default_registry": {
    "duration": 2.418,
    "status": "PASSED"
   },
   "bblayers.BitbakeLayers.test_validate_examplelayersjson": {
    "duration": 0.2753,
    "status": "PASSED"
   },
   "bblock.BBLock.test_lock_architecture_specific": {
    "duration": 117.549,
    "status": "PASSED"
   },
   "bblock.BBLock.test_lock_multiple_recipe_single_task": {
    "duration": 312.898,
    "status": "PASSED"
   },
   "bblock.BBLock.test_lock_single_recipe_all_tasks": {
    "duration": 283.788,
    "status": "PASSED"
   },
   "bblock.BBLock.test_lock_single_recipe_multiple_tasks": {
    "duration": 197.732,
    "status": "PASSED"
   },
   "bblock.BBLock.test_lock_single_recipe_single_task": {
    "duration": 179.931,
    "status": "PASSED"
   },
   "bblogging.BitBakeLogging.test_python_exec_func_python_loggingA": {
    "duration": 47.724,
    "status": "PASSED"
   },
   "bblogging.BitBakeLogging.test_python_exec_func_python_loggingB": {
    "duration": 35.547,
    "status": "PASSED"
   },
   "bblogging.BitBakeLogging.test_python_exec_func_python_loggingC": {
    "duration": 35.896,
    "status": "PASSED"
   },
   "bblogging.BitBakeLogging.test_python_exec_func_python_loggingD": {
    "duration": 12.859,
    "status": "PASSED"
   },
   "bblogging.BitBakeLogging.test_python_exec_func_shell_loggingA": {
    "duration": 16.422,
    "status": "PASSED"
   },
   "bblogging.BitBakeLogging.test_python_exec_func_shell_loggingB": {
    "duration": 14.408,
    "status": "PASSED"
   },
   "bblogging.BitBakeLogging.test_python_exec_func_shell_loggingC": {
    "duration": 16.224,
    "status": "PASSED"
   },
   "bblogging.BitBakeLogging.test_python_exec_func_shell_loggingD": {
    "duration": 15.216,
    "status": "PASSED"
   },
   "bblogging.BitBakeLogging.test_python_exit_loggingA": {
    "duration": 16.25,
    "status": "PASSED"
   },
   "bblogging.BitBakeLogging.test_python_exit_loggingB": {
    "duration": 15.822,
    "status": "PASSED"
   },
   "bblogging.BitBakeLogging.test_python_exit_loggingC": {
    "duration": 15.981,
    "status": "PASSED"
   },
   "bblogging.BitBakeLogging.test_python_exit_loggingD": {
    "duration": 15.145,
    "status": "PASSED"
   },
   "bblogging.BitBakeLogging.test_python_fatal_loggingA": {
    "duration": 14.011,
    "status": "PASSED"
   },
   "bblogging.BitBakeLogging.test_python_fatal_loggingB": {
    "duration": 15.303,
    "status": "PASSED"
   },
   "bblogging.BitBakeLogging.test_python_fatal_loggingC": {
    "duration": 14.116,
    "status": "PASSED"
   },
   "bblogging.BitBakeLogging.test_python_fatal_loggingD": {
    "duration": 14.877,
    "status": "PASSED"
   },
   "bblogging.BitBakeLogging.test_shell_loggingA": {
    "duration": 15.667,
    "status": "PASSED"
   },
   "bblogging.BitBakeLogging.test_shell_loggingB": {
    "duration": 17.819,
    "status": "PASSED"
   },
   "bblogging.BitBakeLogging.test_shell_loggingC": {
    "duration": 13.756,
    "status": "PASSED"
   },
   "bblogging.BitBakeLogging.test_shell_loggingD": {
    "duration": 16.999,
    "status": "PASSED"
   },
   "bbtests.BitbakeTests.test_bb_env_bb_getvar_equality": {
    "duration": 3.917,
    "status": "PASSED"
   },
   "bbtests.BitbakeTests.test_bbappend_order": {
    "duration": 41.987,
    "status": "PASSED"
   },
   "bbtests.BitbakeTests.test_bitbake_g": {
    "duration": 6.526,
    "status": "PASSED"
   },
   "bbtests.BitbakeTests.test_bitbake_invalid_recipe": {
    "duration": 1.791,
    "status": "PASSED"
   },
   "bbtests.BitbakeTests.test_bitbake_invalid_target": {
    "duration": 8.239,
    "status": "PASSED"
   },
   "bbtests.BitbakeTests.test_checkuri": {
    "duration": 10.825,
    "status": "PASSED"
   },
   "bbtests.BitbakeTests.test_continue": {
    "duration": 48.648,
    "status": "PASSED"
   },
   "bbtests.BitbakeTests.test_dry_run": {
    "duration": 9.285,
    "status": "PASSED"
   },
   "bbtests.BitbakeTests.test_environment": {
    "duration": 3.89,
    "status": "PASSED"
   },
   "bbtests.BitbakeTests.test_event_handler": {
    "duration": 33.6,
    "status": "PASSED"
   },
   "bbtests.BitbakeTests.test_force_task_1": {
    "duration": 97.904,
    "status": "PASSED"
   },
   "bbtests.BitbakeTests.test_force_task_2": {
    "duration": 56.394,
    "status": "PASSED"
   },
   "bbtests.BitbakeTests.test_git_patchtool": {
    "duration": 28.298,
    "status": "PASSED"
   },
   "bbtests.BitbakeTests.test_git_patchtool2": {
    "duration": 36.444,
    "status": "PASSED"
   },
   "bbtests.BitbakeTests.test_git_unpack_nonetwork": {
    "duration": 44.785,
    "status": "PASSED"
   },
   "bbtests.BitbakeTests.test_git_unpack_nonetwork_fail": {
    "duration": 17.666,
    "status": "PASSED"
   },
   "bbtests.BitbakeTests.test_image_manifest": {
    "duration": 3252.64,
    "status": "PASSED"
   },
   "bbtests.BitbakeTests.test_invalid_patch": {
    "duration": 38.553,
    "status": "PASSED"
   },
   "bbtests.BitbakeTests.test_invalid_recipe_src_uri": {
    "duration": 4.302,
    "status": "PASSED"
   },
   "bbtests.BitbakeTests.test_just_parse": {
    "duration": 3.807,
    "status": "PASSED"
   },
   "bbtests.BitbakeTests.test_local_sstate": {
    "duration": 23.328,
    "status": "PASSED"
   },
   "bbtests.BitbakeTests.test_non_gplv3": {
    "duration": 303.51,
    "status": "PASSED"
   },
   "bbtests.BitbakeTests.test_postfile": {
    "duration": 5.074,
    "status": "PASSED"
   },
   "bbtests.BitbakeTests.test_prefile": {
    "duration": 7.62,
    "status": "PASSED"
   },
   "bbtests.BitbakeTests.test_rename_downloaded_file": {
    "duration": 28.883,
    "status": "PASSED"
   },
   "bbtests.BitbakeTests.test_run_bitbake_from_dir_1": {
    "duration": 4.157,
    "status": "PASSED"
   },
   "bbtests.BitbakeTests.test_run_bitbake_from_dir_2": {
    "duration": 3.088,
    "status": "PASSED"
   },
   "bbtests.BitbakeTests.test_run_bitbake_from_dir_3": {
    "duration": 3.349,
    "status": "PASSED"
   },
   "bbtests.BitbakeTests.test_setscene_only": {
    "duration": 24.511,
    "status": "PASSED"
   },
   "bbtests.BitbakeTests.test_skip_setscene": {
    "duration": 49.215,
    "status": "PASSED"
   },
   "bbtests.BitbakeTests.test_unexpanded_variable_in_path": {
    "duration": 26.73,
    "status": "PASSED"
   },
   "bbtests.BitbakeTests.test_version": {
    "duration": 5.387,
    "status": "PASSED"
   },
   "bbtests.BitbakeTests.test_warnings_errors": {
    "duration": 0.8466,
    "status": "PASSED"
   },
   "buildhistory.BuildhistoryTests.test_buildhistory_basic": {
    "duration": 74.153,
    "status": "PASSED"
   },
   "buildhistory.BuildhistoryTests.test_buildhistory_buildtime_pr_backwards": {
    "duration": 85.242,
    "status": "PASSED"
   },
   "buildhistory.BuildhistoryTests.test_buildhistory_diff": {
    "duration": 88.203,
    "status": "PASSED"
   },
   "buildhistory.BuildhistoryTests.test_fileinfo": {
    "duration": 23.094,
    "status": "PASSED"
   },
   "buildoptions.ArchiverTest.test_arch_work_dir_and_export_source": {
    "duration": 54.107,
    "status": "PASSED"
   },
   "buildoptions.DiskMonTest.test_stoptask_behavior": {
    "duration": 114.53,
    "status": "PASSED"
   },
   "buildoptions.ImageOptionsTests.test_ccache_tool": {
    "duration": 159.688,
    "status": "PASSED"
   },
   "buildoptions.ImageOptionsTests.test_incremental_image_generation": {
    "duration": 3914.331,
    "status": "PASSED"
   },
   "buildoptions.ImageOptionsTests.test_read_only_image": {
    "duration": 235.463,
    "status": "PASSED"
   },
   "buildoptions.Poisoning.test_poisoning": {
    "duration": 45.193,
    "status": "PASSED"
   },
   "buildoptions.SanityOptionsTest.test_layer_without_git_dir": {
    "duration": 36.881,
    "status": "PASSED"
   },
   "buildoptions.SanityOptionsTest.test_options_warnqa_errorqa_switch": {
    "duration": 107.021,
    "status": "PASSED"
   },
   "buildoptions.ToolchainOptions.test_toolchain_fortran": {
    "duration": 2309.805,
    "status": "PASSED"
   },
   "c_cpp.CMakeTests.test_cmake_qemu": {
    "duration": 73.279,
    "status": "PASSED"
   },
   "c_cpp.CMakeTests.test_cmake_qemu_failing": {
    "duration": 52.912,
    "status": "PASSED"
   },
   "c_cpp.MesonTests.test_meson_qemu": {
    "duration": 42.452,
    "status": "PASSED"
   },
   "c_cpp.MesonTests.test_meson_qemu_failing": {
    "duration": 47.369,
    "status": "PASSED"
   },
   "containerimage.ContainerImageTests.test_expected_files": {
    "duration": 3689.116,
    "status": "PASSED"
   },
   "cve_check.CVECheck.test_convert_cve_version": {
    "duration": 0.008803,
    "status": "PASSED"
   },
   "cve_check.CVECheck.test_parse_cve_from_patch_contents": {
    "duration": 0.005838,
    "status": "PASSED"
   },
   "cve_check.CVECheck.test_parse_cve_from_patch_filename": {
    "duration": 0.00604,
    "status": "PASSED"
   },
   "cve_check.CVECheck.test_product_match": {
    "duration": 0.006097,
    "status": "PASSED"
   },
   "cve_check.CVECheck.test_version_compare": {
    "duration": 0.007322,
    "status": "PASSED"
   },
   "debuginfod.Debuginfod.test_debuginfod_native": {
    "duration": 68.436,
    "status": "PASSED"
   },
   "debuginfod.Debuginfod.test_debuginfod_qemu": {
    "duration": 3334.326,
    "oetags": [
     "runqemu"
    ],
    "status": "PASSED"
   },
   "devtool.DevtoolAddTests.test_devtool_add": {
    "duration": 111.633,
    "status": "PASSED"
   },
   "devtool.DevtoolAddTests.test_devtool_add_binary": {
    "duration": 79.961,
    "status": "PASSED"
   },
   "devtool.DevtoolAddTests.test_devtool_add_build_finish": {
    "duration": 135.338,
    "status": "PASSED"
   },
   "devtool.DevtoolAddTests.test_devtool_add_build_finish_force": {
    "duration": 128.184,
    "status": "PASSED"
   },
   "devtool.DevtoolAddTests.test_devtool_add_fetch": {
    "duration": 110.413,
    "status": "PASSED"
   },
   "devtool.DevtoolAddTests.test_devtool_add_fetch_git": {
    "duration": 94.423,
    "status": "PASSED"
   },
   "devtool.DevtoolAddTests.test_devtool_add_fetch_simple": {
    "duration": 43.123,
    "status": "PASSED"
   },
   "devtool.DevtoolAddTests.test_devtool_add_git_local": {
    "duration": 58.289,
    "status": "PASSED"
   },
   "devtool.DevtoolAddTests.test_devtool_add_git_style1": {
    "duration": 65.588,
    "status": "PASSED"
   },
   "devtool.DevtoolAddTests.test_devtool_add_git_style2": {
    "duration": 61.68,
    "status": "PASSED"
   },
   "devtool.DevtoolAddTests.test_devtool_add_library": {
    "duration": 85.217,
    "status": "PASSED"
   },
   "devtool.DevtoolAddTests.test_devtool_add_npm": {
    "duration": 1.233,
    "log": "Test needs meta-oe for nodejs\n",
    "status": "SKIPPED"
   },
   "devtool.DevtoolAddTests.test_devtool_add_python_egg_requires": {
    "duration": 41.841,
    "status": "PASSED"
   },
   "devtool.DevtoolBuildImageTests.test_devtool_build_image": {
    "duration": 3034.293,
    "status": "PASSED"
   },
   "devtool.DevtoolDeployTargetTests.test_devtool_deploy_target": {
    "duration": 463.86,
    "oetags": [
     "runqemu"
    ],
    "status": "PASSED"
   },
   "devtool.DevtoolDeployTargetTests.test_devtool_deploy_target_path": {
    "duration": 379.819,
    "oetags": [
     "runqemu"
    ],
    "status": "PASSED"
   },
   "devtool.DevtoolExtractTests.test_devtool_extract": {
    "duration": 60.477,
    "status": "PASSED"
   },
   "devtool.DevtoolExtractTests.test_devtool_extract_virtual": {
    "duration": 40.805,
    "status": "PASSED"
   },
   "devtool.DevtoolIdeSdkClangTests.test_devtool_ide_sdk_code_cmake": {
    "duration": 5708.859,
    "oetags": [
     "runqemu"
    ],
    "status": "PASSED"
   },
   "devtool.DevtoolIdeSdkClangTests.test_devtool_ide_sdk_code_meson": {
    "duration": 421.221,
    "oetags": [
     "runqemu"
    ],
    "status": "PASSED"
   },
   "devtool.DevtoolIdeSdkClangTests.test_devtool_ide_sdk_none_cmake": {
    "duration": 377.719,
    "oetags": [
     "runqemu"
    ],
    "status": "PASSED"
   },
   "devtool.DevtoolIdeSdkClangTests.test_devtool_ide_sdk_none_meson": {
    "duration": 371.511,
    "oetags": [
     "runqemu"
    ],
    "status": "PASSED"
   },
   "devtool.DevtoolIdeSdkGccTests.test_devtool_ide_sdk_code_cmake": {
    "duration": 4103.178,
    "oetags": [
     "runqemu"
    ],
    "status": "PASSED"
   },
   "devtool.DevtoolIdeSdkGccTests.test_devtool_ide_sdk_code_meson": {
    "duration": 284.109,
    "oetags": [
     "runqemu"
    ],
    "status": "PASSED"
   },
   "devtool.DevtoolIdeSdkGccTests.test_devtool_ide_sdk_code_nfs_debug_rootfs": {
    "duration": 266.704,
    "status": "PASSED"
   },
   "devtool.DevtoolIdeSdkGccTests.test_devtool_ide_sdk_none_nfs_qemu": {
    "duration": 347.855,
    "oetags": [
     "runqemu"
    ],
    "status": "PASSED"
   },
   "devtool.DevtoolIdeSdkGccTests.test_devtool_ide_sdk_none_nfs_qemu_slirp": {
    "duration": 380.915,
    "oetags": [
     "runqemu"
    ],
    "status": "PASSED"
   },
   "devtool.DevtoolIdeSdkGccTests.test_devtool_ide_sdk_none_qemu": {
    "duration": 422.644,
    "oetags": [
     "runqemu"
    ],
    "status": "PASSED"
   },
   "devtool.DevtoolIdeSdkGccTests.test_devtool_ide_sdk_none_qemu_slirp": {
    "duration": 236.538,
    "oetags": [
     "runqemu"
    ],
    "status": "PASSED"
   },
   "devtool.DevtoolIdeSdkKernelTests.test_devtool_ide_sdk_code_kernel_module": {
    "duration": 289.366,
    "oetags": [
     "runqemu"
    ],
    "status": "PASSED"
   },
   "devtool.DevtoolIdeSdkMiscTests.test_devtool_ide_sdk_plugins": {
    "duration": 114.1,
    "status": "PASSED"
   },
   "devtool.DevtoolIdeSdkSharedTests.test_devtool_ide_sdk_shared_sysroots": {
    "duration": 3800.023,
    "status": "PASSED"
   },
   "devtool.DevtoolModifyTests.test_devtool_buildclean": {
    "duration": 381.133,
    "status": "PASSED"
   },
   "devtool.DevtoolModifyTests.test_devtool_modify": {
    "duration": 184.159,
    "status": "PASSED"
   },
   "devtool.DevtoolModifyTests.test_devtool_modify_git": {
    "duration": 95.085,
    "status": "PASSED"
   },
   "devtool.DevtoolModifyTests.test_devtool_modify_git_crates_subpath": {
    "duration": 102.273,
    "status": "PASSED"
   },
   "devtool.DevtoolModifyTests.test_devtool_modify_git_no_extract": {
    "duration": 34.024,
    "status": "PASSED"
   },
   "devtool.DevtoolModifyTests.test_devtool_modify_go": {
    "duration": 53.353,
    "status": "PASSED"
   },
   "devtool.DevtoolModifyTests.test_devtool_modify_invalid": {
    "duration": 168.339,
    "status": "PASSED"
   },
   "devtool.DevtoolModifyTests.test_devtool_modify_kernel_cfg_subdirs": {
    "duration": 586.589,
    "status": "PASSED"
   },
   "devtool.DevtoolModifyTests.test_devtool_modify_localfiles": {
    "duration": 137.88,
    "status": "PASSED"
   },
   "devtool.DevtoolModifyTests.test_devtool_modify_localfiles_only": {
    "duration": 95.395,
    "status": "PASSED"
   },
   "devtool.DevtoolModifyTests.test_devtool_modify_multiple_sources": {
    "duration": 1916.593,
    "status": "PASSED"
   },
   "devtool.DevtoolModifyTests.test_devtool_modify_native": {
    "duration": 449.608,
    "status": "PASSED"
   },
   "devtool.DevtoolModifyTests.test_devtool_modify_nested_gitsm": {
    "duration": 45.841,
    "status": "PASSED"
   },
   "devtool.DevtoolModifyTests.test_devtool_modify_overrides": {
    "duration": 31.233,
    "status": "PASSED"
   },
   "devtool.DevtoolModifyTests.test_devtool_modify_virtual": {
    "duration": 32.488,
    "status": "PASSED"
   },
   "devtool.DevtoolResetTests.test_devtool_reset_all": {
    "duration": 249.053,
    "status": "PASSED"
   },
   "devtool.DevtoolResetTests.test_devtool_reset_re_plus_plus": {
    "duration": 43.06,
    "status": "PASSED"
   },
   "devtool.DevtoolTests.test_create_workspace": {
    "duration": 7.852,
    "status": "PASSED"
   },
   "devtool.DevtoolUpdateTests.test_devtool_finish_modify_git_subdir": {
    "duration": 112.404,
    "status": "PASSED"
   },
   "devtool.DevtoolUpdateTests.test_devtool_git_submodules": {
    "duration": 157.457,
    "status": "PASSED"
   },
   "devtool.DevtoolUpdateTests.test_devtool_update_recipe": {
    "duration": 62.062,
    "status": "PASSED"
   },
   "devtool.DevtoolUpdateTests.test_devtool_update_recipe_append": {
    "duration": 108.44,
    "status": "PASSED"
   },
   "devtool.DevtoolUpdateTests.test_devtool_update_recipe_append_git": {
    "duration": 111.952,
    "status": "PASSED"
   },
   "devtool.DevtoolUpdateTests.test_devtool_update_recipe_git": {
    "duration": 53.984,
    "status": "PASSED"
   },
   "devtool.DevtoolUpdateTests.test_devtool_update_recipe_gitsm": {
    "duration": 47.0,
    "status": "PASSED"
   },
   "devtool.DevtoolUpdateTests.test_devtool_update_recipe_local_files": {
    "duration": 136.352,
    "status": "PASSED"
   },
   "devtool.DevtoolUpdateTests.test_devtool_update_recipe_local_files_3": {
    "duration": 57.15,
    "status": "PASSED"
   },
   "devtool.DevtoolUpdateTests.test_devtool_update_recipe_local_files_subdir": {
    "duration": 49.354,
    "status": "PASSED"
   },
   "devtool.DevtoolUpdateTests.test_devtool_update_recipe_local_patch_gz": {
    "duration": 50.489,
    "status": "PASSED"
   },
   "devtool.DevtoolUpdateTests.test_devtool_update_recipe_long_filename": {
    "duration": 62.405,
    "status": "PASSED"
   },
   "devtool.DevtoolUpdateTests.test_devtool_update_recipe_with_gitignore": {
    "duration": 64.292,
    "status": "PASSED"
   },
   "devtool.DevtoolUpgradeTests.test_devtool_finish_modify_origlayer": {
    "duration": 118.316,
    "status": "PASSED"
   },
   "devtool.DevtoolUpgradeTests.test_devtool_finish_modify_otherlayer": {
    "duration": 75.339,
    "status": "PASSED"
   },
   "devtool.DevtoolUpgradeTests.test_devtool_finish_update_patch": {
    "duration": 83.631,
    "status": "PASSED"
   },
   "devtool.DevtoolUpgradeTests.test_devtool_finish_upgrade_origlayer": {
    "duration": 86.156,
    "status": "PASSED"
   },
   "devtool.DevtoolUpgradeTests.test_devtool_finish_upgrade_otherlayer": {
    "duration": 101.584,
    "status": "PASSED"
   },
   "devtool.DevtoolUpgradeTests.test_devtool_layer_plugins": {
    "duration": 4.468,
    "status": "PASSED"
   },
   "devtool.DevtoolUpgradeTests.test_devtool_load_plugin": {
    "duration": 14.819,
    "status": "PASSED"
   },
   "devtool.DevtoolUpgradeTests.test_devtool_rename": {
    "duration": 125.551,
    "status": "PASSED"
   },
   "devtool.DevtoolUpgradeTests.test_devtool_upgrade": {
    "duration": 87.816,
    "status": "PASSED"
   },
   "devtool.DevtoolUpgradeTests.test_devtool_upgrade_all_checksums": {
    "duration": 80.519,
    "status": "PASSED"
   },
   "devtool.DevtoolUpgradeTests.test_devtool_upgrade_drop_md5sum": {
    "duration": 80.922,
    "status": "PASSED"
   },
   "devtool.DevtoolUpgradeTests.test_devtool_upgrade_git": {
    "duration": 53.391,
    "status": "PASSED"
   },
   "devtool.DevtoolUpgradeTests.test_devtool_upgrade_gitsm": {
    "duration": 67.489,
    "status": "PASSED"
   },
   "devtool.DevtoolUpgradeTests.test_devtool_upgrade_recipe_upgrade_extra_tasks": {
    "duration": 84.41,
    "status": "PASSED"
   },
   "devtool.DevtoolUpgradeTests.test_devtool_virtual_kernel_modify": {
    "duration": 2713.123,
    "status": "PASSED"
   },
   "distrodata.Distrodata.test_checkpkg": {
    "duration": 0.001456,
    "log": "Skip by the command line argument \"distrodata.Distrodata.test_checkpkg\"\n",
    "status": "SKIPPED"
   },
   "distrodata.Distrodata.test_common_include_recipes": {
    "duration": 59.767,
    "status": "PASSED"
   },
   "distrodata.Distrodata.test_maintainers": {
    "duration": 72.481,
    "status": "PASSED"
   },
   "efibootpartition.GenericEFITest.test_boot_efi": {
    "duration": 1670.927,
    "status": "PASSED"
   },
   "esdk.oeSDKExtSelfTest.test_image_generation_binary_feeds": {
    "duration": 115.662,
    "status": "PASSED"
   },
   "esdk.oeSDKExtSelfTest.test_install_libraries_headers": {
    "duration": 40.728,
    "status": "PASSED"
   },
   "esdk.oeSDKExtSelfTest.test_sdk_install_assembles_the_shared_sysroot": {
    "duration": 92.908,
    "status": "PASSED"
   },
   "externalsrc.ExternalSrc.test_externalsrc_srctree_hash_files": {
    "duration": 35.497,
    "status": "PASSED"
   },
   "fetch.Dependencies.test_dependencies": {
    "duration": 25.911,
    "status": "PASSED"
   },
   "fetch.Fetch.test_git_mirrors": {
    "duration": 84.771,
    "status": "PASSED"
   },
   "fitimage.FitImagePyTests.test_fitimage_py_conf_extra_mappings_unused_error": {
    "duration": 0.01126,
    "status": "PASSED"
   },
   "fitimage.FitImagePyTests.test_fitimage_py_conf_loadables": {
    "duration": 0.009468,
    "status": "PASSED"
   },
   "fitimage.FitImagePyTests.test_fitimage_py_conf_mappings": {
    "duration": 0.009358,
    "status": "PASSED"
   },
   "fitimage.FitImagePyTests.test_fitimage_py_conf_mappings_unused_error": {
    "duration": 0.008356,
    "status": "PASSED"
   },
   "fitimage.FitImagePyTests.test_fitimage_py_conf_mappings_with_alias": {
    "duration": 0.0093,
    "status": "PASSED"
   },
   "fitimage.FitImagePyTests.test_fitimage_py_conf_os": {
    "duration": 0.007969,
    "status": "PASSED"
   },
   "fitimage.FitImagePyTests.test_fitimage_py_default": {
    "duration": 0.008276,
    "status": "PASSED"
   },
   "fitimage.FitImagePyTests.test_fitimage_py_default_dtb": {
    "duration": 0.008419,
    "status": "PASSED"
   },
   "fitimage.KernelFitImageRecipeTests.test_fit_image": {
    "duration": 106.488,
    "status": "PASSED"
   },
   "fitimage.KernelFitImageRecipeTests.test_fit_image_ext_dtb_dtbo": {
    "duration": 48.734,
    "status": "PASSED"
   },
   "fitimage.KernelFitImageRecipeTests.test_fit_image_sign_initramfs": {
    "duration": 273.152,
    "status": "PASSED"
   },
   "fitimage.KernelFitImageRecipeTests.test_fit_image_sign_initramfs_bundle": {
    "duration": 186.375,
    "status": "PASSED"
   },
   "fitimage.KernelFitImageRecipeTests.test_get_compatible_from_dtb": {
    "duration": 77.78,
    "status": "PASSED"
   },
   "fitimage.KernelFitImageRecipeTests.test_sign_fit_image_configurations": {
    "duration": 81.244,
    "status": "PASSED"
   },
   "fitimage.KernelFitImageRecipeTests.test_sign_fit_image_individual": {
    "duration": 64.973,
    "status": "PASSED"
   },
   "fitimage.KernelFitImageRecipeTests.test_vendored_dtb_with_kernel_dtbvendored": {
    "duration": 254.653,
    "status": "PASSED"
   },
   "fitimage.KernelFitImageRecipeTests.test_vendored_dtb_without_kernel_dtbvendored": {
    "duration": 51.808,
    "status": "PASSED"
   },
   "fitimage.UBootFitImageTests.test_sign_cascaded_uboot_fit_image": {
    "duration": 1.051,
    "log": "MACHINE=qemux86-64 does not provide capability _cap_spl_dtb\n",
    "status": "SKIPPED"
   },
   "fitimage.UBootFitImageTests.test_sign_standalone_uboot_atf_tee_fit_image": {
    "duration": 1.053,
    "log": "MACHINE=qemux86-64 does not provide capability _cap_spl_dtb\n",
    "status": "SKIPPED"
   },
   "fitimage.UBootFitImageTests.test_sign_standalone_uboot_fit_image": {
    "duration": 0.7744,
    "log": "MACHINE=qemux86-64 does not provide capability _cap_spl_dtb\n",
    "status": "SKIPPED"
   },
   "fitimage.UBootFitImageTests.test_sign_uboot_fit_image_without_spl": {
    "duration": 281.572,
    "status": "PASSED"
   },
   "fitimage.UBootFitImageTests.test_sign_uboot_kernel_individual": {
    "duration": 120.581,
    "status": "PASSED"
   },
   "fitimage.UBootFitImageTests.test_uboot_atf_tee_fit_image": {
    "duration": 1.073,
    "log": "MACHINE=qemux86-64 does not provide capability _cap_atf_tee\n",
    "status": "SKIPPED"
   },
   "fitimage.UBootFitImageTests.test_uboot_fit_image": {
    "duration": 63.265,
    "status": "PASSED"
   },
   "gdbserver.GdbServerTest.test_gdb_server": {
    "duration": 148.196,
    "status": "PASSED"
   },
   "gitarchivetests.GitArchiveTests.test_create_first_test_tag": {
    "duration": 0.7624,
    "status": "PASSED"
   },
   "gitarchivetests.GitArchiveTests.test_create_second_test_tag": {
    "duration": 0.796,
    "status": "PASSED"
   },
   "gitarchivetests.GitArchiveTests.test_get_revs_on_branch": {
    "duration": 0.4717,
    "status": "PASSED"
   },
   "gitarchivetests.GitArchiveTests.test_get_tags_with_only_local_tag": {
    "duration": 0.4716,
    "status": "PASSED"
   },
   "gitarchivetests.GitArchiveTests.test_get_tags_without_valid_remote": {
    "duration": 0.3265,
    "status": "PASSED"
   },
   "gitarchivetests.GitArchiveTests.test_get_tags_without_valid_remote_and_wrong_url": {
    "duration": 0.6343,
    "status": "PASSED"
   },
   "gotoolchain.oeGoToolchainSelfTest.test_go_dep_build": {
    "duration": 2.429,
    "status": "PASSED"
   },
   "govendor.GoVendorSrcUriTests.test_basic": {
    "duration": 0.009617,
    "status": "PASSED"
   },
   "govendor.GoVendorSrcUriTests.test_non_git_vcs": {
    "duration": 0.007383,
    "status": "PASSED"
   },
   "govendor.GoVendorSrcUriTests.test_path_override": {
    "duration": 0.007348,
    "status": "PASSED"
   },
   "govendor.GoVendorSrcUriTests.test_pathmajor": {
    "duration": 0.007363,
    "status": "PASSED"
   },
   "govendor.GoVendorSrcUriTests.test_replaces": {
    "duration": 0.007498,
    "status": "PASSED"
   },
   "govendor.GoVendorSrcUriTests.test_subdir": {
    "duration": 0.007897,
    "status": "PASSED"
   },
   "govendor.GoVendorTaskTests.test_do_compile_succeeds": {
    "duration": 23.268,
    "status": "PASSED"
   },
   "govendor.GoVendorTaskTests.test_external_dep_copied_to_vendor": {
    "duration": 0.007838,
    "status": "PASSED"
   },
   "govendor.GoVendorTaskTests.test_go_import_vendor_symlink": {
    "duration": 0.007894,
    "status": "PASSED"
   },
   "govendor.GoVendorTaskTests.test_local_replacement_symlink": {
    "duration": 0.007761,
    "status": "PASSED"
   },
   "govendor.GoVendorTaskTests.test_modules_txt_in_vendor": {
    "duration": 0.007538,
    "status": "PASSED"
   },
   "govendor.GoVendorTaskTests.test_pathmajor_falls_back_to_root": {
    "duration": 0.007546,
    "status": "PASSED"
   },
   "govendor.GoVendorTaskTests.test_test_files_excluded_from_vendor": {
    "duration": 0.007529,
    "status": "PASSED"
   },
   "image_typedep.ImageTypeDepTests.test_conversion_typedep_added": {
    "duration": 29.132,
    "status": "PASSED"
   },
   "imagefeatures.ImageFeatures.test_all_users_can_connect_via_ssh_without_password": {
    "duration": 251.366,
    "oetags": [
     "runqemu"
    ],
    "status": "PASSED"
   },
   "imagefeatures.ImageFeatures.test_bmap": {
    "duration": 70.649,
    "status": "PASSED"
   },
   "imagefeatures.ImageFeatures.test_empty_image": {
    "duration": 28.414,
    "status": "PASSED"
   },
   "imagefeatures.ImageFeatures.test_hypervisor_fmts": {
    "duration": 82.695,
    "status": "PASSED"
   },
   "imagefeatures.ImageFeatures.test_image_fstypes": {
    "duration": 130.773,
    "status": "PASSED"
   },
   "imagefeatures.ImageFeatures.test_image_gen_debugfs": {
    "duration": 76.404,
    "status": "PASSED"
   },
   "imagefeatures.ImageFeatures.test_long_chain_conversion": {
    "duration": 75.576,
    "status": "PASSED"
   },
   "imagefeatures.ImageFeatures.test_mandb": {
    "duration": 1910.378,
    "status": "PASSED"
   },
   "imagefeatures.ImageFeatures.test_no_busybox_base_utils": {
    "duration": 31.981,
    "status": "PASSED"
   },
   "imagefeatures.ImageFeatures.test_non_root_user_can_connect_via_ssh_without_password": {
    "duration": 98.903,
    "oetags": [
     "runqemu"
    ],
    "status": "PASSED"
   },
   "imagefeatures.ImageFeatures.test_useradd_static": {
    "duration": 150.016,
    "status": "PASSED"
   },
   "imagefeatures.ImageFeatures.test_wayland_support_in_image": {
    "duration": 149.284,
    "status": "PASSED"
   },
   "incompatible_lic.IncompatibleLicensePerImageTests.test_bash_and_license": {
    "duration": 52.597,
    "status": "PASSED"
   },
   "incompatible_lic.IncompatibleLicensePerImageTests.test_bash_default": {
    "duration": 54.647,
    "status": "PASSED"
   },
   "incompatible_lic.IncompatibleLicensePerImageTests.test_bash_license_exceptions": {
    "duration": 60.848,
    "status": "PASSED"
   },
   "incompatible_lic.IncompatibleLicensePerImageTests.test_bash_or_license": {
    "duration": 53.923,
    "status": "PASSED"
   },
   "incompatible_lic.IncompatibleLicensePerImageTests.test_spdx_exception": {
    "duration": 123.862,
    "status": "PASSED"
   },
   "incompatible_lic.IncompatibleLicenseTestObsolete.test_incompatible_alias_spdx_license": {
    "duration": 7.394,
    "status": "PASSED"
   },
   "incompatible_lic.IncompatibleLicenseTestObsolete.test_incompatible_alias_spdx_license_alias": {
    "duration": 8.147,
    "status": "PASSED"
   },
   "incompatible_lic.IncompatibleLicenseTestObsolete.test_incompatible_alias_spdx_license_alias_wildcard": {
    "duration": 9.605,
    "status": "PASSED"
   },
   "incompatible_lic.IncompatibleLicenseTestObsolete.test_incompatible_alias_spdx_license_wildcard": {
    "duration": 7.397,
    "status": "PASSED"
   },
   "incompatible_lic.IncompatibleLicenseTestObsolete.test_incompatible_all_licenses_wildcard": {
    "duration": 7.365,
    "status": "PASSED"
   },
   "incompatible_lic.IncompatibleLicenseTestObsolete.test_incompatible_spdx_license_alias_wildcard": {
    "duration": 6.682,
    "status": "PASSED"
   },
   "incompatible_lic.IncompatibleLicenseTestObsolete.test_incompatible_spdx_licenses_wildcard": {
    "duration": 6.671,
    "status": "PASSED"
   },
   "incompatible_lic.IncompatibleLicenseTests.test_incompatible_nonspdx_license": {
    "duration": 24.702,
    "status": "PASSED"
   },
   "incompatible_lic.IncompatibleLicenseTests.test_incompatible_spdx_license": {
    "duration": 24.51,
    "status": "PASSED"
   },
   "incompatible_lic.IncompatibleLicenseTests.test_incompatible_spdx_license_alias": {
    "duration": 6.047,
    "status": "PASSED"
   },
   "incompatible_lic.IncompatibleLicenseTests.test_incompatible_spdx_license_wildcard": {
    "duration": 25.034,
    "status": "PASSED"
   },
   "incompatible_lic.IncompatibleLicenseTests.test_incompatible_spdx_licenses": {
    "duration": 24.553,
    "status": "PASSED"
   },
   "incompatible_lic.NoGPL3InImagesTests.test_core_image_full_cmdline_weston": {
    "duration": 3662.873,
    "status": "PASSED"
   },
   "incompatible_lic.NoGPL3InImagesTests.test_core_image_minimal": {
    "duration": 70.031,
    "status": "PASSED"
   },
   "install.InstallTests.test_gstreamer_plugins": {
    "duration": 359.939,
    "status": "PASSED"
   },
   "install.InstallTests.test_linux_firmware": {
    "duration": 132.237,
    "status": "PASSED"
   },
   "install.InstallTests.test_linux_modules": {
    "duration": 71.463,
    "status": "PASSED"
   },
   "install.InstallTests.test_perl": {
    "duration": 83.776,
    "status": "PASSED"
   },
   "install.InstallTests.test_python": {
    "duration": 79.009,
    "status": "PASSED"
   },
   "intercept.GitCheck.test_git_intercept": {
    "duration": 43.312,
    "status": "PASSED"
   },
   "kerneldevelopment.KernelDev.test_apply_patches": {
    "duration": 152.584,
    "status": "PASSED"
   },
   "kernelmodulesplit.KernelModuleSplit.test_cross_recipe_module_dependency": {
    "duration": 2862.794,
    "status": "PASSED"
   },
   "layerappend.LayerAppendTests.test_layer_appends": {
    "duration": 53.854,
    "status": "PASSED"
   },
   "liboe.CopyTreeTests.test_copy_hardlink_tree_count": {
    "duration": 0.0138,
    "status": "PASSED"
   },
   "liboe.CopyTreeTests.test_copy_tree_special": {
    "duration": 0.01092,
    "status": "PASSED"
   },
   "liboe.CopyTreeTests.test_copy_tree_xattr": {
    "duration": 37.58,
    "status": "PASSED"
   },
   "liboe.PathTests.test_canonicalize_empty_string_returns_empty_string": {
    "duration": 0.006974,
    "status": "PASSED"
   },
   "liboe.PathTests.test_canonicalize_empty_token_between_paths_is_dropped": {
    "duration": 0.007336,
    "status": "PASSED"
   },
   "liboe.PathTests.test_canonicalize_multiple_variable_tokens_all_skipped": {
    "duration": 0.006148,
    "status": "PASSED"
   },
   "liboe.PathTests.test_canonicalize_none_returns_empty_string": {
    "duration": 0.00609,
    "status": "PASSED"
   },
   "liboe.PathTests.test_canonicalize_real_path_returned": {
    "duration": 0.005997,
    "status": "PASSED"
   },
   "liboe.PathTests.test_canonicalize_trailing_slash_preserved": {
    "duration": 0.006303,
    "status": "PASSED"
   },
   "liboe.PathTests.test_canonicalize_unexpanded_variable_is_skipped": {
    "duration": 0.005968,
    "status": "PASSED"
   },
   "liboe.PathTests.test_canonicalize_variable_and_trailing_slash_path": {
    "duration": 0.006383,
    "status": "PASSED"
   },
   "liboe.PathTests.test_canonicalize_variable_token_dropped_leaving_real_path": {
    "duration": 0.006391,
    "status": "PASSED"
   },
   "liboe.PathTests.test_is_path_parent_all_paths_must_be_below": {
    "duration": 0.006343,
    "status": "PASSED"
   },
   "liboe.PathTests.test_is_path_parent_child_is_not_parent_of_its_parent": {
    "duration": 0.006041,
    "status": "PASSED"
   },
   "liboe.PathTests.test_is_path_parent_direct_child": {
    "duration": 0.006207,
    "status": "PASSED"
   },
   "liboe.PathTests.test_is_path_parent_no_paths_returns_false": {
    "duration": 0.006094,
    "status": "PASSED"
   },
   "liboe.PathTests.test_is_path_parent_one_path_outside_fails": {
    "duration": 0.005965,
    "status": "PASSED"
   },
   "liboe.PathTests.test_is_path_parent_prefix_string_is_not_a_path_parent": {
    "duration": 0.006158,
    "status": "PASSED"
   },
   "liboe.PathTests.test_is_path_parent_unrelated_path": {
    "duration": 0.005958,
    "status": "PASSED"
   },
   "liboe.PathTests.test_join_absolute_rhs_is_not_special": {
    "duration": 0.005968,
    "status": "PASSED"
   },
   "liboe.PathTests.test_join_empty_leading_component_is_absolute": {
    "duration": 0.00602,
    "status": "PASSED"
   },
   "liboe.PathTests.test_join_pardir_normalised": {
    "duration": 0.006069,
    "status": "PASSED"
   },
   "liboe.PathTests.test_join_redundant_separators_normalised": {
    "duration": 0.006177,
    "status": "PASSED"
   },
   "liboe.PathTests.test_join_two_paths": {
    "duration": 0.006314,
    "status": "PASSED"
   },
   "liboe.PathTests.test_make_relative_symlink_absolute_becomes_relative_and_resolves": {
    "duration": 0.006462,
    "status": "PASSED"
   },
   "liboe.PathTests.test_make_relative_symlink_already_relative_unchanged": {
    "duration": 0.006415,
    "status": "PASSED"
   },
   "liboe.PathTests.test_make_relative_symlink_non_symlink_is_ignored": {
    "duration": 0.006452,
    "status": "PASSED"
   },
   "liboe.PathTests.test_make_relative_symlink_several_levels_deep_becomes_relative": {
    "duration": 0.006779,
    "status": "PASSED"
   },
   "liboe.PathTests.test_realpath_isdir_failure_falls_back_without_nameerror": {
    "duration": 0.007136,
    "status": "PASSED"
   },
   "liboe.PathTests.test_realpath_missing_component_raises_enoent_without_assume_dir": {
    "duration": 0.006423,
    "status": "PASSED"
   },
   "liboe.PathTests.test_realpath_missing_component_tolerated_with_assume_dir": {
    "duration": 0.006363,
    "status": "PASSED"
   },
   "liboe.PathTests.test_realpath_mutual_symlink_cycle_raises_eloop": {
    "duration": 0.007526,
    "status": "PASSED"
   },
   "liboe.PathTests.test_realpath_path_outside_root_raises": {
    "duration": 0.006438,
    "status": "PASSED"
   },
   "liboe.PathTests.test_realpath_plain_path_is_returned": {
    "duration": 0.006351,
    "status": "PASSED"
   },
   "liboe.PathTests.test_realpath_resolves_symlink_below_root": {
    "duration": 0.006376,
    "status": "PASSED"
   },
   "liboe.PathTests.test_realpath_resolves_symlink_several_components_deep": {
    "duration": 0.006683,
    "status": "PASSED"
   },
   "liboe.PathTests.test_realpath_self_referential_symlink_raises_eloop": {
    "duration": 0.006978,
    "status": "PASSED"
   },
   "liboe.PathTests.test_symlink_conflicting_existing_raises": {
    "duration": 0.0068,
    "status": "PASSED"
   },
   "liboe.PathTests.test_symlink_creates_dangling_symlink": {
    "duration": 0.006154,
    "status": "PASSED"
   },
   "liboe.PathTests.test_symlink_creates_symlink": {
    "duration": 0.006164,
    "status": "PASSED"
   },
   "liboe.PathTests.test_symlink_force_does_not_delete_glob_siblings": {
    "duration": 0.006277,
    "status": "PASSED"
   },
   "liboe.PathTests.test_symlink_force_overwrites_existing_symlink": {
    "duration": 0.006714,
    "status": "PASSED"
   },
   "liboe.PathTests.test_symlink_force_replaces_destination_with_glob_metacharacters": {
    "duration": 0.006246,
    "status": "PASSED"
   },
   "liboe.PathTests.test_symlink_force_replaces_existing_directory": {
    "duration": 0.00641,
    "status": "PASSED"
   },
   "liboe.PathTests.test_symlink_matching_existing_is_idempotent": {
    "duration": 0.00618,
    "status": "PASSED"
   },
   "liboe.PathTests.test_which_wild_explicit_search_path": {
    "duration": 0.006391,
    "status": "PASSED"
   },
   "liboe.PathTests.test_which_wild_first_match_per_name_wins": {
    "duration": 0.006525,
    "status": "PASSED"
   },
   "liboe.PathTests.test_which_wild_missing_tool_returns_empty": {
    "duration": 0.006841,
    "status": "PASSED"
   },
   "liboe.PathTests.test_which_wild_wildcard_pattern": {
    "duration": 0.006298,
    "status": "PASSED"
   },
   "liboe.SubprocessTests.test_subprocess_tweak": {
    "duration": 0.0124,
    "status": "PASSED"
   },
   "lic_checksum.LicenseTests.test_checksum_with_space": {
    "duration": 27.196,
    "status": "PASSED"
   },
   "lic_checksum.LicenseTests.test_nonmatching_checksum": {
    "duration": 26.654,
    "status": "PASSED"
   },
   "locales.LocalesTest.test_locales_off": {
    "duration": 95.973,
    "status": "PASSED"
   },
   "locales.LocalesTest.test_locales_on": {
    "duration": 88.822,
    "status": "PASSED"
   },
   "manifest.VerifyManifest.test_SDK_manifest_entries": {
    "duration": 341.968,
    "status": "PASSED"
   },
   "manifest.VerifyManifest.test_image_manifest_entries": {
    "duration": 12.131,
    "status": "PASSED"
   },
   "minidebuginfo.Minidebuginfo.test_minidebuginfo": {
    "duration": 1310.646,
    "status": "PASSED"
   },
   "minidebuginfo.Minidebuginfo.test_minidebuginfo_qemu": {
    "duration": 1681.445,
    "oetags": [
     "runqemu"
    ],
    "status": "PASSED"
   },
   "multiconfig.MultiConfig.test_multiconfig": {
    "duration": 339.59,
    "status": "PASSED"
   },
   "multiconfig.MultiConfig.test_multiconfig_inlayer": {
    "duration": 53.249,
    "status": "PASSED"
   },
   "multiconfig.MultiConfig.test_multiconfig_reparse": {
    "duration": 90.486,
    "status": "PASSED"
   },
   "newlib.NewlibTest.test_newlib": {
    "duration": 79.166,
    "status": "PASSED"
   },
   "oelib.buildhistory.TestBlobParsing.test_blob_to_dict": {
    "duration": 1.644,
    "status": "PASSED"
   },
   "oelib.buildhistory.TestBlobParsing.test_compare_dict_blobs": {
    "duration": 0.8069,
    "status": "PASSED"
   },
   "oelib.buildhistory.TestBlobParsing.test_compare_dict_blobs_default": {
    "duration": 0.8506,
    "status": "PASSED"
   },
   "oelib.buildhistory.TestFileListCompare.test_compare_file_lists": {
    "duration": 0.1858,
    "status": "PASSED"
   },
   "oelib.elf.TestElf.test_machine_name": {
    "duration": 0.001486,
    "status": "PASSED"
   },
   "oelib.license.TestComplexCombinations.test_tests": {
    "duration": 0.00401,
    "status": "PASSED"
   },
   "oelib.license.TestIsIncluded.test_tests": {
    "duration": 0.003311,
    "status": "PASSED"
   },
   "oelib.license.TestSimpleCombinations.test_tests": {
    "duration": 0.002009,
    "status": "PASSED"
   },
   "oelib.license.TestSingleLicense.test_invalid_licenses": {
    "duration": 0.0006366,
    "status": "PASSED"
   },
   "oelib.license.TestSingleLicense.test_single_licenses": {
    "duration": 0.0007546,
    "status": "PASSED"
   },
   "oelib.license.TestSort.test_sort": {
    "duration": 0.006253,
    "status": "PASSED"
   },
   "oelib.package.TestCopyDebugSources.test_copydebugsources_copies_files_and_dereferences_links": {
    "duration": 0.01117,
    "status": "PASSED"
   },
   "oelib.package.TestCopyDebugSources.test_copydebugsources_ignores_copy_failure": {
    "duration": 0.005776,
    "status": "PASSED"
   },
   "oelib.package.TestCopyDebugSources.test_copydebugsources_ignores_empty_externalsrc_relocation": {
    "duration": 0.005618,
    "status": "PASSED"
   },
   "oelib.package.TestCopyDebugSources.test_copydebugsources_moves_externalsrc_relocation": {
    "duration": 0.007004,
    "status": "PASSED"
   },
   "oelib.patch.TestGitApplyTree.test_dirty_push_run_false_returns_argv": {
    "duration": 0.416,
    "status": "PASSED"
   },
   "oelib.patch.TestGitApplyTree.test_fallback_preserves_original_patch_name": {
    "duration": 1.102,
    "status": "PASSED"
   },
   "oelib.patch.TestGitApplyTree.test_git_am_preserves_original_patch_name": {
    "duration": 0.9547,
    "status": "PASSED"
   },
   "oelib.patch.TestGitApplyTree.test_push_run_false_returns_argv": {
    "duration": 0.6801,
    "status": "PASSED"
   },
   "oelib.patch.TestPatchTree.test_push_run_false_returns_argv": {
    "duration": 0.001609,
    "status": "PASSED"
   },
   "oelib.patch.TestRunCmd.test_runcmd_allows_explicit_shell": {
    "duration": 0.002595,
    "status": "PASSED"
   },
   "oelib.patch.TestRunCmd.test_runcmd_preserves_argv_elements": {
    "duration": 0.0192,
    "status": "PASSED"
   },
   "oelib.patch.TestRunCmd.test_runcmd_reports_exit_status": {
    "duration": 0.0198,
    "status": "PASSED"
   },
   "oelib.patch.TestRunCmd.test_runcmd_wraps_exec_failure": {
    "duration": 0.0007334,
    "status": "PASSED"
   },
   "oelib.path.TestRealPath.test_loop": {
    "duration": 0.004112,
    "status": "PASSED"
   },
   "oelib.path.TestRealPath.test_norm": {
    "duration": 0.003481,
    "status": "PASSED"
   },
   "oelib.path.TestRealPath.test_phys": {
    "duration": 0.001915,
    "status": "PASSED"
   },
   "oelib.types.TestBooleanType.test_bool_equality": {
    "duration": 0.0004275,
    "status": "PASSED"
   },
   "oelib.types.TestBooleanType.test_false": {
    "duration": 0.0005193,
    "status": "PASSED"
   },
   "oelib.types.TestBooleanType.test_invalid": {
    "duration": 0.0007401,
    "status": "PASSED"
   },
   "oelib.types.TestBooleanType.test_true": {
    "duration": 0.0008907,
    "status": "PASSED"
   },
   "oelib.types.TestList.test_list_nosep": {
    "duration": 0.001319,
    "status": "PASSED"
   },
   "oelib.types.TestList.test_list_usersep": {
    "duration": 0.001432,
    "status": "PASSED"
   },
   "oelib.utils.TestDefaultFeatures.test_filter_default_features": {
    "duration": 0.001279,
    "status": "PASSED"
   },
   "oelib.utils.TestMultiprocessLaunch.test_multiprocesslaunch": {
    "duration": 0.03172,
    "status": "PASSED"
   },
   "oelib.utils.TestPackagesFilterOutSystem.test_filter": {
    "duration": 0.001688,
    "status": "PASSED"
   },
   "oelib.utils.TestTrimVersion.test_num_exception": {
    "duration": 0.002077,
    "status": "PASSED"
   },
   "oelib.utils.TestTrimVersion.test_valid": {
    "duration": 0.002153,
    "status": "PASSED"
   },
   "oelib.utils.TestTrimVersion.test_version_exception": {
    "duration": 0.002313,
    "status": "PASSED"
   },
   "oescripts.OEGitproxyTests.test_oegitproxy_help": {
    "duration": 0.1787,
    "status": "PASSED"
   },
   "oescripts.OEGitproxyTests.test_oegitproxy_proxy": {
    "duration": 0.2423,
    "status": "PASSED"
   },
   "oescripts.OEGitproxyTests.test_oegitproxy_proxy_dash": {
    "duration": 0.008182,
    "log": "No \"dash\" found on test system.\n",
    "status": "SKIPPED"
   },
   "oescripts.OEListPackageconfigTests.test_packageconfig_flags_default": {
    "duration": 272.541,
    "status": "PASSED"
   },
   "oescripts.OEListPackageconfigTests.test_packageconfig_flags_help": {
    "duration": 0.3265,
    "status": "PASSED"
   },
   "oescripts.OEListPackageconfigTests.test_packageconfig_flags_option_all": {
    "duration": 335.178,
    "status": "PASSED"
   },
   "oescripts.OEListPackageconfigTests.test_packageconfig_flags_option_flags": {
    "duration": 336.367,
    "status": "PASSED"
   },
   "oescripts.OEListPackageconfigTests.test_packageconfig_flags_options_preferred_only": {
    "duration": 359.071,
    "status": "PASSED"
   },
   "oescripts.OEPybootchartguyTests.test_pybootchartguy_help": {
    "duration": 0.0008914,
    "log": "Python cairo module is not present\n",
    "status": "SKIPPED"
   },
   "oescripts.OEPybootchartguyTests.test_pybootchartguy_to_generate_build_pdf_output": {
    "duration": 0.001223,
    "log": "Python cairo module is not present\n",
    "status": "SKIPPED"
   },
   "oescripts.OEPybootchartguyTests.test_pybootchartguy_to_generate_build_png_output": {
    "duration": 0.001558,
    "log": "Python cairo module is not present\n",
    "status": "SKIPPED"
   },
   "oescripts.OEPybootchartguyTests.test_pybootchartguy_to_generate_build_svg_output": {
    "duration": 0.001891,
    "log": "Python cairo module is not present\n",
    "status": "SKIPPED"
   },
   "oescripts.OeRunNativeTest.test_oe_run_native": {
    "duration": 16.579,
    "status": "PASSED"
   },
   "overlayfs.OverlayFSEtcRunTimeTests.test_all_required_variables_set": {
    "duration": 2312.08,
    "oetags": [
     "runqemu"
    ],
    "status": "PASSED"
   },
   "overlayfs.OverlayFSEtcRunTimeTests.test_image_feature_conflict": {
    "duration": 4.419,
    "oetags": [
     "runqemu"
    ],
    "status": "PASSED"
   },
   "overlayfs.OverlayFSEtcRunTimeTests.test_image_feature_is_missing": {
    "duration": 115.892,
    "oetags": [
     "runqemu"
    ],
    "status": "PASSED"
   },
   "overlayfs.OverlayFSEtcRunTimeTests.test_lower_layer_access": {
    "duration": 98.485,
    "oetags": [
     "runqemu"
    ],
    "status": "PASSED"
   },
   "overlayfs.OverlayFSEtcRunTimeTests.test_postinst_on_target_for_read_only_rootfs": {
    "duration": 100.155,
    "oetags": [
     "runqemu"
    ],
    "status": "PASSED"
   },
   "overlayfs.OverlayFSEtcRunTimeTests.test_sbin_init_original": {
    "duration": 113.21,
    "oetags": [
     "runqemu"
    ],
    "status": "PASSED"
   },
   "overlayfs.OverlayFSEtcRunTimeTests.test_sbin_init_preinit": {
    "duration": 107.547,
    "oetags": [
     "runqemu"
    ],
    "status": "PASSED"
   },
   "overlayfs.OverlayFSEtcRunTimeTests.test_sbin_init_read_only": {
    "duration": 110.35,
    "oetags": [
     "runqemu"
    ],
    "status": "PASSED"
   },
   "overlayfs.OverlayFSTests.test_correct_image_fstab": {
    "duration": 1229.361,
    "oetags": [
     "runqemu"
    ],
    "status": "PASSED"
   },
   "overlayfs.OverlayFSTests.test_correct_image_unit": {
    "duration": 116.357,
    "oetags": [
     "runqemu"
    ],
    "status": "PASSED"
   },
   "overlayfs.OverlayFSTests.test_distro_features_missing": {
    "duration": 28.359,
    "status": "PASSED"
   },
   "overlayfs.OverlayFSTests.test_mount_unit_not_set": {
    "duration": 17.933,
    "status": "PASSED"
   },
   "overlayfs.OverlayFSTests.test_not_all_units_installed": {
    "duration": 76.812,
    "status": "PASSED"
   },
   "overlayfs.OverlayFSTests.test_not_all_units_installed_but_qa_skipped": {
    "duration": 96.38,
    "status": "PASSED"
   },
   "overlayfs.OverlayFSTests.test_wrong_mount_unit_set": {
    "duration": 16.229,
    "status": "PASSED"
   },
   "package.PackageTests.test_gdb_hardlink_debug": {
    "duration": 113.055,
    "status": "PASSED"
   },
   "package.PackageTests.test_package_name_conflict": {
    "duration": 19.214,
    "status": "PASSED"
   },
   "package.PackageTests.test_preserve_ownership": {
    "duration": 98.903,
    "status": "PASSED"
   },
   "package.PackageTests.test_preserve_sparse_hardlinks": {
    "duration": 52.465,
    "status": "PASSED"
   },
   "package.VersionOrdering.test_dpkg": {
    "duration": 0.01949,
    "status": "PASSED"
   },
   "package.VersionOrdering.test_opkg": {
    "duration": 0.02859,
    "status": "PASSED"
   },
   "package.VersionOrdering.test_rpm": {
    "duration": 0.2068,
    "status": "PASSED"
   },
   "picolibc.PicolibcTest.test_picolibc": {
    "duration": 0.9152,
    "log": "This test only works with machines : qemuarm qemuarm64 qemuriscv32 qemuriscv64\n",
    "status": "SKIPPED"
   },
   "pkgdata.OePkgdataUtilTests.test_find_path": {
    "duration": 4.216,
    "status": "PASSED"
   },
   "pkgdata.OePkgdataUtilTests.test_glob": {
    "duration": 1.615,
    "status": "PASSED"
   },
   "pkgdata.OePkgdataUtilTests.test_list_pkg_files": {
    "duration": 8.624,
    "status": "PASSED"
   },
   "pkgdata.OePkgdataUtilTests.test_list_pkgs": {
    "duration": 7.571,
    "status": "PASSED"
   },
   "pkgdata.OePkgdataUtilTests.test_lookup_pkg": {
    "duration": 6.031,
    "status": "PASSED"
   },
   "pkgdata.OePkgdataUtilTests.test_lookup_recipe": {
    "duration": 2.972,
    "status": "PASSED"
   },
   "pkgdata.OePkgdataUtilTests.test_multilib_variables": {
    "duration": 2154.769,
    "status": "PASSED"
   },
   "pkgdata.OePkgdataUtilTests.test_no_param": {
    "duration": 0.1129,
    "status": "PASSED"
   },
   "pkgdata.OePkgdataUtilTests.test_read_value": {
    "duration": 2.959,
    "status": "PASSED"
   },
   "pkgdata.OePkgdataUtilTests.test_specify_pkgdatadir": {
    "duration": 1.158,
    "status": "PASSED"
   },
   "pokybleeding.PokyBleeding.test_poky_bleeding_autorev": {
    "duration": 83.953,
    "status": "PASSED"
   },
   "prservice.BitbakePrTests.test_import_export_override_db": {
    "duration": 1464.441,
    "status": "PASSED"
   },
   "prservice.BitbakePrTests.test_import_export_replace_db": {
    "duration": 113.878,
    "status": "PASSED"
   },
   "prservice.BitbakePrTests.test_pr_service_deb_arch_dep": {
    "duration": 75.906,
    "status": "PASSED"
   },
   "prservice.BitbakePrTests.test_pr_service_deb_arch_indep": {
    "duration": 38.146,
    "status": "PASSED"
   },
   "prservice.BitbakePrTests.test_pr_service_ipk_arch_dep": {
    "duration": 65.577,
    "status": "PASSED"
   },
   "prservice.BitbakePrTests.test_pr_service_ipk_arch_indep": {
    "duration": 28.794,
    "status": "PASSED"
   },
   "prservice.BitbakePrTests.test_pr_service_rpm_arch_dep": {
    "duration": 51.58,
    "status": "PASSED"
   },
   "prservice.BitbakePrTests.test_pr_service_rpm_arch_indep": {
    "duration": 29.593,
    "status": "PASSED"
   },
   "prservice.BitbakePrTests.test_stopping_prservice_message": {
    "duration": 0.3344,
    "status": "PASSED"
   },
   "pseudo.Pseudo.test_pseudo_pyc_creation": {
    "duration": 12.913,
    "status": "PASSED"
   },
   "recipetool.RecipetoolAppendTests.test_recipetool_appendfile_add": {
    "duration": 80.805,
    "status": "PASSED"
   },
   "recipetool.RecipetoolAppendTests.test_recipetool_appendfile_add_bindir": {
    "duration": 31.911,
    "status": "PASSED"
   },
   "recipetool.RecipetoolAppendTests.test_recipetool_appendfile_add_machine": {
    "duration": 30.244,
    "status": "PASSED"
   },
   "recipetool.RecipetoolAppendTests.test_recipetool_appendfile_alternatives": {
    "duration": 33.055,
    "status": "PASSED"
   },
   "recipetool.RecipetoolAppendTests.test_recipetool_appendfile_basic": {
    "duration": 26.947,
    "status": "PASSED"
   },
   "recipetool.RecipetoolAppendTests.test_recipetool_appendfile_binary": {
    "duration": 20.421,
    "status": "PASSED"
   },
   "recipetool.RecipetoolAppendTests.test_recipetool_appendfile_extlayer": {
    "duration": 7.246,
    "status": "PASSED"
   },
   "recipetool.RecipetoolAppendTests.test_recipetool_appendfile_inst_func": {
    "duration": 28.623,
    "status": "PASSED"
   },
   "recipetool.RecipetoolAppendTests.test_recipetool_appendfile_inst_glob": {
    "duration": 24.566,
    "status": "PASSED"
   },
   "recipetool.RecipetoolAppendTests.test_recipetool_appendfile_inst_todir_glob": {
    "duration": 26.061,
    "status": "PASSED"
   },
   "recipetool.RecipetoolAppendTests.test_recipetool_appendfile_invalid": {
    "duration": 23.551,
    "status": "PASSED"
   },
   "recipetool.RecipetoolAppendTests.test_recipetool_appendfile_orig": {
    "duration": 24.483,
    "status": "PASSED"
   },
   "recipetool.RecipetoolAppendTests.test_recipetool_appendfile_patch": {
    "duration": 24.073,
    "status": "PASSED"
   },
   "recipetool.RecipetoolAppendTests.test_recipetool_appendfile_postinstall": {
    "duration": 28.473,
    "status": "PASSED"
   },
   "recipetool.RecipetoolAppendTests.test_recipetool_appendfile_renamed": {
    "duration": 25.386,
    "status": "PASSED"
   },
   "recipetool.RecipetoolAppendTests.test_recipetool_appendfile_script": {
    "duration": 24.648,
    "status": "PASSED"
   },
   "recipetool.RecipetoolAppendTests.test_recipetool_appendfile_subdir": {
    "duration": 25.431,
    "status": "PASSED"
   },
   "recipetool.RecipetoolAppendTests.test_recipetool_appendfile_todir": {
    "duration": 24.777,
    "status": "PASSED"
   },
   "recipetool.RecipetoolAppendTests.test_recipetool_appendfile_wildcard": {
    "duration": 13.438,
    "status": "PASSED"
   },
   "recipetool.RecipetoolAppendsrcTests.test_recipetool_appendsrcfile_basic": {
    "duration": 76.681,
    "status": "PASSED"
   },
   "recipetool.RecipetoolAppendsrcTests.test_recipetool_appendsrcfile_basic_wildcard": {
    "duration": 44.222,
    "status": "PASSED"
   },
   "recipetool.RecipetoolAppendsrcTests.test_recipetool_appendsrcfile_existing_in_src_uri": {
    "duration": 23.553,
    "status": "PASSED"
   },
   "recipetool.RecipetoolAppendsrcTests.test_recipetool_appendsrcfile_existing_in_src_uri_diff_params": {
    "duration": 23.222,
    "status": "PASSED"
   },
   "recipetool.RecipetoolAppendsrcTests.test_recipetool_appendsrcfile_machine": {
    "duration": 58.472,
    "status": "PASSED"
   },
   "recipetool.RecipetoolAppendsrcTests.test_recipetool_appendsrcfile_replace_file_srcdir": {
    "duration": 36.539,
    "status": "PASSED"
   },
   "recipetool.RecipetoolAppendsrcTests.test_recipetool_appendsrcfile_srcdir_basic": {
    "duration": 25.812,
    "status": "PASSED"
   },
   "recipetool.RecipetoolAppendsrcTests.test_recipetool_appendsrcfile_subdir_basic": {
    "duration": 37.349,
    "status": "PASSED"
   },
   "recipetool.RecipetoolAppendsrcTests.test_recipetool_appendsrcfile_subdir_basic_dirdest": {
    "duration": 34.195,
    "status": "PASSED"
   },
   "recipetool.RecipetoolAppendsrcTests.test_recipetool_appendsrcfile_update_recipe_basic": {
    "duration": 10.385,
    "status": "PASSED"
   },
   "recipetool.RecipetoolAppendsrcTests.test_recipetool_appendsrcfiles_basic": {
    "duration": 49.374,
    "status": "PASSED"
   },
   "recipetool.RecipetoolAppendsrcTests.test_recipetool_appendsrcfiles_basic_subdir": {
    "duration": 45.277,
    "status": "PASSED"
   },
   "recipetool.RecipetoolCreateTests.test_recipetool_create": {
    "duration": 30.857,
    "status": "PASSED"
   },
   "recipetool.RecipetoolCreateTests.test_recipetool_create_autotools": {
    "duration": 76.77,
    "status": "PASSED"
   },
   "recipetool.RecipetoolCreateTests.test_recipetool_create_cmake": {
    "duration": 31.051,
    "status": "PASSED"
   },
   "recipetool.RecipetoolCreateTests.test_recipetool_create_git_http": {
    "duration": 30.887,
    "status": "PASSED"
   },
   "recipetool.RecipetoolCreateTests.test_recipetool_create_git_srcbranch": {
    "duration": 29.219,
    "status": "PASSED"
   },
   "recipetool.RecipetoolCreateTests.test_recipetool_create_git_srcuri_branch": {
    "duration": 27.74,
    "status": "PASSED"
   },
   "recipetool.RecipetoolCreateTests.test_recipetool_create_git_srcuri_master": {
    "duration": 30.216,
    "status": "PASSED"
   },
   "recipetool.RecipetoolCreateTests.test_recipetool_create_github": {
    "duration": 36.447,
    "status": "PASSED"
   },
   "recipetool.RecipetoolCreateTests.test_recipetool_create_github_tarball": {
    "duration": 34.761,
    "status": "PASSED"
   },
   "recipetool.RecipetoolCreateTests.test_recipetool_create_go": {
    "duration": 46.333,
    "status": "PASSED"
   },
   "recipetool.RecipetoolCreateTests.test_recipetool_create_npm": {
    "duration": 1.003,
    "log": "Test needs meta-oe for nodejs\n",
    "status": "SKIPPED"
   },
   "recipetool.RecipetoolCreateTests.test_recipetool_create_python3_pep517_flit_core_buildapi": {
    "duration": 35.076,
    "status": "PASSED"
   },
   "recipetool.RecipetoolCreateTests.test_recipetool_create_python3_pep517_hatchling": {
    "duration": 34.716,
    "status": "PASSED"
   },
   "recipetool.RecipetoolCreateTests.test_recipetool_create_python3_pep517_maturin": {
    "duration": 32.772,
    "status": "PASSED"
   },
   "recipetool.RecipetoolCreateTests.test_recipetool_create_python3_pep517_mesonpy": {
    "duration": 33.917,
    "status": "PASSED"
   },
   "recipetool.RecipetoolCreateTests.test_recipetool_create_python3_pep517_poetry_core_masonry_api": {
    "duration": 34.43,
    "status": "PASSED"
   },
   "recipetool.RecipetoolCreateTests.test_recipetool_create_python3_pep517_setuptools_build_meta": {
    "duration": 31.72,
    "status": "PASSED"
   },
   "recipetool.RecipetoolCreateTests.test_recipetool_create_python3_pep517_setuptools_build_meta_license_pep639": {
    "duration": 33.695,
    "status": "PASSED"
   },
   "recipetool.RecipetoolCreateTests.test_recipetool_create_python3_pep517_setuptools_build_meta_license_prepep639": {
    "duration": 31.334,
    "status": "PASSED"
   },
   "recipetool.RecipetoolCreateTests.test_recipetool_create_python3_setuptools": {
    "duration": 33.699,
    "status": "PASSED"
   },
   "recipetool.RecipetoolCreateTests.test_recipetool_create_python3_setuptools_pypi": {
    "duration": 64.404,
    "status": "PASSED"
   },
   "recipetool.RecipetoolCreateTests.test_recipetool_create_python3_setuptools_pypi_tarball": {
    "duration": 31.508,
    "status": "PASSED"
   },
   "recipetool.RecipetoolCreateTests.test_recipetool_create_simple": {
    "duration": 28.226,
    "status": "PASSED"
   },
   "recipetool.RecipetoolTests.test_recipetool_handle_license_vars": {
    "duration": 2.828,
    "status": "PASSED"
   },
   "recipetool.RecipetoolTests.test_recipetool_load_plugin": {
    "duration": 9.976,
    "status": "PASSED"
   },
   "recipetool.RecipetoolTests.test_recipetool_split_pkg_licenses": {
    "duration": 0.02446,
    "status": "PASSED"
   },
   "recipeutils.RecipeUtilsTests.test_patch_recipe_appends": {
    "duration": 0.09594,
    "status": "PASSED"
   },
   "recipeutils.RecipeUtilsTests.test_patch_recipe_singleappend": {
    "duration": 0.09198,
    "status": "PASSED"
   },
   "recipeutils.RecipeUtilsTests.test_patch_recipe_varflag": {
    "duration": 0.06987,
    "status": "PASSED"
   },
   "recipeutils.RecipeUtilsTests.test_split_var_value": {
    "duration": 0.008487,
    "status": "PASSED"
   },
   "recipeutils.RecipeUtilsTests.test_validate_pn": {
    "duration": 0.008843,
    "status": "PASSED"
   },
   "reproducible.DiffoscopeTests.test_diffoscope": {
    "log": "Skip by the command line argument \"reproducible\"\n",
    "status": "SKIPPED"
   },
   "reproducible.ReproducibleTests.test_reproducible_builds": {
    "log": "Skip by the command line argument \"reproducible\"\n",
    "status": "SKIPPED"
   },
   "resulttooltests.ResultToolTests.test_can_compare_ltp_tests": {
    "duration": 0.007711,
    "status": "PASSED"
   },
   "resulttooltests.ResultToolTests.test_can_match_non_static_ptest_names": {
    "duration": 0.007102,
    "status": "PASSED"
   },
   "resulttooltests.ResultToolTests.test_can_not_compare_non_ltp_tests": {
    "duration": 0.00705,
    "status": "PASSED"
   },
   "resulttooltests.ResultToolTests.test_junit_empty_testresults": {
    "duration": 0.007091,
    "status": "PASSED"
   },
   "resulttooltests.ResultToolTests.test_junit_log_attached": {
    "duration": 0.007518,
    "status": "PASSED"
   },
   "resulttooltests.ResultToolTests.test_junit_log_inline": {
    "duration": 0.007269,
    "status": "PASSED"
   },
   "resulttooltests.ResultToolTests.test_junit_missing_image_tests": {
    "duration": 0.007,
    "status": "PASSED"
   },
   "resulttooltests.ResultToolTests.test_junit_missing_ptests": {
    "duration": 0.007333,
    "status": "PASSED"
   },
   "resulttooltests.ResultToolTests.test_machine_matches": {
    "duration": 0.006732,
    "status": "PASSED"
   },
   "resulttooltests.ResultToolTests.test_machine_mismatches": {
    "duration": 0.006658,
    "status": "PASSED"
   },
   "resulttooltests.ResultToolTests.test_merge_can_merged_results": {
    "duration": 0.006591,
    "status": "PASSED"
   },
   "resulttooltests.ResultToolTests.test_metadata_matching_is_only_checked_for_relevant_test_type": {
    "duration": 0.006665,
    "status": "PASSED"
   },
   "resulttooltests.ResultToolTests.test_regression_can_get_regression_base_target_pair": {
    "duration": 0.006946,
    "status": "PASSED"
   },
   "resulttooltests.ResultToolTests.test_regression_can_get_regression_result": {
    "duration": 0.006805,
    "status": "PASSED"
   },
   "resulttooltests.ResultToolTests.test_report_can_aggregate_test_result": {
    "duration": 0.006865,
    "status": "PASSED"
   },
   "resulttooltests.ResultToolTests.test_results_with_matching_metadata_can_be_compared": {
    "duration": 0.005955,
    "status": "PASSED"
   },
   "resulttooltests.ResultToolTests.test_results_with_mismatching_metadata_can_not_be_compared": {
    "duration": 0.005095,
    "status": "PASSED"
   },
   "resulttooltests.ResultToolTests.test_results_without_metadata_can_be_compared": {
    "duration": 0.004895,
    "status": "PASSED"
   },
   "resulttooltests.ResultToolTests.test_target_result_with_missing_metadata_can_not_be_compared": {
    "duration": 0.004817,
    "status": "PASSED"
   },
   "retain.Retain.test_retain_always": {
    "duration": 43.325,
    "status": "PASSED"
   },
   "retain.Retain.test_retain_failure": {
    "duration": 50.617,
    "status": "PASSED"
   },
   "retain.Retain.test_retain_global": {
    "duration": 74.357,
    "status": "PASSED"
   },
   "retain.Retain.test_retain_misc": {
    "duration": 79.575,
    "status": "PASSED"
   },
   "rootfspostcommandstests.ShadowUtilsTidyFiles.test_shadowutils_backup_files": {
    "duration": 22.328,
    "log": "Testcase skipped as 'tidy_shadowutils_files' rootfs post process command is not the set SORT_PASSWD_POSTPROCESS_COMMAND.\n",
    "status": "SKIPPED"
   },
   "rootfspostcommandstests.ShadowUtilsTidyFiles.test_shadowutils_sorted_files": {
    "duration": 5.282,
    "log": "Testcase skipped as 'tidy_shadowutils_files' rootfs post process command is not the set SORT_PASSWD_POSTPROCESS_COMMAND.\n",
    "status": "SKIPPED"
   },
   "rpmtests.BitbakeTests.test_rpm_filenames": {
    "duration": 7.392,
    "status": "PASSED"
   },
   "runcmd.RunCmdTests.test_list_not_found": {
    "duration": 0.008647,
    "status": "PASSED"
   },
   "runcmd.RunCmdTests.test_list_okay": {
    "duration": 0.1227,
    "status": "PASSED"
   },
   "runcmd.RunCmdTests.test_log": {
    "duration": 0.008538,
    "status": "PASSED"
   },
   "runcmd.RunCmdTests.test_log_split": {
    "duration": 0.007322,
    "status": "PASSED"
   },
   "runcmd.RunCmdTests.test_no_shell": {
    "duration": 0.007328,
    "status": "PASSED"
   },
   "runcmd.RunCmdTests.test_output": {
    "duration": 0.008291,
    "status": "PASSED"
   },
   "runcmd.RunCmdTests.test_output_split": {
    "duration": 0.007683,
    "status": "PASSED"
   },
   "runcmd.RunCmdTests.test_result_assertion": {
    "duration": 0.01712,
    "status": "PASSED"
   },
   "runcmd.RunCmdTests.test_result_exception": {
    "duration": 0.01521,
    "status": "PASSED"
   },
   "runcmd.RunCmdTests.test_result_false": {
    "duration": 0.01248,
    "status": "PASSED"
   },
   "runcmd.RunCmdTests.test_result_okay": {
    "duration": 0.01408,
    "status": "PASSED"
   },
   "runcmd.RunCmdTests.test_shell": {
    "duration": 0.01503,
    "status": "PASSED"
   },
   "runcmd.RunCmdTests.test_stdin": {
    "duration": 0.00854,
    "status": "PASSED"
   },
   "runcmd.RunCmdTests.test_stdin_timeout": {
    "duration": 10.01,
    "status": "PASSED"
   },
   "runcmd.RunCmdTests.test_timeout": {
    "duration": 10.009,
    "status": "PASSED"
   },
   "runcmd.RunCmdTests.test_timeout_split": {
    "duration": 10.014,
    "status": "PASSED"
   },
   "runqemu.RunqemuTests.test_boot_compressed_wic_by_path": {
    "duration": 141.395,
    "oetags": [
     "runqemu"
    ],
    "status": "PASSED"
   },
   "runqemu.RunqemuTests.test_boot_compressed_wic_by_recipe": {
    "duration": 41.217,
    "oetags": [
     "runqemu"
    ],
    "status": "PASSED"
   },
   "runqemu.RunqemuTests.test_boot_deploy": {
    "duration": 22.158,
    "oetags": [
     "runqemu"
    ],
    "status": "PASSED"
   },
   "runqemu.RunqemuTests.test_boot_deploy_hddimg": {
    "duration": 22.628,
    "oetags": [
     "runqemu"
    ],
    "status": "PASSED"
   },
   "runqemu.RunqemuTests.test_boot_machine": {
    "duration": 25.346,
    "oetags": [
     "runqemu"
    ],
    "status": "PASSED"
   },
   "runqemu.RunqemuTests.test_boot_machine_ext4": {
    "duration": 24.411,
    "oetags": [
     "runqemu"
    ],
    "status": "PASSED"
   },
   "runqemu.RunqemuTests.test_boot_machine_iso": {
    "duration": 25.49,
    "oetags": [
     "runqemu"
    ],
    "status": "PASSED"
   },
   "runqemu.RunqemuTests.test_boot_machine_slirp": {
    "duration": 21.752,
    "oetags": [
     "runqemu"
    ],
    "status": "PASSED"
   },
   "runqemu.RunqemuTests.test_boot_machine_slirp_qcow2": {
    "duration": 23.193,
    "oetags": [
     "runqemu"
    ],
    "status": "PASSED"
   },
   "runqemu.RunqemuTests.test_boot_qemu_boot": {
    "duration": 19.794,
    "oetags": [
     "runqemu"
    ],
    "status": "PASSED"
   },
   "runqemu.RunqemuTests.test_boot_recipe_image": {
    "duration": 25.921,
    "oetags": [
     "runqemu"
    ],
    "status": "PASSED"
   },
   "runqemu.RunqemuTests.test_boot_recipe_image_vdi": {
    "duration": 26.267,
    "oetags": [
     "runqemu"
    ],
    "status": "PASSED"
   },
   "runqemu.RunqemuTests.test_boot_recipe_image_vmdk": {
    "duration": 25.213,
    "oetags": [
     "runqemu"
    ],
    "status": "PASSED"
   },
   "runqemu.RunqemuTests.test_boot_rootfs": {
    "duration": 20.509,
    "oetags": [
     "runqemu"
    ],
    "status": "PASSED"
   },
   "runtime_test.Postinst.test_failing_postinst": {
    "duration": 164.631,
    "oetags": [
     "runqemu"
    ],
    "status": "PASSED"
   },
   "runtime_test.Postinst.test_postinst_rootfs_and_boot_systemd": {
    "duration": 466.877,
    "oetags": [
     "runqemu"
    ],
    "status": "PASSED"
   },
   "runtime_test.Postinst.test_postinst_rootfs_and_boot_sysvinit": {
    "duration": 262.968,
    "oetags": [
     "runqemu"
    ],
    "status": "PASSED"
   },
   "runtime_test.RustKernel.test_kernel_rust_sample": {
    "duration": 386.626,
    "oetags": [
     "runqemu"
    ],
    "status": "PASSED"
   },
   "runtime_test.SystemTap.test_crosstap_helloworld": {
    "duration": 253.497,
    "oetags": [
     "runqemu"
    ],
    "status": "PASSED"
   },
   "runtime_test.SystemTap.test_crosstap_pstree": {
    "duration": 38.74,
    "oetags": [
     "runqemu"
    ],
    "status": "PASSED"
   },
   "runtime_test.SystemTap.test_crosstap_syscalls_by_pid": {
    "duration": 39.843,
    "oetags": [
     "runqemu"
    ],
    "status": "PASSED"
   },
   "runtime_test.SystemTap.test_crosstap_syscalls_by_proc": {
    "duration": 39.91,
    "oetags": [
     "runqemu"
    ],
    "status": "PASSED"
   },
   "runtime_test.TestExport.test_testexport_basic": {
    "duration": 116.916,
    "oetags": [
     "runqemu"
    ],
    "status": "PASSED"
   },
   "runtime_test.TestExport.test_testexport_sdk": {
    "duration": 110.126,
    "status": "PASSED"
   },
   "runtime_test.TestImage.test_testimage_apt": {
    "duration": 199.869,
    "oetags": [
     "runqemu"
    ],
    "status": "PASSED"
   },
   "runtime_test.TestImage.test_testimage_dnf": {
    "duration": 163.315,
    "oetags": [
     "runqemu"
    ],
    "status": "PASSED"
   },
   "runtime_test.TestImage.test_testimage_install": {
    "duration": 142.198,
    "oetags": [
     "runqemu"
    ],
    "status": "PASSED"
   },
   "runtime_test.TestImage.test_testimage_slirp": {
    "duration": 92.19,
    "oetags": [
     "runqemu"
    ],
    "status": "PASSED"
   },
   "runtime_test.TestImage.test_testimage_virgl_gtk_sdl": {
    "duration": 235.192,
    "oetags": [
     "runqemu"
    ],
    "status": "PASSED"
   },
   "runtime_test.TestImage.test_testimage_virgl_headless": {
    "duration": 0.006342,
    "log": "virgl headless cannot be tested with rocky-8.10\n",
    "oetags": [
     "runqemu"
    ],
    "status": "SKIPPED"
   },
   "rust.RustStaticMuslTest.test_static_musl_linking": {
    "duration": 55.713,
    "status": "PASSED"
   },
   "sdk.SDKTests.test_sdk_manifests": {
    "duration": 474.494,
    "status": "PASSED"
   },
   "sdk.SDKTests.test_sdk_runqemu": {
    "duration": 552.245,
    "status": "PASSED"
   },
   "selftest.ExternalLayer.test_list_imported": {
    "duration": 0.007775,
    "status": "PASSED"
   },
   "signing.LockedSignatures.test_locked_signatures": {
    "duration": 120.858,
    "status": "PASSED"
   },
   "signing.Signing.test_signing_packages": {
    "duration": 1080.154,
    "status": "PASSED"
   },
   "signing.Signing.test_signing_sstate_archive": {
    "duration": 135.42,
    "status": "PASSED"
   },
   "spdx.SPDX30Check.test_baremetal_helloworld": {
    "duration": 60.133,
    "status": "PASSED"
   },
   "spdx.SPDX30Check.test_base_files": {
    "duration": 47.199,
    "status": "PASSED"
   },
   "spdx.SPDX30Check.test_core_image_minimal": {
    "duration": 72.294,
    "status": "PASSED"
   },
   "spdx.SPDX30Check.test_core_image_minimal_sdk": {
    "duration": 331.757,
    "status": "PASSED"
   },
   "spdx.SPDX30Check.test_custom_annotation_vars": {
    "duration": 23.637,
    "status": "PASSED"
   },
   "spdx.SPDX30Check.test_download_location_defensive_handling": {
    "duration": 14.63,
    "status": "PASSED"
   },
   "spdx.SPDX30Check.test_extra_opts": {
    "duration": 121.935,
    "status": "PASSED"
   },
   "spdx.SPDX30Check.test_gcc_include_source": {
    "duration": 1477.482,
    "status": "PASSED"
   },
   "spdx.SPDX30Check.test_kernel_config_spdx": {
    "duration": 116.688,
    "status": "PASSED"
   },
   "spdx.SPDX30Check.test_packageconfig_spdx": {
    "duration": 20.878,
    "status": "PASSED"
   },
   "spdx.SPDX30Check.test_version_extraction_patterns": {
    "duration": 10.346,
    "status": "PASSED"
   },
   "spdx.SPDX30Check.test_world_sbom": {
    "duration": 34.162,
    "status": "PASSED"
   },
   "sstatetests.SStateCacheManagement.test_sstate_cache_management_script_using_machine": {
    "duration": 148.945,
    "status": "PASSED"
   },
   "sstatetests.SStateCacheManagement.test_sstate_cache_management_script_using_pr_1": {
    "duration": 68.681,
    "status": "PASSED"
   },
   "sstatetests.SStateCacheManagement.test_sstate_cache_management_script_using_pr_2": {
    "duration": 106.388,
    "status": "PASSED"
   },
   "sstatetests.SStateCacheManagement.test_sstate_cache_management_script_using_pr_3": {
    "duration": 172.129,
    "status": "PASSED"
   },
   "sstatetests.SStateCleanup.test_cleansstate_task_distro_nonspecific": {
    "duration": 37.047,
    "status": "PASSED"
   },
   "sstatetests.SStateCleanup.test_cleansstate_task_distro_specific": {
    "duration": 40.148,
    "status": "PASSED"
   },
   "sstatetests.SStateCleanup.test_cleansstate_task_distro_specific_nonspecific": {
    "duration": 41.827,
    "status": "PASSED"
   },
   "sstatetests.SStateCreation.test_sstate_creation_distro_nonspecific": {
    "duration": 39.367,
    "status": "PASSED"
   },
   "sstatetests.SStateCreation.test_sstate_creation_distro_specific": {
    "duration": 33.373,
    "status": "PASSED"
   },
   "sstatetests.SStateDistroTests.test_rebuild_distro_specific_sstate_cross_native_targets": {
    "duration": 51.482,
    "status": "PASSED"
   },
   "sstatetests.SStateDistroTests.test_rebuild_distro_specific_sstate_cross_target": {
    "duration": 50.169,
    "status": "PASSED"
   },
   "sstatetests.SStateDistroTests.test_rebuild_distro_specific_sstate_native_target": {
    "duration": 53.94,
    "status": "PASSED"
   },
   "sstatetests.SStateFindSiginfo.test_sstate_compare_sigfiles_and_find_siginfo": {
    "duration": 1469.794,
    "status": "PASSED"
   },
   "sstatetests.SStateHashSameSigs.test_sstate_32_64_same_hash": {
    "duration": 115.81,
    "status": "PASSED"
   },
   "sstatetests.SStateHashSameSigs.test_sstate_nativelsbstring_same_hash": {
    "duration": 102.458,
    "status": "PASSED"
   },
   "sstatetests.SStateHashSameSigs.test_sstate_sdk_arch_same_hash": {
    "duration": 118.334,
    "status": "PASSED"
   },
   "sstatetests.SStateHashSameSigs2.test_sstate_allarch_samesigs": {
    "duration": 95.988,
    "status": "PASSED"
   },
   "sstatetests.SStateHashSameSigs2.test_sstate_nativesdk_samesigs_multilib": {
    "duration": 121.377,
    "status": "PASSED"
   },
   "sstatetests.SStateHashSameSigs3.test_sstate_multilib_or_not_native_samesigs": {
    "duration": 72.702,
    "status": "PASSED"
   },
   "sstatetests.SStateHashSameSigs3.test_sstate_sametune_samesigs": {
    "duration": 165.522,
    "status": "PASSED"
   },
   "sstatetests.SStateHashSameSigs4.test_sstate_movelayer_samesigs": {
    "duration": 62.517,
    "status": "PASSED"
   },
   "sstatetests.SStateHashSameSigs4.test_sstate_noop_samesigs": {
    "duration": 137.917,
    "status": "PASSED"
   },
   "sstatetests.SStatePrintdiff.test_gcc_runtime_vs_gcc_source": {
    "duration": 1981.98,
    "status": "PASSED"
   },
   "sstatetests.SStatePrintdiff.test_image_minimal_vs_base_do_configure": {
    "duration": 1002.787,
    "status": "PASSED"
   },
   "sstatetests.SStatePrintdiff.test_image_minimal_vs_perlcross": {
    "duration": 379.371,
    "status": "PASSED"
   },
   "sstatetests.SStateTests.test_autorev_sstate_works": {
    "duration": 84.173,
    "status": "PASSED"
   },
   "sysroot.SysrootTests.test_sysroot_cleanup": {
    "duration": 57.518,
    "status": "PASSED"
   },
   "sysroot.SysrootTests.test_sysroot_la": {
    "duration": 29.439,
    "status": "PASSED"
   },
   "sysroot.SysrootTests.test_sysroot_max_shebang": {
    "duration": 13.143,
    "status": "PASSED"
   },
   "sysroot.SysrootTests.test_sysroot_pkgconfig": {
    "duration": 32.393,
    "status": "PASSED"
   },
   "systemd_boot.Systemdboot.test_efi_systemdboot_images_can_be_built": {
    "duration": 131.879,
    "status": "PASSED"
   },
   "tinfoil.TinfoilTests.test_datastore_operations": {
    "duration": 0.6966,
    "status": "PASSED"
   },
   "tinfoil.TinfoilTests.test_expand": {
    "duration": 0.5105,
    "status": "PASSED"
   },
   "tinfoil.TinfoilTests.test_getvar": {
    "duration": 1.017,
    "status": "PASSED"
   },
   "tinfoil.TinfoilTests.test_getvar_bb_origenv": {
    "duration": 1.018,
    "status": "PASSED"
   },
   "tinfoil.TinfoilTests.test_list_recipes": {
    "duration": 5.164,
    "status": "PASSED"
   },
   "tinfoil.TinfoilTests.test_parse_recipe": {
    "duration": 4.662,
    "status": "PASSED"
   },
   "tinfoil.TinfoilTests.test_parse_recipe_copy_expand": {
    "duration": 4.711,
    "status": "PASSED"
   },
   "tinfoil.TinfoilTests.test_parse_recipe_custom_data": {
    "duration": 4.429,
    "status": "PASSED"
   },
   "tinfoil.TinfoilTests.test_parse_virtual_recipe": {
    "duration": 4.585,
    "status": "PASSED"
   },
   "tinfoil.TinfoilTests.test_parse_virtual_recipe_custom_data": {
    "duration": 4.426,
    "status": "PASSED"
   },
   "tinfoil.TinfoilTests.test_run_prepared_task": {
    "duration": 64.852,
    "status": "PASSED"
   },
   "tinfoil.TinfoilTests.test_setvariable_clean": {
    "duration": 3.018,
    "status": "PASSED"
   },
   "tinfoil.TinfoilTests.test_variable_history": {
    "duration": 4.543,
    "status": "PASSED"
   },
   "tinfoil.TinfoilTests.test_wait_event": {
    "duration": 2.002,
    "status": "PASSED"
   },
   "toolchain.ToolchainTests.test_toolchain_switching": {
    "duration": 109.364,
    "status": "PASSED"
   },
   "uboot.UBootConfigTest.test_uboot_config_extract": {
    "duration": 17.869,
    "status": "PASSED"
   },
   "uboot.UBootConfigTest.test_uboot_config_extract_error_missing_config": {
    "duration": 14.891,
    "status": "PASSED"
   },
   "uboot.UBootConfigTest.test_uboot_config_extract_error_nothing_set": {
    "duration": 18.176,
    "status": "PASSED"
   },
   "uboot.UBootConfigTest.test_uboot_config_extract_error_set_both_config_and_machine": {
    "duration": 14.979,
    "status": "PASSED"
   },
   "uboot.UBootConfigTest.test_uboot_config_extract_error_set_uboot_config_binary": {
    "duration": 15.14,
    "status": "PASSED"
   },
   "uboot.UBootConfigTest.test_uboot_config_extract_error_set_uboot_config_fragments": {
    "duration": 14.815,
    "status": "PASSED"
   },
   "uboot.UBootConfigTest.test_uboot_config_extract_error_set_uboot_config_image_fstypes": {
    "duration": 18.241,
    "status": "PASSED"
   },
   "uboot.UBootConfigTest.test_uboot_config_extract_error_set_uboot_config_make_opts": {
    "duration": 15.629,
    "status": "PASSED"
   },
   "uboot.UBootConfigTest.test_uboot_config_extract_legacy": {
    "duration": 18.831,
    "status": "PASSED"
   },
   "uboot.UBootConfigTest.test_uboot_config_extract_single_config": {
    "duration": 18.545,
    "status": "PASSED"
   },
   "uboot.UBootTest.test_boot_uboot": {
    "duration": 0.001157,
    "log": "Test skipped on x86_64\n",
    "oetags": [
     "runqemu"
    ],
    "status": "SKIPPED"
   },
   "uboot.UBootTest.test_boot_uboot_kvm_to_full_target": {
    "duration": 0.001512,
    "log": "Test skipped on x86_64\n",
    "oetags": [
     "runqemu"
    ],
    "status": "SKIPPED"
   },
   "uboot.UBootTest.test_uboot_config_initial_env_binary": {
    "duration": 39.262,
    "status": "PASSED"
   },
   "uboot.UBootTest.test_uboot_initial_env_binary": {
    "duration": 111.394,
    "status": "PASSED"
   },
   "uki.UkiTest.test_uki_boot_systemd": {
    "duration": 637.436,
    "oetags": [
     "runqemu"
    ],
    "status": "PASSED"
   },
   "uki.UkiTest.test_uki_sysvinit": {
    "duration": 513.515,
    "oetags": [
     "runqemu"
    ],
    "status": "PASSED"
   },
   "usergrouptests.UserGroupTests.test_add_task_between_p_sysroot_and_package": {
    "duration": 14.147,
    "status": "PASSED"
   },
   "usergrouptests.UserGroupTests.test_group_from_dep_package": {
    "duration": 23.956,
    "status": "PASSED"
   },
   "usergrouptests.UserGroupTests.test_postinst_order": {
    "duration": 19.215,
    "status": "PASSED"
   },
   "usergrouptests.UserGroupTests.test_static_useradd_from_dynamic": {
    "duration": 107.461,
    "status": "PASSED"
   },
   "usergrouptests.UserGroupTests.test_useradd_depends_only": {
    "duration": 14.503,
    "status": "PASSED"
   },
   "wic.CLITests.test_createhelp": {
    "duration": 58.932,
    "status": "PASSED"
   },
   "wic.CLITests.test_help": {
    "duration": 4.036,
    "status": "PASSED"
   },
   "wic.CLITests.test_help_create": {
    "duration": 4.543,
    "status": "PASSED"
   },
   "wic.CLITests.test_help_kickstart": {
    "duration": 5.171,
    "status": "PASSED"
   },
   "wic.CLITests.test_help_list": {
    "duration": 4.525,
    "status": "PASSED"
   },
   "wic.CLITests.test_help_overview": {
    "duration": 4.578,
    "status": "PASSED"
   },
   "wic.CLITests.test_help_plugins": {
    "duration": 4.755,
    "status": "PASSED"
   },
   "wic.CLITests.test_list_images": {
    "duration": 7.624,
    "status": "PASSED"
   },
   "wic.CLITests.test_list_source_plugins": {
    "duration": 8.769,
    "status": "PASSED"
   },
   "wic.CLITests.test_listed_images_help": {
    "duration": 70.515,
    "status": "PASSED"
   },
   "wic.CLITests.test_listhelp": {
    "duration": 5.83,
    "status": "PASSED"
   },
   "wic.CLITests.test_no_command": {
    "duration": 4.843,
    "status": "PASSED"
   },
   "wic.CLITests.test_unsupported_subcommand": {
    "duration": 4.85,
    "status": "PASSED"
   },
   "wic.CLITests.test_version": {
    "duration": 4.856,
    "status": "PASSED"
   },
   "wic.ModifyTests.test_wic_cp": {
    "duration": 92.402,
    "status": "PASSED"
   },
   "wic.ModifyTests.test_wic_cp_ext": {
    "duration": 47.843,
    "status": "PASSED"
   },
   "wic.ModifyTests.test_wic_ls": {
    "duration": 29.87,
    "status": "PASSED"
   },
   "wic.ModifyTests.test_wic_ls_ext": {
    "duration": 28.599,
    "status": "PASSED"
   },
   "wic.ModifyTests.test_wic_rm": {
    "duration": 42.628,
    "status": "PASSED"
   },
   "wic.ModifyTests.test_wic_rm_ext": {
    "duration": 38.531,
    "status": "PASSED"
   },
   "wic.Wic.test_bootloader_config": {
    "duration": 289.097,
    "status": "PASSED"
   },
   "wic.Wic.test_build_artifacts": {
    "duration": 40.321,
    "status": "PASSED"
   },
   "wic.Wic.test_build_image_name": {
    "duration": 32.638,
    "status": "PASSED"
   },
   "wic.Wic.test_build_rootfs_long": {
    "duration": 82.841,
    "status": "PASSED"
   },
   "wic.Wic.test_build_rootfs_short": {
    "duration": 46.476,
    "status": "PASSED"
   },
   "wic.Wic.test_change_directory": {
    "duration": 32.336,
    "status": "PASSED"
   },
   "wic.Wic.test_change_directory_errors": {
    "duration": 55.489,
    "status": "PASSED"
   },
   "wic.Wic.test_compress_bzip2": {
    "duration": 42.058,
    "status": "PASSED"
   },
   "wic.Wic.test_compress_gzip": {
    "duration": 37.061,
    "status": "PASSED"
   },
   "wic.Wic.test_compress_xz": {
    "duration": 38.958,
    "status": "PASSED"
   },
   "wic.Wic.test_debug_long": {
    "duration": 30.564,
    "status": "PASSED"
   },
   "wic.Wic.test_debug_short": {
    "duration": 33.198,
    "status": "PASSED"
   },
   "wic.Wic.test_default_output_dir": {
    "duration": 84.727,
    "status": "PASSED"
   },
   "wic.Wic.test_efi_bootpart": {
    "duration": 65.388,
    "status": "PASSED"
   },
   "wic.Wic.test_exclude_path": {
    "duration": 39.747,
    "status": "PASSED"
   },
   "wic.Wic.test_exclude_path_errors": {
    "duration": 53.908,
    "status": "PASSED"
   },
   "wic.Wic.test_exclude_path_with_extra_space": {
    "duration": 108.773,
    "status": "PASSED"
   },
   "wic.Wic.test_extra_space": {
    "duration": 29.475,
    "status": "PASSED"
   },
   "wic.Wic.test_gpt_image": {
    "duration": 32.372,
    "status": "PASSED"
   },
   "wic.Wic.test_grub_install_pcbios": {
    "duration": 115.3,
    "status": "PASSED"
   },
   "wic.Wic.test_include_path": {
    "duration": 35.504,
    "status": "PASSED"
   },
   "wic.Wic.test_include_path_embeded": {
    "duration": 43.05,
    "status": "PASSED"
   },
   "wic.Wic.test_include_path_errors": {
    "duration": 92.819,
    "status": "PASSED"
   },
   "wic.Wic.test_iso_image": {
    "duration": 336.127,
    "status": "PASSED"
   },
   "wic.Wic.test_kernel_install": {
    "duration": 42.765,
    "status": "PASSED"
   },
   "wic.Wic.test_mkefidisk": {
    "duration": 34.302,
    "status": "PASSED"
   },
   "wic.Wic.test_no_fstab_update": {
    "duration": 47.074,
    "status": "PASSED"
   },
   "wic.Wic.test_no_fstab_update_errors": {
    "duration": 49.262,
    "status": "PASSED"
   },
   "wic.Wic.test_no_table": {
    "duration": 27.798,
    "status": "PASSED"
   },
   "wic.Wic.test_partition_hidden_attributes": {
    "duration": 34.041,
    "status": "PASSED"
   },
   "wic.Wic.test_permissions": {
    "duration": 268.446,
    "status": "PASSED"
   },
   "wic.Wic.test_qemux86_directdisk": {
    "duration": 27.61,
    "status": "PASSED"
   },
   "wic.Wic.test_rootfs_artifacts": {
    "duration": 56.098,
    "status": "PASSED"
   },
   "wic.Wic.test_rootfs_indirect_recipes": {
    "duration": 25.645,
    "status": "PASSED"
   },
   "wic.Wic.test_sdimage_bootpart": {
    "duration": 43.137,
    "status": "PASSED"
   },
   "wic.Wic.test_skip_build_check_long": {
    "duration": 23.189,
    "status": "PASSED"
   },
   "wic.Wic.test_skip_build_check_short": {
    "duration": 23.59,
    "status": "PASSED"
   },
   "wic.Wic.test_skip_kernel_install": {
    "duration": 37.925,
    "status": "PASSED"
   },
   "wic.Wic.test_systemd_bootdisk": {
    "duration": 80.589,
    "status": "PASSED"
   },
   "wic.Wic.test_wic_sector_size_cli": {
    "duration": 70.518,
    "status": "PASSED"
   },
   "wic.Wic.test_wic_sector_size_env": {
    "duration": 72.423,
    "status": "PASSED"
   },
   "wic.Wic.test_wrong_compressor": {
    "duration": 5.759,
    "status": "PASSED"
   },
   "wic.Wic2.test_biosplusefi_plugin": {
    "duration": 156.528,
    "status": "PASSED"
   },
   "wic.Wic2.test_biosplusefi_plugin_qemu": {
    "duration": 55.577,
    "oetags": [
     "runqemu"
    ],
    "status": "PASSED"
   },
   "wic.Wic2.test_bmap_long": {
    "duration": 24.254,
    "status": "PASSED"
   },
   "wic.Wic2.test_bmap_short": {
    "duration": 24.479,
    "status": "PASSED"
   },
   "wic.Wic2.test_diskid_on_gpt_partition": {
    "duration": 26.537,
    "status": "PASSED"
   },
   "wic.Wic2.test_diskid_on_msdos_partition": {
    "duration": 27.542,
    "status": "PASSED"
   },
   "wic.Wic2.test_efi_plugin_plain_systemd_boot_qemu_aarch64": {
    "duration": 0.0007644,
    "log": "Test skipped on x86_64\n",
    "oetags": [
     "runqemu"
    ],
    "status": "SKIPPED"
   },
   "wic.Wic2.test_efi_plugin_plain_systemd_boot_qemu_x86": {
    "duration": 477.841,
    "oetags": [
     "runqemu"
    ],
    "status": "PASSED"
   },
   "wic.Wic2.test_efi_plugin_unified_kernel_image_qemu": {
    "duration": 119.639,
    "oetags": [
     "runqemu"
    ],
    "status": "PASSED"
   },
   "wic.Wic2.test_empty_plugin": {
    "duration": 73.183,
    "status": "PASSED"
   },
   "wic.Wic2.test_empty_zeroize_plugin": {
    "duration": 41.019,
    "status": "PASSED"
   },
   "wic.Wic2.test_expand_mbr_image": {
    "duration": 73.899,
    "oetags": [
     "runqemu"
    ],
    "status": "PASSED"
   },
   "wic.Wic2.test_extra_filesystem_space": {
    "duration": 28.479,
    "status": "PASSED"
   },
   "wic.Wic2.test_extra_partition_plugin": {
    "duration": 64.733,
    "status": "PASSED"
   },
   "wic.Wic2.test_extra_partition_space": {
    "duration": 31.549,
    "status": "PASSED"
   },
   "wic.Wic2.test_fixed_size": {
    "duration": 26.194,
    "status": "PASSED"
   },
   "wic.Wic2.test_fixed_size_error": {
    "duration": 23.472,
    "status": "PASSED"
   },
   "wic.Wic2.test_fs_types": {
    "duration": 23.818,
    "status": "PASSED"
   },
   "wic.Wic2.test_gpt_partition_name": {
    "duration": 64.419,
    "status": "PASSED"
   },
   "wic.Wic2.test_image_bootpart_globbed": {
    "duration": 41.906,
    "status": "PASSED"
   },
   "wic.Wic2.test_image_env": {
    "duration": 42.995,
    "status": "PASSED"
   },
   "wic.Wic2.test_image_vars_dir_long": {
    "duration": 7.648,
    "status": "PASSED"
   },
   "wic.Wic2.test_image_vars_dir_short": {
    "duration": 9.171,
    "status": "PASSED"
   },
   "wic.Wic2.test_kickstart_parser": {
    "duration": 23.677,
    "status": "PASSED"
   },
   "wic.Wic2.test_mkfs_extraopts": {
    "duration": 25.311,
    "status": "PASSED"
   },
   "wic.Wic2.test_offset": {
    "duration": 140.275,
    "status": "PASSED"
   },
   "wic.Wic2.test_qemu": {
    "duration": 98.208,
    "oetags": [
     "runqemu"
    ],
    "status": "PASSED"
   },
   "wic.Wic2.test_qemu_efi": {
    "duration": 83.628,
    "oetags": [
     "runqemu"
    ],
    "status": "PASSED"
   },
   "wic.Wic2.test_rawcopy_plugin": {
    "duration": 77.209,
    "status": "PASSED"
   },
   "wic.Wic2.test_rawcopy_plugin_qemu": {
    "duration": 90.587,
    "oetags": [
     "runqemu"
    ],
    "status": "PASSED"
   },
   "wic.Wic2.test_rawcopy_plugin_unpack": {
    "duration": 76.423,
    "status": "PASSED"
   },
   "wic.Wic2.test_uefi_kernel": {
    "duration": 76.98,
    "status": "PASSED"
   },
   "wic.Wic2.test_wic_image_type": {
    "duration": 30.864,
    "status": "PASSED"
   },
   "wrapper.WrapperTests.test_shebang_wrapper": {
    "duration": 26.069,
    "status": "PASSED"
   },
   "yoctotestresultsquerytests.TestResultsQueryTests.test_create_workdir": {
    "duration": 3.63,
    "status": "PASSED"
   },
   "yoctotestresultsquerytests.TestResultsQueryTests.test_get_sha1": {
    "duration": 0.07936,
    "status": "PASSED"
   }
  }
 },
 "oeselftest_ubuntu-24.04_qemux86-64_20260913101508": {
  "configuration": {
   "HOST_DISTRO": "ubuntu-24.04",
   "HOST_NAME": "ubuntu2404-vk-3",
   "LAYERS": {
    "meta": {
     "branch": "master-next",
     "commit": "fee85dccc1c49058c7db895f913af8fe43416efa",
     "commit_count": 68823,
     "commit_time": 1789293269
    },
    "meta-poky": {
     "branch": "master",
     "commit": "7e41504cd63b099b214f10d92cfdaf358ab98c5f",
     "commit_count": 1821,
     "commit_time": 1788885316
    },
    "meta-selftest": {
     "branch": "master-next",
     "commit": "fee85dccc1c49058c7db895f913af8fe43416efa",
     "commit_count": 68823,
     "commit_time": 1789293269
    },
    "meta-yocto-bsp": {
     "branch": "master",
     "commit": "7e41504cd63b099b214f10d92cfdaf358ab98c5f",
     "commit_count": 1821,
     "commit_time": 1788885316
    }
   },
   "MACHINE": "qemux86-64",
   "OESELFTEST_METADATA": {
    "exclude_tags": [
     "yocto-mirrors",
     "machine",
     "toolchain-user",
     "toolchain-system"
    ],
    "run_all_tests": true,
    "run_tests": null,
    "select_tags": null,
    "skips": [
     "distrodata.Distrodata.test_checkpkg",
     "reproducible"
    ]
   },
   "STARTTIME": "20260913101508",
   "TESTSERIES": "oeqa",
   "TEST_TYPE": "oeselftest"
  },
  "result": {
   "archiver.Archiver.test_archiver_allows_to_filter_on_recipe_name": {
    "duration": 40.207,
    "status": "PASSED"
   },
   "archiver.Archiver.test_archiver_cleanup": {
    "duration": 69.571,
    "status": "PASSED"
   },
   "archiver.Archiver.test_archiver_filters_by_type": {
    "duration": 28.868,
    "status": "PASSED"
   },
   "archiver.Archiver.test_archiver_filters_by_type_and_name": {
    "duration": 39.221,
    "status": "PASSED"
   },
   "archiver.Archiver.test_archiver_mode_configured": {
    "duration": 33.267,
    "status": "PASSED"
   },
   "archiver.Archiver.test_archiver_mode_diff": {
    "duration": 33.333,
    "status": "PASSED"
   },
   "archiver.Archiver.test_archiver_mode_dumpdata": {
    "duration": 10.674,
    "status": "PASSED"
   },
   "archiver.Archiver.test_archiver_mode_mirror": {
    "duration": 33.408,
    "status": "PASSED"
   },
   "archiver.Archiver.test_archiver_mode_mirror_combined": {
    "duration": 42.778,
    "status": "PASSED"
   },
   "archiver.Archiver.test_archiver_mode_mirror_excludes": {
    "duration": 33.616,
    "status": "PASSED"
   },
   "archiver.Archiver.test_archiver_mode_mirror_gitsm": {
    "duration": 15.849,
    "status": "PASSED"
   },
   "archiver.Archiver.test_archiver_mode_mirror_gitsm_shallow": {
    "duration": 58.493,
    "status": "PASSED"
   },
   "archiver.Archiver.test_archiver_mode_original": {
    "duration": 37.892,
    "status": "PASSED"
   },
   "archiver.Archiver.test_archiver_mode_patched": {
    "duration": 12.993,
    "status": "PASSED"
   },
   "archiver.Archiver.test_archiver_mode_recipe": {
    "duration": 44.077,
    "status": "PASSED"
   },
   "archiver.Archiver.test_archiver_multiconfig_shared_unpack_and_patch": {
    "duration": 163.149,
    "status": "PASSED"
   },
   "barebox.BareboxTest.test_boot_barebox": {
    "duration": 0.00245,
    "log": "Test skipped on x86_64\n",
    "oetags": [
     "runqemu"
    ],
    "status": "SKIPPED"
   },
   "baremetal.BaremetalTest.test_baremetal": {
    "duration": 4413.364,
    "status": "PASSED"
   },
   "bbclasses.Systemd.test_systemd_in_distro": {
    "duration": 72.077,
    "status": "PASSED"
   },
   "bbclasses.Systemd.test_sysvinit_in_distro": {
    "duration": 35.31,
    "status": "PASSED"
   },
   "bblayers.BitbakeConfigBuild.test_enable_disable_builtin_fragments": {
    "duration": 21.035,
    "status": "PASSED"
   },
   "bblayers.BitbakeConfigBuild.test_enable_disable_fragments": {
    "duration": 17.59,
    "status": "PASSED"
   },
   "bblayers.BitbakeConfigBuild.test_show_fragment": {
    "duration": 2.074,
    "status": "PASSED"
   },
   "bblayers.BitbakeLayers.test_bitbakelayers_add_remove": {
    "duration": 9.221,
    "status": "PASSED"
   },
   "bblayers.BitbakeLayers.test_bitbakelayers_createlayer": {
    "duration": 7.67,
    "status": "PASSED"
   },
   "bblayers.BitbakeLayers.test_bitbakelayers_flatten": {
    "duration": 46.256,
    "status": "PASSED"
   },
   "bblayers.BitbakeLayers.test_bitbakelayers_layerindexshowdepends": {
    "duration": 1.354,
    "status": "PASSED"
   },
   "bblayers.BitbakeLayers.test_bitbakelayers_setup": {
    "duration": 31.628,
    "status": "PASSED"
   },
   "bblayers.BitbakeLayers.test_bitbakelayers_showappends": {
    "duration": 11.113,
    "status": "PASSED"
   },
   "bblayers.BitbakeLayers.test_bitbakelayers_showcrossdepends": {
    "duration": 20.562,
    "status": "PASSED"
   },
   "bblayers.BitbakeLayers.test_bitbakelayers_showlayers": {
    "duration": 0.6989,
    "status": "PASSED"
   },
   "bblayers.BitbakeLayers.test_bitbakelayers_showoverlayed": {
    "duration": 4.228,
    "status": "PASSED"
   },
   "bblayers.BitbakeLayers.test_bitbakelayers_showrecipes": {
    "duration": 30.098,
    "status": "PASSED"
   },
   "bblayers.BitbakeLayers.test_bitbakelayers_updatelayer": {
    "duration": 10.153,
    "status": "PASSED"
   },
   "bblayers.BitbakeLayers.test_validate_bitbake_setup_default_registry": {
    "duration": 2.846,
    "status": "PASSED"
   },
   "bblayers.BitbakeLayers.test_validate_examplelayersjson": {
    "duration": 0.3779,
    "status": "PASSED"
   },
   "bblock.BBLock.test_lock_architecture_specific": {
    "duration": 91.678,
    "status": "PASSED"
   },
   "bblock.BBLock.test_lock_multiple_recipe_single_task": {
    "duration": 820.922,
    "status": "PASSED"
   },
   "bblock.BBLock.test_lock_single_recipe_all_tasks": {
    "duration": 488.999,
    "status": "PASSED"
   },
   "bblock.BBLock.test_lock_single_recipe_multiple_tasks": {
    "duration": 154.369,
    "status": "PASSED"
   },
   "bblock.BBLock.test_lock_single_recipe_single_task": {
    "duration": 227.691,
    "status": "PASSED"
   },
   "bblogging.BitBakeLogging.test_python_exec_func_python_loggingA": {
    "duration": 42.195,
    "status": "PASSED"
   },
   "bblogging.BitBakeLogging.test_python_exec_func_python_loggingB": {
    "duration": 34.122,
    "status": "PASSED"
   },
   "bblogging.BitBakeLogging.test_python_exec_func_python_loggingC": {
    "duration": 29.84,
    "status": "PASSED"
   },
   "bblogging.BitBakeLogging.test_python_exec_func_python_loggingD": {
    "duration": 12.255,
    "status": "PASSED"
   },
   "bblogging.BitBakeLogging.test_python_exec_func_shell_loggingA": {
    "duration": 14.673,
    "status": "PASSED"
   },
   "bblogging.BitBakeLogging.test_python_exec_func_shell_loggingB": {
    "duration": 11.424,
    "status": "PASSED"
   },
   "bblogging.BitBakeLogging.test_python_exec_func_shell_loggingC": {
    "duration": 14.051,
    "status": "PASSED"
   },
   "bblogging.BitBakeLogging.test_python_exec_func_shell_loggingD": {
    "duration": 17.545,
    "status": "PASSED"
   },
   "bblogging.BitBakeLogging.test_python_exit_loggingA": {
    "duration": 12.853,
    "status": "PASSED"
   },
   "bblogging.BitBakeLogging.test_python_exit_loggingB": {
    "duration": 14.921,
    "status": "PASSED"
   },
   "bblogging.BitBakeLogging.test_python_exit_loggingC": {
    "duration": 13.08,
    "status": "PASSED"
   },
   "bblogging.BitBakeLogging.test_python_exit_loggingD": {
    "duration": 14.709,
    "status": "PASSED"
   },
   "bblogging.BitBakeLogging.test_python_fatal_loggingA": {
    "duration": 13.563,
    "status": "PASSED"
   },
   "bblogging.BitBakeLogging.test_python_fatal_loggingB": {
    "duration": 13.11,
    "status": "PASSED"
   },
   "bblogging.BitBakeLogging.test_python_fatal_loggingC": {
    "duration": 15.148,
    "status": "PASSED"
   },
   "bblogging.BitBakeLogging.test_python_fatal_loggingD": {
    "duration": 13.807,
    "status": "PASSED"
   },
   "bblogging.BitBakeLogging.test_shell_loggingA": {
    "duration": 13.35,
    "status": "PASSED"
   },
   "bblogging.BitBakeLogging.test_shell_loggingB": {
    "duration": 14.103,
    "status": "PASSED"
   },
   "bblogging.BitBakeLogging.test_shell_loggingC": {
    "duration": 14.865,
    "status": "PASSED"
   },
   "bblogging.BitBakeLogging.test_shell_loggingD": {
    "duration": 14.04,
    "status": "PASSED"
   },
   "bbtests.BitbakeTests.test_bb_env_bb_getvar_equality": {
    "duration": 2.947,
    "status": "PASSED"
   },
   "bbtests.BitbakeTests.test_bbappend_order": {
    "duration": 37.746,
    "status": "PASSED"
   },
   "bbtests.BitbakeTests.test_bitbake_g": {
    "duration": 7.284,
    "status": "PASSED"
   },
   "bbtests.BitbakeTests.test_bitbake_invalid_recipe": {
    "duration": 2.155,
    "status": "PASSED"
   },
   "bbtests.BitbakeTests.test_bitbake_invalid_target": {
    "duration": 6.919,
    "status": "PASSED"
   },
   "bbtests.BitbakeTests.test_checkuri": {
    "duration": 10.677,
    "status": "PASSED"
   },
   "bbtests.BitbakeTests.test_continue": {
    "duration": 39.048,
    "status": "PASSED"
   },
   "bbtests.BitbakeTests.test_dry_run": {
    "duration": 7.095,
    "status": "PASSED"
   },
   "bbtests.BitbakeTests.test_environment": {
    "duration": 3.229,
    "status": "PASSED"
   },
   "bbtests.BitbakeTests.test_event_handler": {
    "duration": 26.572,
    "status": "PASSED"
   },
   "bbtests.BitbakeTests.test_force_task_1": {
    "duration": 77.414,
    "status": "PASSED"
   },
   "bbtests.BitbakeTests.test_force_task_2": {
    "duration": 44.348,
    "status": "PASSED"
   },
   "bbtests.BitbakeTests.test_git_patchtool": {
    "duration": 23.016,
    "status": "PASSED"
   },
   "bbtests.BitbakeTests.test_git_patchtool2": {
    "duration": 27.241,
    "status": "PASSED"
   },
   "bbtests.BitbakeTests.test_git_unpack_nonetwork": {
    "duration": 41.457,
    "status": "PASSED"
   },
   "bbtests.BitbakeTests.test_git_unpack_nonetwork_fail": {
    "duration": 15.148,
    "status": "PASSED"
   },
   "bbtests.BitbakeTests.test_image_manifest": {
    "duration": 3340.032,
    "status": "PASSED"
   },
   "bbtests.BitbakeTests.test_invalid_patch": {
    "duration": 40.154,
    "status": "PASSED"
   },
   "bbtests.BitbakeTests.test_invalid_recipe_src_uri": {
    "duration": 4.016,
    "status": "PASSED"
   },
   "bbtests.BitbakeTests.test_just_parse": {
    "duration": 5.446,
    "status": "PASSED"
   },
   "bbtests.BitbakeTests.test_local_sstate": {
    "duration": 18.823,
    "status": "PASSED"
   },
   "bbtests.BitbakeTests.test_non_gplv3": {
    "duration": 455.027,
    "status": "PASSED"
   },
   "bbtests.BitbakeTests.test_postfile": {
    "duration": 2.646,
    "status": "PASSED"
   },
   "bbtests.BitbakeTests.test_prefile": {
    "duration": 7.358,
    "status": "PASSED"
   },
   "bbtests.BitbakeTests.test_rename_downloaded_file": {
    "duration": 26.653,
    "status": "PASSED"
   },
   "bbtests.BitbakeTests.test_run_bitbake_from_dir_1": {
    "duration": 2.819,
    "status": "PASSED"
   },
   "bbtests.BitbakeTests.test_run_bitbake_from_dir_2": {
    "duration": 1.908,
    "status": "PASSED"
   },
   "bbtests.BitbakeTests.test_run_bitbake_from_dir_3": {
    "duration": 2.108,
    "status": "PASSED"
   },
   "bbtests.BitbakeTests.test_setscene_only": {
    "duration": 21.892,
    "status": "PASSED"
   },
   "bbtests.BitbakeTests.test_skip_setscene": {
    "duration": 46.986,
    "status": "PASSED"
   },
   "bbtests.BitbakeTests.test_unexpanded_variable_in_path": {
    "duration": 26.357,
    "status": "PASSED"
   },
   "bbtests.BitbakeTests.test_version": {
    "duration": 4.373,
    "status": "PASSED"
   },
   "bbtests.BitbakeTests.test_warnings_errors": {
    "duration": 1.27,
    "status": "PASSED"
   },
   "buildhistory.BuildhistoryTests.test_buildhistory_basic": {
    "duration": 62.006,
    "status": "PASSED"
   },
   "buildhistory.BuildhistoryTests.test_buildhistory_buildtime_pr_backwards": {
    "duration": 73.197,
    "status": "PASSED"
   },
   "buildhistory.BuildhistoryTests.test_buildhistory_diff": {
    "duration": 82.699,
    "status": "PASSED"
   },
   "buildhistory.BuildhistoryTests.test_fileinfo": {
    "duration": 21.253,
    "status": "PASSED"
   },
   "buildoptions.ArchiverTest.test_arch_work_dir_and_export_source": {
    "duration": 44.332,
    "status": "PASSED"
   },
   "buildoptions.DiskMonTest.test_stoptask_behavior": {
    "duration": 101.611,
    "status": "PASSED"
   },
   "buildoptions.ImageOptionsTests.test_ccache_tool": {
    "duration": 116.35,
    "status": "PASSED"
   },
   "buildoptions.ImageOptionsTests.test_incremental_image_generation": {
    "duration": 3661.106,
    "status": "PASSED"
   },
   "buildoptions.ImageOptionsTests.test_read_only_image": {
    "duration": 374.592,
    "status": "PASSED"
   },
   "buildoptions.Poisoning.test_poisoning": {
    "duration": 39.494,
    "status": "PASSED"
   },
   "buildoptions.SanityOptionsTest.test_layer_without_git_dir": {
    "duration": 30.197,
    "status": "PASSED"
   },
   "buildoptions.SanityOptionsTest.test_options_warnqa_errorqa_switch": {
    "duration": 82.661,
    "status": "PASSED"
   },
   "buildoptions.ToolchainOptions.test_toolchain_fortran": {
    "duration": 2222.953,
    "status": "PASSED"
   },
   "c_cpp.CMakeTests.test_cmake_qemu": {
    "duration": 57.555,
    "status": "PASSED"
   },
   "c_cpp.CMakeTests.test_cmake_qemu_failing": {
    "duration": 41.881,
    "status": "PASSED"
   },
   "c_cpp.MesonTests.test_meson_qemu": {
    "duration": 48.767,
    "status": "PASSED"
   },
   "c_cpp.MesonTests.test_meson_qemu_failing": {
    "duration": 46.594,
    "status": "PASSED"
   },
   "containerimage.ContainerImageTests.test_expected_files": {
    "duration": 3703.377,
    "status": "PASSED"
   },
   "cve_check.CVECheck.test_convert_cve_version": {
    "duration": 0.007176,
    "status": "PASSED"
   },
   "cve_check.CVECheck.test_parse_cve_from_patch_contents": {
    "duration": 0.006656,
    "status": "PASSED"
   },
   "cve_check.CVECheck.test_parse_cve_from_patch_filename": {
    "duration": 0.006207,
    "status": "PASSED"
   },
   "cve_check.CVECheck.test_product_match": {
    "duration": 0.005964,
    "status": "PASSED"
   },
   "cve_check.CVECheck.test_version_compare": {
    "duration": 0.007756,
    "status": "PASSED"
   },
   "debuginfod.Debuginfod.test_debuginfod_native": {
    "duration": 64.492,
    "status": "PASSED"
   },
   "debuginfod.Debuginfod.test_debuginfod_qemu": {
    "duration": 3430.441,
    "oetags": [
     "runqemu"
    ],
    "status": "PASSED"
   },
   "devtool.DevtoolAddTests.test_devtool_add": {
    "duration": 101.067,
    "status": "PASSED"
   },
   "devtool.DevtoolAddTests.test_devtool_add_binary": {
    "duration": 76.395,
    "status": "PASSED"
   },
   "devtool.DevtoolAddTests.test_devtool_add_build_finish": {
    "duration": 115.781,
    "status": "PASSED"
   },
   "devtool.DevtoolAddTests.test_devtool_add_build_finish_force": {
    "duration": 113.001,
    "status": "PASSED"
   },
   "devtool.DevtoolAddTests.test_devtool_add_fetch": {
    "duration": 96.245,
    "status": "PASSED"
   },
   "devtool.DevtoolAddTests.test_devtool_add_fetch_git": {
    "duration": 93.927,
    "status": "PASSED"
   },
   "devtool.DevtoolAddTests.test_devtool_add_fetch_simple": {
    "duration": 43.706,
    "status": "PASSED"
   },
   "devtool.DevtoolAddTests.test_devtool_add_git_local": {
    "duration": 263.034,
    "status": "PASSED"
   },
   "devtool.DevtoolAddTests.test_devtool_add_git_style1": {
    "duration": 49.329,
    "status": "PASSED"
   },
   "devtool.DevtoolAddTests.test_devtool_add_git_style2": {
    "duration": 49.8,
    "status": "PASSED"
   },
   "devtool.DevtoolAddTests.test_devtool_add_library": {
    "duration": 75.736,
    "status": "PASSED"
   },
   "devtool.DevtoolAddTests.test_devtool_add_npm": {
    "duration": 2.123,
    "log": "Test needs meta-oe for nodejs\n",
    "status": "SKIPPED"
   },
   "devtool.DevtoolAddTests.test_devtool_add_python_egg_requires": {
    "duration": 36.848,
    "status": "PASSED"
   },
   "devtool.DevtoolBuildImageTests.test_devtool_build_image": {
    "duration": 3209.741,
    "status": "PASSED"
   },
   "devtool.DevtoolDeployTargetTests.test_devtool_deploy_target": {
    "duration": 483.587,
    "oetags": [
     "runqemu"
    ],
    "status": "PASSED"
   },
   "devtool.DevtoolDeployTargetTests.test_devtool_deploy_target_path": {
    "duration": 353.551,
    "oetags": [
     "runqemu"
    ],
    "status": "PASSED"
   },
   "devtool.DevtoolExtractTests.test_devtool_extract": {
    "duration": 61.434,
    "status": "PASSED"
   },
   "devtool.DevtoolExtractTests.test_devtool_extract_virtual": {
    "duration": 40.814,
    "status": "PASSED"
   },
   "devtool.DevtoolIdeSdkClangTests.test_devtool_ide_sdk_code_cmake": {
    "duration": 5824.233,
    "oetags": [
     "runqemu"
    ],
    "status": "PASSED"
   },
   "devtool.DevtoolIdeSdkClangTests.test_devtool_ide_sdk_code_meson": {
    "duration": 397.512,
    "oetags": [
     "runqemu"
    ],
    "status": "PASSED"
   },
   "devtool.DevtoolIdeSdkClangTests.test_devtool_ide_sdk_none_cmake": {
    "duration": 354.944,
    "oetags": [
     "runqemu"
    ],
    "status": "PASSED"
   },
   "devtool.DevtoolIdeSdkClangTests.test_devtool_ide_sdk_none_meson": {
    "duration": 357.397,
    "oetags": [
     "runqemu"
    ],
    "status": "PASSED"
   },
   "devtool.DevtoolIdeSdkGccTests.test_devtool_ide_sdk_code_cmake": {
    "duration": 3856.069,
    "oetags": [
     "runqemu"
    ],
    "status": "PASSED"
   },
   "devtool.DevtoolIdeSdkGccTests.test_devtool_ide_sdk_code_meson": {
    "duration": 286.5,
    "oetags": [
     "runqemu"
    ],
    "status": "PASSED"
   },
   "devtool.DevtoolIdeSdkGccTests.test_devtool_ide_sdk_code_nfs_debug_rootfs": {
    "duration": 217.563,
    "status": "PASSED"
   },
   "devtool.DevtoolIdeSdkGccTests.test_devtool_ide_sdk_none_nfs_qemu": {
    "duration": 324.506,
    "oetags": [
     "runqemu"
    ],
    "status": "PASSED"
   },
   "devtool.DevtoolIdeSdkGccTests.test_devtool_ide_sdk_none_nfs_qemu_slirp": {
    "duration": 329.797,
    "oetags": [
     "runqemu"
    ],
    "status": "PASSED"
   },
   "devtool.DevtoolIdeSdkGccTests.test_devtool_ide_sdk_none_qemu": {
    "duration": 402.964,
    "oetags": [
     "runqemu"
    ],
    "status": "PASSED"
   },
   "devtool.DevtoolIdeSdkGccTests.test_devtool_ide_sdk_none_qemu_slirp": {
    "duration": 229.788,
    "oetags": [
     "runqemu"
    ],
    "status": "PASSED"
   },
   "devtool.DevtoolIdeSdkKernelTests.test_devtool_ide_sdk_code_kernel_module": {
    "duration": 294.309,
    "oetags": [
     "runqemu"
    ],
    "status": "PASSED"
   },
   "devtool.DevtoolIdeSdkMiscTests.test_devtool_ide_sdk_plugins": {
    "duration": 95.142,
    "status": "PASSED"
   },
   "devtool.DevtoolIdeSdkSharedTests.test_devtool_ide_sdk_shared_sysroots": {
    "duration": 3528.373,
    "status": "PASSED"
   },
   "devtool.DevtoolModifyTests.test_devtool_buildclean": {
    "duration": 380.686,
    "status": "PASSED"
   },
   "devtool.DevtoolModifyTests.test_devtool_modify": {
    "duration": 196.609,
    "status": "PASSED"
   },
   "devtool.DevtoolModifyTests.test_devtool_modify_git": {
    "duration": 98.466,
    "status": "PASSED"
   },
   "devtool.DevtoolModifyTests.test_devtool_modify_git_crates_subpath": {
    "duration": 111.048,
    "status": "PASSED"
   },
   "devtool.DevtoolModifyTests.test_devtool_modify_git_no_extract": {
    "duration": 33.572,
    "status": "PASSED"
   },
   "devtool.DevtoolModifyTests.test_devtool_modify_go": {
    "duration": 61.504,
    "status": "PASSED"
   },
   "devtool.DevtoolModifyTests.test_devtool_modify_invalid": {
    "duration": 168.421,
    "status": "PASSED"
   },
   "devtool.DevtoolModifyTests.test_devtool_modify_kernel_cfg_subdirs": {
    "duration": 534.082,
    "status": "PASSED"
   },
   "devtool.DevtoolModifyTests.test_devtool_modify_localfiles": {
    "duration": 136.019,
    "status": "PASSED"
   },
   "devtool.DevtoolModifyTests.test_devtool_modify_localfiles_only": {
    "duration": 93.58,
    "status": "PASSED"
   },
   "devtool.DevtoolModifyTests.test_devtool_modify_multiple_sources": {
    "duration": 1372.104,
    "status": "PASSED"
   },
   "devtool.DevtoolModifyTests.test_devtool_modify_native": {
    "duration": 521.143,
    "status": "PASSED"
   },
   "devtool.DevtoolModifyTests.test_devtool_modify_nested_gitsm": {
    "duration": 56.59,
    "status": "PASSED"
   },
   "devtool.DevtoolModifyTests.test_devtool_modify_overrides": {
    "duration": 46.68,
    "status": "PASSED"
   },
   "devtool.DevtoolModifyTests.test_devtool_modify_virtual": {
    "duration": 45.728,
    "status": "PASSED"
   },
   "devtool.DevtoolResetTests.test_devtool_reset_all": {
    "duration": 218.376,
    "status": "PASSED"
   },
   "devtool.DevtoolResetTests.test_devtool_reset_re_plus_plus": {
    "duration": 42.399,
    "status": "PASSED"
   },
   "devtool.DevtoolTests.test_create_workspace": {
    "duration": 7.475,
    "status": "PASSED"
   },
   "devtool.DevtoolUpdateTests.test_devtool_finish_modify_git_subdir": {
    "duration": 129.695,
    "status": "PASSED"
   },
   "devtool.DevtoolUpdateTests.test_devtool_git_submodules": {
    "duration": 159.237,
    "status": "PASSED"
   },
   "devtool.DevtoolUpdateTests.test_devtool_update_recipe": {
    "duration": 65.758,
    "status": "PASSED"
   },
   "devtool.DevtoolUpdateTests.test_devtool_update_recipe_append": {
    "duration": 113.835,
    "status": "PASSED"
   },
   "devtool.DevtoolUpdateTests.test_devtool_update_recipe_append_git": {
    "duration": 112.335,
    "status": "PASSED"
   },
   "devtool.DevtoolUpdateTests.test_devtool_update_recipe_git": {
    "duration": 64.609,
    "status": "PASSED"
   },
   "devtool.DevtoolUpdateTests.test_devtool_update_recipe_gitsm": {
    "duration": 49.842,
    "status": "PASSED"
   },
   "devtool.DevtoolUpdateTests.test_devtool_update_recipe_local_files": {
    "duration": 128.518,
    "status": "PASSED"
   },
   "devtool.DevtoolUpdateTests.test_devtool_update_recipe_local_files_3": {
    "duration": 53.761,
    "status": "PASSED"
   },
   "devtool.DevtoolUpdateTests.test_devtool_update_recipe_local_files_subdir": {
    "duration": 48.655,
    "status": "PASSED"
   },
   "devtool.DevtoolUpdateTests.test_devtool_update_recipe_local_patch_gz": {
    "duration": 52.908,
    "status": "PASSED"
   },
   "devtool.DevtoolUpdateTests.test_devtool_update_recipe_long_filename": {
    "duration": 57.011,
    "status": "PASSED"
   },
   "devtool.DevtoolUpdateTests.test_devtool_update_recipe_with_gitignore": {
    "duration": 65.674,
    "status": "PASSED"
   },
   "devtool.DevtoolUpgradeTests.test_devtool_finish_modify_origlayer": {
    "duration": 97.352,
    "status": "PASSED"
   },
   "devtool.DevtoolUpgradeTests.test_devtool_finish_modify_otherlayer": {
    "duration": 69.69,
    "status": "PASSED"
   },
   "devtool.DevtoolUpgradeTests.test_devtool_finish_update_patch": {
    "duration": 74.622,
    "status": "PASSED"
   },
   "devtool.DevtoolUpgradeTests.test_devtool_finish_upgrade_origlayer": {
    "duration": 84.164,
    "status": "PASSED"
   },
   "devtool.DevtoolUpgradeTests.test_devtool_finish_upgrade_otherlayer": {
    "duration": 97.964,
    "status": "PASSED"
   },
   "devtool.DevtoolUpgradeTests.test_devtool_layer_plugins": {
    "duration": 3.541,
    "status": "PASSED"
   },
   "devtool.DevtoolUpgradeTests.test_devtool_load_plugin": {
    "duration": 44.307,
    "status": "PASSED"
   },
   "devtool.DevtoolUpgradeTests.test_devtool_rename": {
    "duration": 128.576,
    "status": "PASSED"
   },
   "devtool.DevtoolUpgradeTests.test_devtool_upgrade": {
    "duration": 88.697,
    "status": "PASSED"
   },
   "devtool.DevtoolUpgradeTests.test_devtool_upgrade_all_checksums": {
    "duration": 80.564,
    "status": "PASSED"
   },
   "devtool.DevtoolUpgradeTests.test_devtool_upgrade_drop_md5sum": {
    "duration": 80.428,
    "status": "PASSED"
   },
   "devtool.DevtoolUpgradeTests.test_devtool_upgrade_git": {
    "duration": 54.397,
    "status": "PASSED"
   },
   "devtool.DevtoolUpgradeTests.test_devtool_upgrade_gitsm": {
    "duration": 60.007,
    "status": "PASSED"
   },
   "devtool.DevtoolUpgradeTests.test_devtool_upgrade_recipe_upgrade_extra_tasks": {
    "duration": 89.164,
    "status": "PASSED"
   },
   "devtool.DevtoolUpgradeTests.test_devtool_virtual_kernel_modify": {
    "duration": 1824.97,
    "status": "PASSED"
   },
   "distrodata.Distrodata.test_checkpkg": {
    "duration": 0.0006778,
    "log": "Skip by the command line argument \"distrodata.Distrodata.test_checkpkg\"\n",
    "status": "SKIPPED"
   },
   "distrodata.Distrodata.test_common_include_recipes": {
    "duration": 66.239,
    "status": "PASSED"
   },
   "distrodata.Distrodata.test_maintainers": {
    "duration": 90.105,
    "status": "PASSED"
   },
   "efibootpartition.GenericEFITest.test_boot_efi": {
    "duration": 676.588,
    "status": "PASSED"
   },
   "esdk.oeSDKExtSelfTest.test_image_generation_binary_feeds": {
    "duration": 115.253,
    "status": "PASSED"
   },
   "esdk.oeSDKExtSelfTest.test_install_libraries_headers": {
    "duration": 47.775,
    "status": "PASSED"
   },
   "esdk.oeSDKExtSelfTest.test_sdk_install_assembles_the_shared_sysroot": {
    "duration": 91.144,
    "status": "PASSED"
   },
   "externalsrc.ExternalSrc.test_externalsrc_srctree_hash_files": {
    "duration": 37.934,
    "status": "PASSED"
   },
   "fetch.Dependencies.test_dependencies": {
    "duration": 27.133,
    "status": "PASSED"
   },
   "fetch.Fetch.test_git_mirrors": {
    "duration": 89.682,
    "status": "PASSED"
   },
   "fitimage.FitImagePyTests.test_fitimage_py_conf_extra_mappings_unused_error": {
    "duration": 0.006678,
    "status": "PASSED"
   },
   "fitimage.FitImagePyTests.test_fitimage_py_conf_loadables": {
    "duration": 0.007507,
    "status": "PASSED"
   },
   "fitimage.FitImagePyTests.test_fitimage_py_conf_mappings": {
    "duration": 0.007662,
    "status": "PASSED"
   },
   "fitimage.FitImagePyTests.test_fitimage_py_conf_mappings_unused_error": {
    "duration": 0.006787,
    "status": "PASSED"
   },
   "fitimage.FitImagePyTests.test_fitimage_py_conf_mappings_with_alias": {
    "duration": 0.006885,
    "status": "PASSED"
   },
   "fitimage.FitImagePyTests.test_fitimage_py_conf_os": {
    "duration": 0.006914,
    "status": "PASSED"
   },
   "fitimage.FitImagePyTests.test_fitimage_py_default": {
    "duration": 0.006475,
    "status": "PASSED"
   },
   "fitimage.FitImagePyTests.test_fitimage_py_default_dtb": {
    "duration": 0.006904,
    "status": "PASSED"
   },
   "fitimage.KernelFitImageRecipeTests.test_fit_image": {
    "duration": 162.651,
    "status": "PASSED"
   },
   "fitimage.KernelFitImageRecipeTests.test_fit_image_ext_dtb_dtbo": {
    "duration": 211.017,
    "status": "PASSED"
   },
   "fitimage.KernelFitImageRecipeTests.test_fit_image_sign_initramfs": {
    "duration": 209.583,
    "status": "PASSED"
   },
   "fitimage.KernelFitImageRecipeTests.test_fit_image_sign_initramfs_bundle": {
    "duration": 245.821,
    "status": "PASSED"
   },
   "fitimage.KernelFitImageRecipeTests.test_get_compatible_from_dtb": {
    "duration": 72.231,
    "status": "PASSED"
   },
   "fitimage.KernelFitImageRecipeTests.test_sign_fit_image_configurations": {
    "duration": 72.748,
    "status": "PASSED"
   },
   "fitimage.KernelFitImageRecipeTests.test_sign_fit_image_individual": {
    "duration": 68.767,
    "status": "PASSED"
   },
   "fitimage.KernelFitImageRecipeTests.test_vendored_dtb_with_kernel_dtbvendored": {
    "duration": 230.361,
    "status": "PASSED"
   },
   "fitimage.KernelFitImageRecipeTests.test_vendored_dtb_without_kernel_dtbvendored": {
    "duration": 57.668,
    "status": "PASSED"
   },
   "fitimage.UBootFitImageTests.test_sign_cascaded_uboot_fit_image": {
    "duration": 0.7544,
    "log": "MACHINE=qemux86-64 does not provide capability _cap_spl_dtb\n",
    "status": "SKIPPED"
   },
   "fitimage.UBootFitImageTests.test_sign_standalone_uboot_atf_tee_fit_image": {
    "duration": 0.7832,
    "log": "MACHINE=qemux86-64 does not provide capability _cap_spl_dtb\n",
    "status": "SKIPPED"
   },
   "fitimage.UBootFitImageTests.test_sign_standalone_uboot_fit_image": {
    "duration": 1.005,
    "log": "MACHINE=qemux86-64 does not provide capability _cap_spl_dtb\n",
    "status": "SKIPPED"
   },
   "fitimage.UBootFitImageTests.test_sign_uboot_fit_image_without_spl": {
    "duration": 186.035,
    "status": "PASSED"
   },
   "fitimage.UBootFitImageTests.test_sign_uboot_kernel_individual": {
    "duration": 96.932,
    "status": "PASSED"
   },
   "fitimage.UBootFitImageTests.test_uboot_atf_tee_fit_image": {
    "duration": 1.147,
    "log": "MACHINE=qemux86-64 does not provide capability _cap_atf_tee\n",
    "status": "SKIPPED"
   },
   "fitimage.UBootFitImageTests.test_uboot_fit_image": {
    "duration": 86.276,
    "status": "PASSED"
   },
   "gdbserver.GdbServerTest.test_gdb_server": {
    "duration": 140.223,
    "status": "PASSED"
   },
   "gitarchivetests.GitArchiveTests.test_create_first_test_tag": {
    "duration": 0.6474,
    "status": "PASSED"
   },
   "gitarchivetests.GitArchiveTests.test_create_second_test_tag": {
    "duration": 0.7884,
    "status": "PASSED"
   },
   "gitarchivetests.GitArchiveTests.test_get_revs_on_branch": {
    "duration": 0.4514,
    "status": "PASSED"
   },
   "gitarchivetests.GitArchiveTests.test_get_tags_with_only_local_tag": {
    "duration": 0.4227,
    "status": "PASSED"
   },
   "gitarchivetests.GitArchiveTests.test_get_tags_without_valid_remote": {
    "duration": 0.3844,
    "status": "PASSED"
   },
   "gitarchivetests.GitArchiveTests.test_get_tags_without_valid_remote_and_wrong_url": {
    "duration": 0.7275,
    "status": "PASSED"
   },
   "gotoolchain.oeGoToolchainSelfTest.test_go_dep_build": {
    "duration": 3.33,
    "status": "PASSED"
   },
   "govendor.GoVendorSrcUriTests.test_basic": {
    "duration": 0.005328,
    "status": "PASSED"
   },
   "govendor.GoVendorSrcUriTests.test_non_git_vcs": {
    "duration": 0.004916,
    "status": "PASSED"
   },
   "govendor.GoVendorSrcUriTests.test_path_override": {
    "duration": 0.004634,
    "status": "PASSED"
   },
   "govendor.GoVendorSrcUriTests.test_pathmajor": {
    "duration": 0.004582,
    "status": "PASSED"
   },
   "govendor.GoVendorSrcUriTests.test_replaces": {
    "duration": 0.004505,
    "status": "PASSED"
   },
   "govendor.GoVendorSrcUriTests.test_subdir": {
    "duration": 0.00448,
    "status": "PASSED"
   },
   "govendor.GoVendorTaskTests.test_do_compile_succeeds": {
    "duration": 19.767,
    "status": "PASSED"
   },
   "govendor.GoVendorTaskTests.test_external_dep_copied_to_vendor": {
    "duration": 0.007865,
    "status": "PASSED"
   },
   "govendor.GoVendorTaskTests.test_go_import_vendor_symlink": {
    "duration": 0.007406,
    "status": "PASSED"
   },
   "govendor.GoVendorTaskTests.test_local_replacement_symlink": {
    "duration": 0.008074,
    "status": "PASSED"
   },
   "govendor.GoVendorTaskTests.test_modules_txt_in_vendor": {
    "duration": 0.006629,
    "status": "PASSED"
   },
   "govendor.GoVendorTaskTests.test_pathmajor_falls_back_to_root": {
    "duration": 0.008745,
    "status": "PASSED"
   },
   "govendor.GoVendorTaskTests.test_test_files_excluded_from_vendor": {
    "duration": 0.007497,
    "status": "PASSED"
   },
   "image_typedep.ImageTypeDepTests.test_conversion_typedep_added": {
    "duration": 35.062,
    "status": "PASSED"
   },
   "imagefeatures.ImageFeatures.test_all_users_can_connect_via_ssh_without_password": {
    "duration": 237.493,
    "oetags": [
     "runqemu"
    ],
    "status": "PASSED"
   },
   "imagefeatures.ImageFeatures.test_bmap": {
    "duration": 60.36,
    "status": "PASSED"
   },
   "imagefeatures.ImageFeatures.test_empty_image": {
    "duration": 25.007,
    "status": "PASSED"
   },
   "imagefeatures.ImageFeatures.test_hypervisor_fmts": {
    "duration": 77.298,
    "status": "PASSED"
   },
   "imagefeatures.ImageFeatures.test_image_fstypes": {
    "duration": 130.555,
    "status": "PASSED"
   },
   "imagefeatures.ImageFeatures.test_image_gen_debugfs": {
    "duration": 85.861,
    "status": "PASSED"
   },
   "imagefeatures.ImageFeatures.test_long_chain_conversion": {
    "duration": 72.268,
    "status": "PASSED"
   },
   "imagefeatures.ImageFeatures.test_mandb": {
    "duration": 1581.173,
    "status": "PASSED"
   },
   "imagefeatures.ImageFeatures.test_no_busybox_base_utils": {
    "duration": 34.761,
    "status": "PASSED"
   },
   "imagefeatures.ImageFeatures.test_non_root_user_can_connect_via_ssh_without_password": {
    "duration": 91.956,
    "oetags": [
     "runqemu"
    ],
    "status": "PASSED"
   },
   "imagefeatures.ImageFeatures.test_useradd_static": {
    "duration": 499.782,
    "status": "PASSED"
   },
   "imagefeatures.ImageFeatures.test_wayland_support_in_image": {
    "duration": 134.936,
    "status": "PASSED"
   },
   "incompatible_lic.IncompatibleLicensePerImageTests.test_bash_and_license": {
    "duration": 128.413,
    "status": "PASSED"
   },
   "incompatible_lic.IncompatibleLicensePerImageTests.test_bash_default": {
    "duration": 52.821,
    "status": "PASSED"
   },
   "incompatible_lic.IncompatibleLicensePerImageTests.test_bash_license_exceptions": {
    "duration": 65.634,
    "status": "PASSED"
   },
   "incompatible_lic.IncompatibleLicensePerImageTests.test_bash_or_license": {
    "duration": 82.712,
    "status": "PASSED"
   },
   "incompatible_lic.IncompatibleLicensePerImageTests.test_spdx_exception": {
    "duration": 150.975,
    "status": "PASSED"
   },
   "incompatible_lic.IncompatibleLicenseTestObsolete.test_incompatible_alias_spdx_license": {
    "duration": 7.245,
    "status": "PASSED"
   },
   "incompatible_lic.IncompatibleLicenseTestObsolete.test_incompatible_alias_spdx_license_alias": {
    "duration": 6.393,
    "status": "PASSED"
   },
   "incompatible_lic.IncompatibleLicenseTestObsolete.test_incompatible_alias_spdx_license_alias_wildcard": {
    "duration": 6.701,
    "status": "PASSED"
   },
   "incompatible_lic.IncompatibleLicenseTestObsolete.test_incompatible_alias_spdx_license_wildcard": {
    "duration": 6.61,
    "status": "PASSED"
   },
   "incompatible_lic.IncompatibleLicenseTestObsolete.test_incompatible_all_licenses_wildcard": {
    "duration": 6.379,
    "status": "PASSED"
   },
   "incompatible_lic.IncompatibleLicenseTestObsolete.test_incompatible_spdx_license_alias_wildcard": {
    "duration": 6.546,
    "status": "PASSED"
   },
   "incompatible_lic.IncompatibleLicenseTestObsolete.test_incompatible_spdx_licenses_wildcard": {
    "duration": 8.081,
    "status": "PASSED"
   },
   "incompatible_lic.IncompatibleLicenseTests.test_incompatible_nonspdx_license": {
    "duration": 25.868,
    "status": "PASSED"
   },
   "incompatible_lic.IncompatibleLicenseTests.test_incompatible_spdx_license": {
    "duration": 29.14,
    "status": "PASSED"
   },
   "incompatible_lic.IncompatibleLicenseTests.test_incompatible_spdx_license_alias": {
    "duration": 5.804,
    "status": "PASSED"
   },
   "incompatible_lic.IncompatibleLicenseTests.test_incompatible_spdx_license_wildcard": {
    "duration": 26.221,
    "status": "PASSED"
   },
   "incompatible_lic.IncompatibleLicenseTests.test_incompatible_spdx_licenses": {
    "duration": 26.941,
    "status": "PASSED"
   },
   "incompatible_lic.NoGPL3InImagesTests.test_core_image_full_cmdline_weston": {
    "duration": 4086.846,
    "log": "testtools.testresult.real._StringException: Traceback (most recent call last):\n  File \"/srv/pokybuild/yocto-worker/oe-selftest-debian/build/layers/openembedded-core/meta/lib/oeqa/core/decorator/__init__.py\", line 35, in wrapped_f\n    return func(*args, **kwargs)\n           ^^^^^^^^^^^^^^^^^^^^^\n  File \"/srv/pokybuild/yocto-worker/oe-selftest-debian/build/layers/openembedded-core/meta/lib/oeqa/selftest/cases/incompatible_lic.py\", line 181, in test_core_image_full_cmdline_weston\n    bitbake('-c testimage core-image-full-cmdline core-image-weston')\n  File \"/srv/pokybuild/yocto-worker/oe-selftest-debian/build/layers/openembedded-core/meta/lib/oeqa/utils/commands.py\", line 236, in bitbake\n    return runCmd(cmd, ignore_status, timeout, output_log=output_log, **options)\n           ^^^^^^^^^^^^^^^^^^^^^^^^^^^^^^^^^^^^^^^^^^^^^^^^^^^^^^^^^^^^^^^^^^^^^\n  File \"/srv/pokybuild/yocto-worker/oe-selftest-debian/build/layers/openembedded-core/meta/lib/oeqa/utils/commands.py\", line 214, in runCmd\n    raise AssertionError(\"Command '%s' returned non-zero exit status %d:\\n%s\" % (command, result.status, exc_output))\nAssertionError: Command 'bitbake  -c testimage core-image-full-cmdline core-image-weston' returned non-zero exit status 1:\nNOTE: Reconnecting to bitbake server...\nLoading cache...done.\nLoaded 2101 entries from dependency cache.\nNOTE: Resolving any missing task queue dependencies\n\nBuild Configuration:\nBB_VERSION           = \"2.19.1\"\nBUILD_SYS            = \"x86_64-linux\"\nNATIVELSBSTRING      = \"universal\"\nTARGET_SYS           = \"x86_64-poky-linux\"\nMACHINE              = \"qemux86-64\"\nSDKMACHINE           = \"x86_64\"\nDISTRO               = \"poky\"\nDISTRO_VERSION       = \"6.0.99+snapshot-fee85dccc1c49058c7db895f913af8fe43416efa\"\nTUNE_FEATURES        = \"m64 x86-64-v3\"\nmeta                 = \"master-next:fee85dccc1c49058c7db895f913af8fe43416efa\"\nmeta-yocto-bsp       \nmeta-poky            = \"master:7e41504cd63b099b214f10d92cfdaf358ab98c5f\"\nmeta-selftest        = \"master:f402ff178e7bb76b8139d61e35edf9190d8fae08\"\n\nInitialising tasks...Sstate summary: Wanted 145 Local 145 Mirrors 0 Missed 0 Current 300 (100% match, 100% complete)\ndone.\nNOTE: Executing Tasks\nNOTE: Setscene tasks completed\nNOTE: Running task 1527 of 1528 (/srv/pokybuild/yocto-worker/oe-selftest-debian/build/layers/openembedded-core/meta/recipes-graphics/images/core-image-weston.bb:do_testimage)\nNOTE: Running task 1528 of 1528 (/srv/pokybuild/yocto-worker/oe-selftest-debian/build/layers/openembedded-core/meta/recipes-extended/images/core-image-full-cmdline.bb:do_testimage)\nNOTE: recipe core-image-weston-1.0-r0: task do_testimage: Started\nNOTE: recipe core-image-full-cmdline-1.0-r0: task do_testimage: Started\nQMP Available for connection at /srv/pokybuild/yocto-worker/oe-selftest-debian/build/build-st-1585391/tmp/.ae30lr5r\nQMP Available for connection at /srv/pokybuild/yocto-worker/oe-selftest-debian/build/build-st-1585391/tmp/.qwqeknar\nQMP connected to QEMU at 09/13/26 11:28:47 and took 1.10 seconds\nQMP released QEMU at 09/13/26 11:28:47 and took 0.16 seconds from connect\nQMP connected to QEMU at 09/13/26 11:28:48 and took 2.12 seconds\nQMP released QEMU at 09/13/26 11:28:48 and took 0.10 seconds from connect\nTest requires apt to be installed\nTest requires autoconf to be installed\nTest requires gtk+3 to be installed\nTest requires autoconf to be installed\nTest requires connman to be installed\nTest case connman.ConnmanTest.test_connmand_running depends on connman.ConnmanTest.test_connmand_help but it didn't pass/run.\nTest requires apt to be installed\nTest requires dnf to be installed\nTest case dnf.DnfBasicTest.test_dnf_history depends on dnf.DnfBasicTest.test_dnf_help but it didn't pass/run.\nTest case dnf.DnfBasicTest.test_dnf_info depends on dnf.DnfBasicTest.test_dnf_help but it didn't pass/run.\nTest case dnf.DnfBasicTest.test_dnf_search depends on dnf.DnfBasicTest.test_dnf_help but it didn't pass/run.\nTest case dnf.DnfBasicTest.test_dnf_version depends on dnf.DnfBasicTest.test_dnf_help but it didn't pass/run.\nTest case dnf.DnfRepoTest.test_dnf_makecache depends on dnf.DnfBasicTest.test_dnf_help but it didn't pass/run.\nTest case dnf.DnfRepoTest.test_dnf_exclude depends on dnf.DnfRepoTest.test_dnf_makecache but it didn't pass/run.\nTest case dnf.DnfRepoTest.test_dnf_install depends on dnf.DnfRepoTest.test_dnf_makecache but it didn't pass/run.\nTest case dnf.DnfRepoTest.test_dnf_install_dependency depends on dnf.DnfRepoTest.test_dnf_install but it didn't pass/run.\nTest case dnf.DnfRepoTest.test_dnf_install_from_disk depends on dnf.DnfRepoTest.test_dnf_install_dependency but it didn't pass/run.\nTest case dnf.DnfRepoTest.test_dnf_install_from_http depends on dnf.DnfRepoTest.test_dnf_install_from_disk but it didn't pass/run.\nTest case dnf.DnfRepoTest.test_dnf_installroot depends on dnf.DnfRepoTest.test_dnf_makecache but it didn't pass/run.\nTest run when enable usrmerge\nTest case dnf.DnfRepoTest.test_dnf_reinstall depends on dnf.DnfRepoTest.test_dnf_install but it didn't pass/run.\nTest case dnf.DnfRepoTest.test_dnf_repoinfo depends on dnf.DnfRepoTest.test_dnf_makecache but it didn't pass/run.\nTest requires gcc to be installed\nTest requires g++ to be installed\nTest requires g++ to be installed\nTest requires make to be installed\nTest requires python3-pygobject to be installed\nTest requires cgo-helloworld to be installed\nTest requires go-runtime-dev to be installed\nTest requires go-runtime-dev to be installed\nTest requires go-helloworld to be installed\nTest requires gcc to be installed\nTest requires ldd to be installed\nTest requires logrotate to be installed\nTest case logrotate.LogrotateTest.test_logrotate_newlog depends on logrotate.LogrotateTest.test_logrotate_wtmp but it didn't pass/run.\nTest requires autoconf to be installed\nTest requires gtk+3 to be installed\nTest requires autoconf to be installed\nTest requires connman to be installed\nTest case connman.ConnmanTest.test_connmand_running depends on connman.ConnmanTest.test_connmand_help but it didn't pass/run.\nTest requires dnf to be installed\nTest case dnf.DnfBasicTest.test_dnf_history depends on dnf.DnfBasicTest.test_dnf_help but it didn't pass/run.\nTest case dnf.DnfBasicTest.test_dnf_info depends on dnf.DnfBasicTest.test_dnf_help but it didn't pass/run.\nTest case dnf.DnfBasicTest.test_dnf_search depends on dnf.DnfBasicTest.test_dnf_help but it didn't pass/run.\nTest case dnf.DnfBasicTest.test_dnf_version depends on dnf.DnfBasicTest.test_dnf_help but it didn't pass/run.\nTest case dnf.DnfRepoTest.test_dnf_makecache depends on dnf.DnfBasicTest.test_dnf_help but it didn't pass/run.\nTest case dnf.DnfRepoTest.test_dnf_exclude depends on dnf.DnfRepoTest.test_dnf_makecache but it didn't pass/run.\nTest case dnf.DnfRepoTest.test_dnf_install depends on dnf.DnfRepoTest.test_dnf_makecache but it didn't pass/run.\nTest case dnf.DnfRepoTest.test_dnf_install_dependency depends on dnf.DnfRepoTest.test_dnf_install but it didn't pass/run.\nTest case dnf.DnfRepoTest.test_dnf_install_from_disk depends on dnf.DnfRepoTest.test_dnf_install_dependency but it didn't pass/run.\nTest case dnf.DnfRepoTest.test_dnf_install_from_http depends on dnf.DnfRepoTest.test_dnf_install_from_disk but it didn't pass/run.\nTest case dnf.DnfRepoTest.test_dnf_installroot depends on dnf.DnfRepoTest.test_dnf_makecache but it didn't pass/run.\nTest run when enable usrmerge\nTest case dnf.DnfRepoTest.test_dnf_reinstall depends on dnf.DnfRepoTest.test_dnf_install but it didn't pass/run.\nTest case dnf.DnfRepoTest.test_dnf_repoinfo depends on dnf.DnfRepoTest.test_dnf_makecache but it didn't pass/run.\nTest requires gcc to be installed\nTest requires g++ to be installed\nTest requires g++ to be installed\nTest requires make to be installed\nTest requires python3-pygobject to be installed\nTest requires cgo-helloworld to be installed\nTest requires go-runtime-dev to be installed\nTest requires go-runtime-dev to be installed\nTest requires go-helloworld to be installed\nTest requires gcc to be installed\nTest requires ldd to be installed\nNo syslog found to restart, ignoring\nTest requires busybox-syslog to be installed\nTest requires opkg to be installed\nTest requires pam to be in DISTRO_FEATURES\nTraceback (most recent call last):\n  File \"/srv/pokybuild/yocto-worker/oe-selftest-debian/build/layers/openembedded-core/meta/lib/oeqa/core/decorator/__init__.py\", line 35, in wrapped_f\n    return func(*args, **kwargs)\n           ^^^^^^^^^^^^^^^^^^^^^\n  File \"/srv/pokybuild/yocto-worker/oe-selftest-debian/build/layers/openembedded-core/meta/lib/oeqa/runtime/cases/parselogs.py\", line 185, in test_parselogs\n    self.assertEqual(errcount, 0, msg=self.msg)\nAssertionError: 6 != 0 : Log: /srv/pokybuild/yocto-worker/oe-selftest-debian/build/build-st-1585391/tmp/work/qemux86_64-poky-linux/core-image-full-cmdline/1.0/target_logs/kern.log\n-----------------------\nCentral error: Sep 13 11:28:59 qemux86-64 kernel: ------------[ cut here ]------------\n***********************\nSep 13 11:28:50 qemux86-64 kernel:   with environment:\nSep 13 11:28:50 qemux86-64 kernel:     HOME=/\nSep 13 11:28:50 qemux86-64 kernel:     TERM=linux\nSep 13 11:28:50 qemux86-64 kernel: usb 1-2: new high-speed USB device number 3 using ehci-pci\nSep 13 11:28:50 qemux86-64 kernel: input: QEMU QEMU USB Keyboard as /devices/pci0000:00/0000:00:1d.7/usb1/1-2/1-2:1.0/0003:0627:0001.0002/input/input2\nSep 13 11:28:50 qemux86-64 kernel: hid-generic 0003:0627:0001.0002: input: USB HID v1.11 Keyboard [QEMU QEMU USB Keyboard] on usb-0000:00:1d.7-2/input0\nSep 13 11:28:50 qemux86-64 kernel: EXT4-fs (vda): re-mounted 7310fe5b-1400-4914-be14-6b48155223bd.\nSep 13 11:28:53 qemux86-64 kernel: NFSD: Unable to initialize client recovery tracking! (-110)\nSep 13 11:28:53 qemux86-64 kernel: NFSD: Is nfsdcld running? If not, enable CONFIG_NFSD_LEGACY_CLIENT_TRACKING.\nSep 13 11:28:53 qemux86-64 kernel: NFSD: starting 90-second grace period (net effffff9)\nSep 13 11:28:59 qemux86-64 kernel: ------------[ cut here ]------------\nSep 13 11:28:59 qemux86-64 kernel: bochs-drm 0000:00:01.0: [drm] vblank wait timed out on crtc 0\nSep 13 11:28:59 qemux86-64 kernel: WARNING: /usr/src/kernel/drivers/gpu/drm/drm_vblank.c:1329 at drm_crtc_wait_one_vblank+0x1a5/0x230, CPU#3: kworker/3:1/49\nSep 13 11:28:59 qemux86-64 kernel: Modules linked in: nfsd\nSep 13 11:28:59 qemux86-64 kernel: CPU: 3 UID: 0 PID: 49 Comm: kworker/3:1 Not tainted 7.2.4-yocto-standard #1 PREEMPT(full) \nSep 13 11:28:59 qemux86-64 kernel: Hardware name: QEMU Standard PC (Q35 + ICH9, 2009), BIOS rel-1.17.0-0-gb52ca86e094d-prebuilt.qemu.org 04/01/2014\nSep 13 11:28:59 qemux86-64 kernel: Workqueue: events drm_fb_helper_damage_work\nSep 13 11:28:59 qemux86-64 kernel: RIP: 0010:drm_crtc_wait_one_vblank+0x1ae/0x230\nSep 13 11:28:59 qemux86-64 kernel: Code: e8 37 1e 07 00 48 8b 7b 08 4c 8b 67 50 4d 85 e4 75 03 4c 8b 27 e8 22 1e 07 00 48 8d 3d 1b 95 2c 01 44 89 e9 4c 89 e2 48 89 c6 <67> 48 0f b9 3a 44 89 ee 48 89 df 41 be 92 ff ff ff e8 7c fc ff ff\nSep 13 11:28:59 qemux86-64 kernel: RSP: 0018:ffffa9f9401b7d08 EFLAGS: 00010286\nSep 13 11:28:59 qemux86-64 kernel: RAX: ffffffff93195de4 RBX: ffff8a0941912000 RCX: 0000000000000000\n\n***********************\nCentral error: Sep 13 11:29:00 qemux86-64 kernel: ------------[ cut here ]------------\n***********************\nSep 13 11:28:59 qemux86-64 kernel:  worker_thread+0x1a1/0x320\nSep 13 11:28:59 qemux86-64 kernel:  ? __pfx_worker_thread+0x10/0x10\nSep 13 11:28:59 qemux86-64 last message buffered 1 times\nSep 13 11:28:59 qemux86-64 kernel:  kthread+0xfc/0x140\nSep 13 11:28:59 qemux86-64 kernel:  ? __pfx_kthread+0x10/0x10\nSep 13 11:28:59 qemux86-64 kernel:  ret_from_fork+0x12c/0x210\nSep 13 11:28:59 qemux86-64 kernel:  ? __pfx_kthread+0x10/0x10\nSep 13 11:28:59 qemux86-64 kernel:  ret_from_fork_asm+0x1a/0x30\nSep 13 11:28:59 qemux86-64 kernel:  </TASK>\nSep 13 11:28:59 qemux86-64 kernel: ---[ end trace 0000000000000000 ]---\nSep 13 11:29:00 qemux86-64 kernel: ------------[ cut here ]------------\nSep 13 11:29:00 qemux86-64 kernel: [CRTC:37:crtc-0] vblank wait timed out\nSep 13 11:29:00 qemux86-64 kernel: WARNING: /usr/src/kernel/drivers/gpu/drm/drm_atomic_helper.c:1921 at drm_atomic_helper_wait_for_vblanks.part.0+0x215/0x240, CPU#3: kworker/3:1/49\nSep 13 11:29:00 qemux86-64 kernel: Modules linked in: nfsd\nSep 13 11:29:00 qemux86-64 kernel: CPU: 3 UID: 0 PID: 49 Comm: kworker/3:1 Tainted: G        W           7.2.4-yocto-standard #1 PREEMPT(full) \nSep 13 11:29:00 qemux86-64 kernel: Tainted: [W]=WARN\nSep 13 11:29:00 qemux86-64 kernel: Hardware name: QEMU Standard PC (Q35 + ICH9, 2009), BIOS rel-1.17.0-0-gb52ca86e094d-prebuilt.qemu.org 04/01/2014\nSep 13 11:29:00 qemux86-64 kernel: Workqueue: events drm_fb_helper_damage_work\nSep 13 11:29:00 qemux86-64 kernel: RIP: 0010:drm_atomic_helper_wait_for_vblanks.part.0+0x21d/0x240\nSep 13 11:29:00 qemux86-64 kernel: Code: ff 84 c0 74 88 48 8b 7d 98 48 8d 75 a8 e8 1b 3f 5a ff 45 85 ed 0f 85 f0 fe ff ff 48 8d 3d bb a0 2b 01 49 8b 57 20 41 8b 77 58 <67> 48 0f b9 3a e9 d7 fe ff ff 48 89 5d d8 4c 89 65 e0 4c 89 6d e8\nSep 13 11:29:00 qemux86-64 kernel: RSP: 0018:ffffa9f9401b7b88 EFLAGS: 00010246\n\n***********************\nCentral error: Sep 13 11:29:01 qemux86-64 kernel: ------------[ cut here ]------------\n***********************\nSep 13 11:29:00 qemux86-64 kernel:  worker_thread+0x1a1/0x320\nSep 13 11:29:00 qemux86-64 kernel:  ? __pfx_worker_thread+0x10/0x10\nSep 13 11:29:00 qemux86-64 last message buffered 1 times\nSep 13 11:29:00 qemux86-64 kernel:  kthread+0xfc/0x140\nSep 13 11:29:00 qemux86-64 kernel:  ? __pfx_kthread+0x10/0x10\nSep 13 11:29:00 qemux86-64 kernel:  ret_from_fork+0x12c/0x210\nSep 13 11:29:00 qemux86-64 kernel:  ? __pfx_kthread+0x10/0x10\nSep 13 11:29:00 qemux86-64 kernel:  ret_from_fork_asm+0x1a/0x30\nSep 13 11:29:00 qemux86-64 kernel:  </TASK>\nSep 13 11:29:00 qemux86-64 kernel: ---[ end trace 0000000000000000 ]---\nSep 13 11:29:01 qemux86-64 kernel: ------------[ cut here ]------------\nSep 13 11:29:01 qemux86-64 kernel: bochs-drm 0000:00:01.0: [drm] vblank wait timed out on crtc 0\nSep 13 11:29:01 qemux86-64 kernel: WARNING: /usr/src/kernel/drivers/gpu/drm/drm_vblank.c:1329 at drm_crtc_wait_one_vblank+0x1a5/0x230, CPU#3: kworker/3:1/49\nSep 13 11:29:01 qemux86-64 kernel: Modules linked in: nfsd\nSep 13 11:29:01 qemux86-64 kernel: CPU: 3 UID: 0 PID: 49 Comm: kworker/3:1 Tainted: G        W           7.2.4-yocto-standard #1 PREEMPT(full) \nSep 13 11:29:01 qemux86-64 kernel: Tainted: [W]=WARN\nSep 13 11:29:01 qemux86-64 kernel: Hardware name: QEMU Standard PC (Q35 + ICH9, 2009), BIOS rel-1.17.0-0-gb52ca86e094d-prebuilt.qemu.org 04/01/2014\nSep 13 11:29:01 qemux86-64 kernel: Workqueue: events drm_fb_helper_damage_work\nSep 13 11:29:01 qemux86-64 kernel: RIP: 0010:drm_crtc_wait_one_vblank+0x1ae/0x230\nSep 13 11:29:01 qemux86-64 kernel: Code: e8 37 1e 07 00 48 8b 7b 08 4c 8b 67 50 4d 85 e4 75 03 4c 8b 27 e8 22 1e 07 00 48 8d 3d 1b 95 2c 01 44 89 e9 4c 89 e2 48 89 c6 <67> 48 0f b9 3a 44 89 ee 48 89 df 41 be 92 ff ff ff e8 7c fc ff ff\nSep 13 11:29:01 qemux86-64 kernel: RSP: 0018:ffffa9f9401b7d08 EFLAGS: 00010286\n\n***********************\nLog: /srv/pokybuild/yocto-worker/oe-selftest-debian/build/build-st-1585391/tmp/work/qemux86_64-poky-linux/core-image-full-cmdline/1.0/target_logs/dmesg_output.log\n-----------------------\nCentral error: [   11.095211] ------------[ cut here ]------------\n***********************\n[    2.125114]     TERM=linux\n[    2.189213] usb 1-2: new high-speed USB device number 3 using ehci-pci\n[    2.351654] input: QEMU QEMU USB Keyboard as /devices/pci0000:00/0000:00:1d.7/usb1/1-2/1-2:1.0/0003:0627:0001.0002/input/input2\n[    2.372909] udevd[153]: starting version 3.2.14\n[    2.383496] udevd[154]: starting eudev-3.2.14\n[    2.525406] hid-generic 0003:0627:0001.0002: input: USB HID v1.11 Keyboard [QEMU QEMU USB Keyboard] on usb-0000:00:1d.7-2/input0\n[    2.764922] EXT4-fs (vda): re-mounted 7310fe5b-1400-4914-be14-6b48155223bd.\n[    5.586140] NFSD: Unable to initialize client recovery tracking! (-110)\n[    5.588077] NFSD: Is nfsdcld running? If not, enable CONFIG_NFSD_LEGACY_CLIENT_TRACKING.\n[    5.591865] NFSD: starting 90-second grace period (net effffff9)\n[   11.095211] ------------[ cut here ]------------\n[   11.095217] bochs-drm 0000:00:01.0: [drm] vblank wait timed out on crtc 0\n[   11.095221] WARNING: /usr/src/kernel/drivers/gpu/drm/drm_vblank.c:1329 at drm_crtc_wait_one_vblank+0x1a5/0x230, CPU#3: kworker/3:1/49\n[   11.095272] Modules linked in: nfsd\n[   11.095281] CPU: 3 UID: 0 PID: 49 Comm: kworker/3:1 Not tainted 7.2.4-yocto-standard #1 PREEMPT(full) \n[   11.095284] Hardware name: QEMU Standard PC (Q35 + ICH9, 2009), BIOS rel-1.17.0-0-gb52ca86e094d-prebuilt.qemu.org 04/01/2014\n[   11.095287] Workqueue: events drm_fb_helper_damage_work\n[   11.095301] RIP: 0010:drm_crtc_wait_one_vblank+0x1ae/0x230\n[   11.095304] Code: e8 37 1e 07 00 48 8b 7b 08 4c 8b 67 50 4d 85 e4 75 03 4c 8b 27 e8 22 1e 07 00 48 8d 3d 1b 95 2c 01 44 89 e9 4c 89 e2 48 89 c6 <67> 48 0f b9 3a 44 89 ee 48 89 df 41 be 92 ff ff ff e8 7c fc ff ff\n[   11.095306] RSP: 0018:ffffa9f9401b7d08 EFLAGS: 00010286\n[   11.095308] RAX: ffffffff93195de4 RBX: ffff8a0941912000 RCX: 0000000000000000\n\n***********************\nCentral error: [   12.119215] ------------[ cut here ]------------\n***********************\n[   11.095385]  worker_thread+0x1a1/0x320\n[   11.095387]  ? __pfx_worker_thread+0x10/0x10\n[   11.095388]  ? __pfx_worker_thread+0x10/0x10\n[   11.095390]  kthread+0xfc/0x140\n[   11.095397]  ? __pfx_kthread+0x10/0x10\n[   11.095399]  ret_from_fork+0x12c/0x210\n[   11.095411]  ? __pfx_kthread+0x10/0x10\n[   11.095414]  ret_from_fork_asm+0x1a/0x30\n[   11.095421]  </TASK>\n[   11.095422] ---[ end trace 0000000000000000 ]---\n[   12.119215] ------------[ cut here ]------------\n[   12.119221] [CRTC:37:crtc-0] vblank wait timed out\n[   12.119223] WARNING: /usr/src/kernel/drivers/gpu/drm/drm_atomic_helper.c:1921 at drm_atomic_helper_wait_for_vblanks.part.0+0x215/0x240, CPU#3: kworker/3:1/49\n[   12.119240] Modules linked in: nfsd\n[   12.119248] CPU: 3 UID: 0 PID: 49 Comm: kworker/3:1 Tainted: G        W           7.2.4-yocto-standard #1 PREEMPT(full) \n[   12.119252] Tainted: [W]=WARN\n[   12.119253] Hardware name: QEMU Standard PC (Q35 + ICH9, 2009), BIOS rel-1.17.0-0-gb52ca86e094d-prebuilt.qemu.org 04/01/2014\n[   12.119256] Workqueue: events drm_fb_helper_damage_work\n[   12.119260] RIP: 0010:drm_atomic_helper_wait_for_vblanks.part.0+0x21d/0x240\n[   12.119263] Code: ff 84 c0 74 88 48 8b 7d 98 48 8d 75 a8 e8 1b 3f 5a ff 45 85 ed 0f 85 f0 fe ff ff 48 8d 3d bb a0 2b 01 49 8b 57 20 41 8b 77 58 <67> 48 0f b9 3a e9 d7 fe ff ff 48 89 5d d8 4c 89 65 e0 4c 89 6d e8\n[   12.119265] RSP: 0018:ffffa9f9401b7b88 EFLAGS: 00010246\n\n***********************\nCentral error: [   13.143213] ------------[ cut here ]------------\n***********************\n[   12.119336]  worker_thread+0x1a1/0x320\n[   12.119338]  ? __pfx_worker_thread+0x10/0x10\n[   12.119340]  ? __pfx_worker_thread+0x10/0x10\n[   12.119342]  kthread+0xfc/0x140\n[   12.119345]  ? __pfx_kthread+0x10/0x10\n[   12.119347]  ret_from_fork+0x12c/0x210\n[   12.119350]  ? __pfx_kthread+0x10/0x10\n[   12.119353]  ret_from_fork_asm+0x1a/0x30\n[   12.119357]  </TASK>\n[   12.119358] ---[ end trace 0000000000000000 ]---\n[   13.143213] ------------[ cut here ]------------\n[   13.143219] bochs-drm 0000:00:01.0: [drm] vblank wait timed out on crtc 0\n[   13.143222] WARNING: /usr/src/kernel/drivers/gpu/drm/drm_vblank.c:1329 at drm_crtc_wait_one_vblank+0x1a5/0x230, CPU#3: kworker/3:1/49\n[   13.143233] Modules linked in: nfsd\n[   13.143239] CPU: 3 UID: 0 PID: 49 Comm: kworker/3:1 Tainted: G        W           7.2.4-yocto-standard #1 PREEMPT(full) \n[   13.143243] Tainted: [W]=WARN\n[   13.143244] Hardware name: QEMU Standard PC (Q35 + ICH9, 2009), BIOS rel-1.17.0-0-gb52ca86e094d-prebuilt.qemu.org 04/01/2014\n[   13.143247] Workqueue: events drm_fb_helper_damage_work\n[   13.143252] RIP: 0010:drm_crtc_wait_one_vblank+0x1ae/0x230\n[   13.143255] Code: e8 37 1e 07 00 48 8b 7b 08 4c 8b 67 50 4d 85 e4 75 03 4c 8b 27 e8 22 1e 07 00 48 8d 3d 1b 95 2c 01 44 89 e9 4c 89 e2 48 89 c6 <67> 48 0f b9 3a 44 89 ee 48 89 df 41 be 92 ff ff ff e8 7c fc ff ff\n[   13.143257] RSP: 0018:ffffa9f9401b7d08 EFLAGS: 00010286\n\n***********************\n6 errors found in logs.\n\nTest requires perl to be installed\nTest requires ptest-runner to be installed\nTest requires ptest-runner to be installed\nTest requires python3-core to be installed\nTest requires opkg to be installed\nTest requires pam to be in DISTRO_FEATURES\nNo /var/lib/rpm on target\nTest case rpm.RpmBasicTest.test_rpm_query_nonroot depends on rpm.RpmBasicTest.test_rpm_query but it didn't pass/run.\nTest case rpm.RpmInstallRemoveTest.test_rpm_install depends on rpm.RpmBasicTest.test_rpm_query but it didn't pass/run.\nTest case rpm.RpmInstallRemoveTest.test_rpm_remove depends on rpm.RpmInstallRemoveTest.test_rpm_install but it didn't pass/run.\nTest case rpm.RpmInstallRemoveTest.test_check_rpm_install_removal_log_file_size depends on rpm.RpmInstallRemoveTest.test_rpm_remove but it didn't pass/run.\nTest requires rust-c-lib-example-bin to be installed\nTest requires cargo to be installed\nTest requires rust to be installed\nTest requires kernel-devsrc to be installed\nsystemd is not the init manager for this image\nTest case systemd.SystemdBasicTests.test_systemd_failed depends on systemd.SystemdBasicTests.test_systemd_basic but it didn't pass/run.\nTest case systemd.SystemdBasicTests.test_systemd_list depends on systemd.SystemdBasicTests.test_systemd_basic but it didn't pass/run.\nTest case systemd.SystemdJournalTests.test_systemd_boot_time depends on systemd.SystemdBasicTests.test_systemd_basic but it didn't pass/run.\nTest case systemd.SystemdJournalTests.test_systemd_journal depends on systemd.SystemdBasicTests.test_systemd_basic but it didn't pass/run.\nTest requires minidebuginfo to be in DISTRO_FEATURES\nTest case systemd.SystemdServiceTests.test_systemd_status depends on systemd.SystemdBasicTests.test_systemd_basic but it didn't pass/run.\nTest case systemd.SystemdServiceTests.test_systemd_disable_enable depends on systemd.SystemdServiceTests.test_systemd_status but it didn't pass/run.\nTest is only meant to run with read-only-rootfs in IMAGE_FEATURES\nTest case systemd.SystemdServiceTests.test_systemd_stop_start depends on systemd.SystemdServiceTests.test_systemd_status but it didn't pass/run.\nTest requires wayland-utils to be installed\nTest requires weston to be installed\nTest requires weston to be installed\nTest requires weston to be installed\nTest requires xserver-nodm-init to be installed\nTest requires perl to be installed\nTest requires ptest-runner to be installed\nTest requires ptest-runner to be installed\nTest requires python3-core to be installed\nNo /var/lib/rpm on target\nTest case rpm.RpmBasicTest.test_rpm_query_nonroot depends on rpm.RpmBasicTest.test_rpm_query but it didn't pass/run.\nTest case rpm.RpmInstallRemoveTest.test_rpm_install depends on rpm.RpmBasicTest.test_rpm_query but it didn't pass/run.\nTest case rpm.RpmInstallRemoveTest.test_rpm_remove depends on rpm.RpmInstallRemoveTest.test_rpm_install but it didn't pass/run.\nTest case rpm.RpmInstallRemoveTest.test_check_rpm_install_removal_log_file_size depends on rpm.RpmInstallRemoveTest.test_rpm_remove but it didn't pass/run.\nTest requires rust-c-lib-example-bin to be installed\nTest requires openssh-scp to be installed\nTest requires openssh-scp to be installed\nTest requires kernel-devsrc to be installed\nsystemd is not the init manager for this image\nTest case systemd.SystemdBasicTests.test_systemd_failed depends on systemd.SystemdBasicTests.test_systemd_basic but it didn't pass/run.\nTest case systemd.SystemdBasicTests.test_systemd_list depends on systemd.SystemdBasicTests.test_systemd_basic but it didn't pass/run.\nTest case systemd.SystemdJournalTests.test_systemd_boot_time depends on systemd.SystemdBasicTests.test_systemd_basic but it didn't pass/run.\nTest case systemd.SystemdJournalTests.test_systemd_journal depends on systemd.SystemdBasicTests.test_systemd_basic but it didn't pass/run.\nTest requires minidebuginfo to be in DISTRO_FEATURES\nTest case systemd.SystemdServiceTests.test_systemd_status depends on systemd.SystemdBasicTests.test_systemd_basic but it didn't pass/run.\nTest case systemd.SystemdServiceTests.test_systemd_disable_enable depends on systemd.SystemdServiceTests.test_systemd_status but it didn't pass/run.\nTest is only meant to run with read-only-rootfs in IMAGE_FEATURES\nTest case systemd.SystemdServiceTests.test_systemd_stop_start depends on systemd.SystemdServiceTests.test_systemd_status but it didn't pass/run.\nWARNING: core-image-full-cmdline-1.0-r0 do_testimage: Can not retrieve artifacts from test target: Error while fetching compressed artifacts\nOutput from runqemu:\nrunqemu - INFO - Received signal: 15\nrunqemu - INFO - Cleaning up\nrunqemu - INFO - Host uptime: 495737.58\n\nrunqemu - INFO - Removing /srv/pokybuild/yocto-worker/oe-selftest-debian/build/build-st-1585391/tmp/deploy/images/qemux86-64/core-image-full-cmdline-qemux86-64.rootfs-20260913102205.ext4\nrunqemu - INFO - Removing /home/pokybuild/tmp/core-image-full-cmdline-qemux86-64.rootfs-20260913102205.ext4.3943634\ntput: No value for $TERM and no -T specified\n\nRESULTS:\nRESULTS - date.DateTest.test_date: PASSED (2.18s)\nRESULTS - df.DfTest.test_df: PASSED (0.55s)\nRESULTS - logrotate.LogrotateTest.test_logrotate_newlog: PASSED (4.09s)\nRESULTS - logrotate.LogrotateTest.test_logrotate_wtmp: PASSED (2.56s)\nRESULTS - oe_syslog.SyslogTest.test_syslog_running: PASSED (0.60s)\nRESULTS - oe_syslog.SyslogTestConfig.test_syslog_logger: PASSED (1.97s)\nRESULTS - oe_syslog.SyslogTestConfig.test_syslog_restart: PASSED (1.67s)\nRESULTS - parselogs.ParseLogsTest.test_get_context: PASSED (0.00s)\nRESULTS - ping.PingTest.test_ping: PASSED (0.02s)\nRESULTS - rpm.RpmBasicTest.test_rpm_help: PASSED (0.72s)\nRESULTS - scp.ScpTest.test_scp_file: PASSED (1.23s)\nRESULTS - ssh.SSHTest.test_ssh: PASSED (4.34s)\nRESULTS - apt.AptRepoTest.test_apt_install_from_repo: SKIPPED (0.00s)\nRESULTS - buildcpio.BuildCpioTest.test_cpio: SKIPPED (0.00s)\nRESULTS - buildgalculator.GalculatorTest.test_galculator: SKIPPED (0.00s)\nRESULTS - buildlzip.BuildLzipTest.test_lzip: SKIPPED (0.00s)\nRESULTS - connman.ConnmanTest.test_connmand_help: SKIPPED (0.00s)\nRESULTS - connman.ConnmanTest.test_connmand_running: SKIPPED (0.00s)\nRESULTS - dnf.DnfBasicTest.test_dnf_help: SKIPPED (0.00s)\nRESULTS - dnf.DnfBasicTest.test_dnf_history: SKIPPED (0.00s)\nRESULTS - dnf.DnfBasicTest.test_dnf_info: SKIPPED (0.00s)\nRESULTS - dnf.DnfBasicTest.test_dnf_search: SKIPPED (0.00s)\nRESULTS - dnf.DnfBasicTest.test_dnf_version: SKIPPED (0.00s)\nRESULTS - dnf.DnfRepoTest.test_dnf_exclude: SKIPPED (0.00s)\nRESULTS - dnf.DnfRepoTest.test_dnf_install: SKIPPED (0.00s)\nRESULTS - dnf.DnfRepoTest.test_dnf_install_dependency: SKIPPED (0.00s)\nRESULTS - dnf.DnfRepoTest.test_dnf_install_from_disk: SKIPPED (0.00s)\nRESULTS - dnf.DnfRepoTest.test_dnf_install_from_http: SKIPPED (0.00s)\nRESULTS - dnf.DnfRepoTest.test_dnf_installroot: SKIPPED (0.00s)\nRESULTS - dnf.DnfRepoTest.test_dnf_installroot_usrmerge: SKIPPED (0.00s)\nRESULTS - dnf.DnfRepoTest.test_dnf_makecache: SKIPPED (0.00s)\nRESULTS - dnf.DnfRepoTest.test_dnf_reinstall: SKIPPED (0.00s)\nRESULTS - dnf.DnfRepoTest.test_dnf_repoinfo: SKIPPED (0.00s)\nRESULTS - gcc.GccCompileTest.test_gcc_compile: SKIPPED (0.00s)\nRESULTS - gcc.GccCompileTest.test_gpp2_compile: SKIPPED (0.00s)\nRESULTS - gcc.GccCompileTest.test_gpp_compile: SKIPPED (0.00s)\nRESULTS - gcc.GccCompileTest.test_make: SKIPPED (0.00s)\nRESULTS - gi.GObjectIntrospectionTest.test_python: SKIPPED (0.00s)\nRESULTS - go.CgoHelloworldTest.test_cgohelloworld: SKIPPED (0.00s)\nRESULTS - go.GoCompileTest.test_go_compile: SKIPPED (0.00s)\nRESULTS - go.GoCompileTest.test_go_module: SKIPPED (0.00s)\nRESULTS - go.GoHelloworldTest.test_gohelloworld: SKIPPED (0.00s)\nRESULTS - kernelmodule.KernelModuleTest.test_kernel_module: SKIPPED (0.00s)\nRESULTS - ldd.LddTest.test_ldd: SKIPPED (0.00s)\nRESULTS - oe_syslog.SyslogTestConfig.test_syslog_startup_config: SKIPPED (0.00s)\nRESULTS - opkg.OpkgRepoTest.test_opkg_install_from_repo: SKIPPED (0.00s)\nRESULTS - pam.PamBasicTest.test_pam: SKIPPED (0.00s)\nRESULTS - perl.PerlTest.test_perl_works: SKIPPED (0.00s)\nRESULTS - ptest.PtestRunnerTest.test_ptestrunner_expectfail: SKIPPED (0.00s)\nRESULTS - ptest.PtestRunnerTest.test_ptestrunner_expectsuccess: SKIPPED (0.00s)\nRESULTS - python.PythonTest.test_python3: SKIPPED (0.00s)\nRESULTS - rpm.RpmBasicTest.test_rpm_query: SKIPPED (0.53s)\nRESULTS - rpm.RpmBasicTest.test_rpm_query_nonroot: SKIPPED (0.00s)\nRESULTS - rpm.RpmInstallRemoveTest.test_check_rpm_install_removal_log_file_size: SKIPPED (0.00s)\nRESULTS - rpm.RpmInstallRemoveTest.test_rpm_install: SKIPPED (0.00s)\nRESULTS - rpm.RpmInstallRemoveTest.test_rpm_remove: SKIPPED (0.00s)\nRESULTS - rust.RustCLibExampleTest.test_rust_c_lib_example: SKIPPED (0.00s)\nRESULTS - rust.RustCompileTest.test_cargo_compile: SKIPPED (0.00s)\nRESULTS - rust.RustCompileTest.test_rust_compile: SKIPPED (0.00s)\nRESULTS - stap.StapTest.test_stap: SKIPPED (0.00s)\nRESULTS - systemd.SystemdBasicTests.test_systemd_basic: SKIPPED (0.00s)\nRESULTS - systemd.SystemdBasicTests.test_systemd_failed: SKIPPED (0.00s)\nRESULTS - systemd.SystemdBasicTests.test_systemd_list: SKIPPED (0.00s)\nRESULTS - systemd.SystemdJournalTests.test_systemd_boot_time: SKIPPED (0.00s)\nRESULTS - systemd.SystemdJournalTests.test_systemd_journal: SKIPPED (0.00s)\nRESULTS - systemd.SystemdServiceTests.test_systemd_coredump_minidebuginfo: SKIPPED (0.00s)\nRESULTS - systemd.SystemdServiceTests.test_systemd_disable_enable: SKIPPED (0.00s)\nRESULTS - systemd.SystemdServiceTests.test_systemd_disable_enable_ro: SKIPPED (0.00s)\nRESULTS - systemd.SystemdServiceTests.test_systemd_status: SKIPPED (0.00s)\nRESULTS - systemd.SystemdServiceTests.test_systemd_stop_start: SKIPPED (0.00s)\nRESULTS - weston.WestonTest.test_wayland_info: SKIPPED (0.00s)\nRESULTS - weston.WestonTest.test_weston_can_initialize_new_wayland_compositor: SKIPPED (0.00s)\nRESULTS - weston.WestonTest.test_weston_running: SKIPPED (0.00s)\nRESULTS - weston.WestonTest.test_weston_supports_xwayland: SKIPPED (0.00s)\nRESULTS - xorg.XorgTest.test_xorg_running: SKIPPED (0.00s)\nRESULTS - parselogs.ParseLogsTest.test_parselogs: FAILED (3.05s)\nSUMMARY:\ncore-image-full-cmdline () - Ran 76 tests in 23.568s\ncore-image-full-cmdline - FAIL - Required tests failed (successes=12, skipped=63, failures=1, errors=0)\ncore-image-full-cmdline - FAILED - Last lines of QEMU boot logs:\n--- qemu_boot_log.20260913112839 ---\nstarting nfsd: rpc.nfsd: Unable to request RDMA services: Protocol not supported\n\n[    5.586140] NFSD: Unable to initialize client recovery tracking! (-110)\n[    5.588077] NFSD: Is nfsdcld running? If not, enable CONFIG_NFSD_LEGACY_CLIENT_TRACKING.\n[    5.591865] NFSD: starting 90-second grace period (net effffff9)\ndone\n\nstarting mountd: done\n\nStarting system log daemon...0\n\nStarting crond: OK\n\n\n\nPoky (Yocto Project Reference Distro) 6.0.99+snapshot-fee85dccc1c49058c7db895f913af8fe43416efa qemux86-64 ttyS0\n\nType 'root' to login with superuser privileges (no password will be asked).\n\nqemux86-64 login: \n--- qemu_boot_log.20260913112839.2 ---\n\nStarting atd: OK\n\nstarting nfsd: rpc.nfsd: Unable to request RDMA services: Protocol not supported\n\ndone\n\nstarting mountd: done\n\nStarting system log daemon...0\n\nStarting crond: OK\n\n\n\nPoky (Yocto Project Reference Distro) 6.0.99+snapshot-fee85dccc1c49058c7db895f913af8fe43416efa qemux86-64 ttyS1\n\nType 'root' to login with superuser privileges (no password will be asked).\n\nqemux86-64 login: \nERROR: core-image-full-cmdline-1.0-r0 do_testimage: core-image-full-cmdline - FAILED - also check the logs in /srv/pokybuild/yocto-worker/oe-selftest-debian/build/build-st-1585391/tmp/log\nNOTE: recipe core-image-full-cmdline-1.0-r0: task do_testimage: Succeeded\nTest requires xserver-nodm-init to be installed\nOutput from runqemu:\nrunqemu - INFO - Received signal: 15\nrunqemu - INFO - Cleaning up\nrunqemu - INFO - Host uptime: 495746.88\n\nrunqemu - INFO - Removing /srv/pokybuild/yocto-worker/oe-selftest-debian/build/build-st-1585391/tmp/deploy/images/qemux86-64/core-image-weston-qemux86-64.rootfs-20260913102205.ext4\nrunqemu - INFO - Removing /home/pokybuild/tmp/core-image-weston-qemux86-64.rootfs-20260913102205.ext4.3943353\ntput: No value for $TERM and no -T specified\n\nRESULTS:\nRESULTS - date.DateTest.test_date: PASSED (2.17s)\nRESULTS - df.DfTest.test_df: PASSED (0.53s)\nRESULTS - oe_syslog.SyslogTest.test_syslog_running: PASSED (0.55s)\nRESULTS - oe_syslog.SyslogTestConfig.test_syslog_logger: PASSED (1.91s)\nRESULTS - oe_syslog.SyslogTestConfig.test_syslog_restart: PASSED (4.54s)\nRESULTS - oe_syslog.SyslogTestConfig.test_syslog_startup_config: PASSED (11.94s)\nRESULTS - parselogs.ParseLogsTest.test_get_context: PASSED (0.00s)\nRESULTS - parselogs.ParseLogsTest.test_parselogs: PASSED (2.39s)\nRESULTS - ping.PingTest.test_ping: PASSED (0.01s)\nRESULTS - rpm.RpmBasicTest.test_rpm_help: PASSED (0.55s)\nRESULTS - scp.ScpTest.test_scp_file: PASSED (1.24s)\nRESULTS - ssh.SSHTest.test_ssh: PASSED (0.55s)\nRESULTS - weston.WestonTest.test_wayland_info: PASSED (0.55s)\nRESULTS - weston.WestonTest.test_weston_can_initialize_new_wayland_compositor: PASSED (8.41s)\nRESULTS - weston.WestonTest.test_weston_running: PASSED (1.12s)\nRESULTS - weston.WestonTest.test_weston_supports_xwayland: PASSED (0.98s)\nRESULTS - apt.AptRepoTest.test_apt_install_from_repo: SKIPPED (0.00s)\nRESULTS - buildcpio.BuildCpioTest.test_cpio: SKIPPED (0.00s)\nRESULTS - buildgalculator.GalculatorTest.test_galculator: SKIPPED (0.00s)\nRESULTS - buildlzip.BuildLzipTest.test_lzip: SKIPPED (0.00s)\nRESULTS - connman.ConnmanTest.test_connmand_help: SKIPPED (0.00s)\nRESULTS - connman.ConnmanTest.test_connmand_running: SKIPPED (0.00s)\nRESULTS - dnf.DnfBasicTest.test_dnf_help: SKIPPED (0.00s)\nRESULTS - dnf.DnfBasicTest.test_dnf_history: SKIPPED (0.00s)\nRESULTS - dnf.DnfBasicTest.test_dnf_info: SKIPPED (0.00s)\nRESULTS - dnf.DnfBasicTest.test_dnf_search: SKIPPED (0.00s)\nRESULTS - dnf.DnfBasicTest.test_dnf_version: SKIPPED (0.00s)\nRESULTS - dnf.DnfRepoTest.test_dnf_exclude: SKIPPED (0.00s)\nRESULTS - dnf.DnfRepoTest.test_dnf_install: SKIPPED (0.00s)\nRESULTS - dnf.DnfRepoTest.test_dnf_install_dependency: SKIPPED (0.00s)\nRESULTS - dnf.DnfRepoTest.test_dnf_install_from_disk: SKIPPED (0.00s)\nRESULTS - dnf.DnfRepoTest.test_dnf_install_from_http: SKIPPED (0.00s)\nRESULTS - dnf.DnfRepoTest.test_dnf_installroot: SKIPPED (0.00s)\nRESULTS - dnf.DnfRepoTest.test_dnf_installroot_usrmerge: SKIPPED (0.00s)\nRESULTS - dnf.DnfRepoTest.test_dnf_makecache: SKIPPED (0.00s)\nRESULTS - dnf.DnfRepoTest.test_dnf_reinstall: SKIPPED (0.00s)\nRESULTS - dnf.DnfRepoTest.test_dnf_repoinfo: SKIPPED (0.00s)\nRESULTS - gcc.GccCompileTest.test_gcc_compile: SKIPPED (0.00s)\nRESULTS - gcc.GccCompileTest.test_gpp2_compile: SKIPPED (0.00s)\nRESULTS - gcc.GccCompileTest.test_gpp_compile: SKIPPED (0.00s)\nRESULTS - gcc.GccCompileTest.test_make: SKIPPED (0.00s)\nRESULTS - gi.GObjectIntrospectionTest.test_python: SKIPPED (0.00s)\nRESULTS - go.CgoHelloworldTest.test_cgohelloworld: SKIPPED (0.00s)\nRESULTS - go.GoCompileTest.test_go_compile: SKIPPED (0.00s)\nRESULTS - go.GoCompileTest.test_go_module: SKIPPED (0.00s)\nRESULTS - go.GoHelloworldTest.test_gohelloworld: SKIPPED (0.00s)\nRESULTS - kernelmodule.KernelModuleTest.test_kernel_module: SKIPPED (0.00s)\nRESULTS - ldd.LddTest.test_ldd: SKIPPED (0.00s)\nRESULTS - logrotate.LogrotateTest.test_logrotate_newlog: SKIPPED (0.00s)\nRESULTS - logrotate.LogrotateTest.test_logrotate_wtmp: SKIPPED (0.00s)\nRESULTS - opkg.OpkgRepoTest.test_opkg_install_from_repo: SKIPPED (0.00s)\nRESULTS - pam.PamBasicTest.test_pam: SKIPPED (0.00s)\nRESULTS - perl.PerlTest.test_perl_works: SKIPPED (0.00s)\nRESULTS - ptest.PtestRunnerTest.test_ptestrunner_expectfail: SKIPPED (0.00s)\nRESULTS - ptest.PtestRunnerTest.test_ptestrunner_expectsuccess: SKIPPED (0.00s)\nRESULTS - python.PythonTest.test_python3: SKIPPED (0.00s)\nRESULTS - rpm.RpmBasicTest.test_rpm_query: SKIPPED (0.52s)\nRESULTS - rpm.RpmBasicTest.test_rpm_query_nonroot: SKIPPED (0.00s)\nRESULTS - rpm.RpmInstallRemoveTest.test_check_rpm_install_removal_log_file_size: SKIPPED (0.00s)\nRESULTS - rpm.RpmInstallRemoveTest.test_rpm_install: SKIPPED (0.00s)\nRESULTS - rpm.RpmInstallRemoveTest.test_rpm_remove: SKIPPED (0.00s)\nRESULTS - rust.RustCLibExampleTest.test_rust_c_lib_example: SKIPPED (0.00s)\nRESULTS - rust.RustCompileTest.test_cargo_compile: SKIPPED (0.00s)\nRESULTS - rust.RustCompileTest.test_rust_compile: SKIPPED (0.00s)\nRESULTS - stap.StapTest.test_stap: SKIPPED (0.00s)\nRESULTS - systemd.SystemdBasicTests.test_systemd_basic: SKIPPED (0.00s)\nRESULTS - systemd.SystemdBasicTests.test_systemd_failed: SKIPPED (0.00s)\nRESULTS - systemd.SystemdBasicTests.test_systemd_list: SKIPPED (0.00s)\nRESULTS - systemd.SystemdJournalTests.test_systemd_boot_time: SKIPPED (0.00s)\nRESULTS - systemd.SystemdJournalTests.test_systemd_journal: SKIPPED (0.00s)\nRESULTS - systemd.SystemdServiceTests.test_systemd_coredump_minidebuginfo: SKIPPED (0.00s)\nRESULTS - systemd.SystemdServiceTests.test_systemd_disable_enable: SKIPPED (0.00s)\nRESULTS - systemd.SystemdServiceTests.test_systemd_disable_enable_ro: SKIPPED (0.00s)\nRESULTS - systemd.SystemdServiceTests.test_systemd_status: SKIPPED (0.00s)\nRESULTS - systemd.SystemdServiceTests.test_systemd_stop_start: SKIPPED (0.00s)\nRESULTS - xorg.XorgTest.test_xorg_running: SKIPPED (0.00s)\nSUMMARY:\ncore-image-weston () - Ran 76 tests in 37.995s\ncore-image-weston - OK - All required tests passed (successes=16, skipped=60, failures=0, errors=0)\nNOTE: recipe core-image-weston-1.0-r0: task do_testimage: Succeeded\nNOTE: Tasks Summary: Attempted 1528 tasks of which 1526 didn't need to be rerun and all succeeded.\n\nSummary: There was 1 WARNING message.\nSummary: There was 1 ERROR message, returning a non-zero exit code.\n\n\nStderr:\n2026-09-13 10:15:11,426 - oe-selftest - INFO - Adding: \"include selftest.inc\" in /srv/pokybuild/yocto-worker/oe-selftest-debian/build/build-st-1585391/conf/local.conf\n2026-09-13 10:15:11,426 - oe-selftest - INFO - Adding: \"include bblayers.inc\" in bblayers.conf\n/usr/lib/python3.12/unittest/case.py:580: RuntimeWarning: TestResult has no addDuration method\n  warnings.warn(\"TestResult has no addDuration method\",\n\n/usr/lib/python3.12/unittest/case.py:580: RuntimeWarning: TestResult has no addDuration method\n  warnings.warn(\"TestResult has no addDuration method\",\n\n/usr/lib/python3.12/unittest/case.py:580: RuntimeWarning: TestResult has no addDuration method\n  warnings.warn(\"TestResult has no addDuration method\",\n\n/usr/lib/python3.12/unittest/case.py:580: RuntimeWarning: TestResult has no addDuration method\n  warnings.warn(\"TestResult has no addDuration method\",\n\n/usr/lib/python3.12/unittest/case.py:580: RuntimeWarning: TestResult has no addDuration method\n  warnings.warn(\"TestResult has no addDuration method\",\n\n/usr/lib/python3.12/unittest/case.py:580: RuntimeWarning: TestResult has no addDuration method\n  warnings.warn(\"TestResult has no addDuration method\",\n\nWARNING: test: LICENSE is using \"CLOSED\", which is deprecated. Convert to using a license ref pointing to an actual license file, e.g.\nLICENSE = \"LicenseRef-test-CLOSED\"\nWARNING: test: LICENSE is using \"CLOSED\", which is deprecated. Convert to using a license ref pointing to an actual license file, e.g.\nLICENSE = \"LicenseRef-test-CLOSED\"\nERROR: When reparsing /tmp/selftest-fetchx0er_ja4/test.bb:do_checkuri, the basehash value changed from cf5cbdc6dee19eec8e0ab7c147e79435436ca4f98353b070a206b72d66c2c748 to 5fc2e5d8a9cfbc8790ff18a3130b8a06335977184d22e2ff79a8f6c41b61a6b0. The metadata is not deterministic and this needs to be fixed.\nERROR: The following commands may help:\nERROR: $ bitbake test -cdo_checkuri -Snone\nERROR: Then:\nERROR: $ bitbake test -cdo_checkuri -Sprintdiff\n\nERROR: When reparsing /tmp/selftest-fetchx0er_ja4/test.bb:do_fetch, the basehash value changed from ff215cb1adc0a61a280c7a0a3ba5905510882f32d3fac56636234b90a88be118 to 32812182a8721ed3d8a5496e40aafb5936f3d965686e9677863926d520f0bdfc. The metadata is not deterministic and this needs to be fixed.\nERROR: The following commands may help:\nERROR: $ bitbake test -cdo_fetch -Snone\nERROR: Then:\nERROR: $ bitbake test -cdo_fetch -Sprintdiff\n\nERROR: When reparsing /tmp/selftest-fetchx0er_ja4/test.bb:do_unpack, the basehash value changed from b608ba599130a8bb1efb8d62d4aeeb78c9b688783051e99b8d0c0ce3a7c88916 to 8dfeb4a4688fb92ee953c89ea1db9917036ab0b3a2613ff8de764e33fafc9db5. The metadata is not deterministic and this needs to be fixed.\nERROR: The following commands may help:\nERROR: $ bitbake test -cdo_unpack -Snone\nERROR: Then:\nERROR: $ bitbake test -cdo_unpack -Sprintdiff\n\nERROR: When reparsing /tmp/selftest-fetchx0er_ja4/test.bb:do_cleanall, the basehash value changed from 01396410d89629f31345dd0c090b4705fd8ff9602b89a06299f867c2eb42abb5 to 7ccd4ffa6bc0d08dc152aa634becb06c88614ebec4660837b92527a8b5cc6e5c. The metadata is not deterministic and this needs to be fixed.\nERROR: The following commands may help:\nERROR: $ bitbake test -cdo_cleanall -Snone\nERROR: Then:\nERROR: $ bitbake test -cdo_cleanall -Sprintdiff\n\nERROR: When reparsing /tmp/selftest-fetchx0er_ja4/test.bb:do_recipe_qa, the basehash value changed from 4849ff5b4c683c3ebe09740e80a53ebb9f86f26ff20182e583872dc54d36a938 to 964198f8783a20391fd6ed9760c6a89088086ffc9f0a5fdad7ca1449933949d6. The metadata is not deterministic and this needs to be fixed.\nERROR: The following commands may help:\nERROR: $ bitbake test -cdo_recipe_qa -Snone\nERROR: Then:\nERROR: $ bitbake test -cdo_recipe_qa -Sprintdiff\n\nERROR: When reparsing /tmp/selftest-fetchx0er_ja4/test.bb:do_populate_lic, the basehash value changed from 924036672b7cd18f7c48693d0cc2d303a812028ef26d02538e2ca3dd046c2a46 to 88935d951651e5ba5080ed188241c53949a30abdc635f4d2159da83e0b7e0b63. The metadata is not deterministic and this needs to be fixed.\nERROR: The following commands may help:\nERROR: $ bitbake test -cdo_populate_lic -Snone\nERROR: Then:\nERROR: $ bitbake test -cdo_populate_lic -Sprintdiff\n\nERROR: When reparsing /tmp/selftest-fetchx0er_ja4/test.bb:do_create_spdx, the basehash value changed from c3a73919ad5c374cee66f30c4c350ffa994f544111bb57a65d4cf054b1f49526 to bf1130ce4225c2f382944d1b86404f6aae76f76eb958cb0bafafadf8ce0795e0. The metadata is not deterministic and this needs to be fixed.\nERROR: The following commands may help:\nERROR: $ bitbake test -cdo_create_spdx -Snone\nERROR: Then:\nERROR: $ bitbake test -cdo_create_spdx -Sprintdiff\n\nWARNING: test: LICENSE is using \"CLOSED\", which is deprecated. Convert to using a license ref pointing to an actual license file, e.g.\nLICENSE = \"LicenseRef-test-CLOSED\"\nERROR: When reparsing /tmp/selftest-fetchx0er_ja4/test.bb:do_checkuri, the basehash value changed from 5fc2e5d8a9cfbc8790ff18a3130b8a06335977184d22e2ff79a8f6c41b61a6b0 to e72dac1bf99cbba0f6b792a038f71d7c07e3cc27dc2043baae03ec487f0ebdaa. The metadata is not deterministic and this needs to be fixed.\nERROR: The following commands may help:\nERROR: $ bitbake test -cdo_checkuri -Snone\nERROR: Then:\nERROR: $ bitbake test -cdo_checkuri -Sprintdiff\n\nERROR: When reparsing /tmp/selftest-fetchx0er_ja4/test.bb:do_fetch, the basehash value changed from 32812182a8721ed3d8a5496e40aafb5936f3d965686e9677863926d520f0bdfc to 9653a6f3415263e3c8a21ae071c51dd73592f80029c041b83aabcaae6359abf4. The metadata is not deterministic and this needs to be fixed.\nERROR: The following commands may help:\nERROR: $ bitbake test -cdo_fetch -Snone\nERROR: Then:\nERROR: $ bitbake test -cdo_fetch -Sprintdiff\n\nERROR: When reparsing /tmp/selftest-fetchx0er_ja4/test.bb:do_unpack, the basehash value changed from 8dfeb4a4688fb92ee953c89ea1db9917036ab0b3a2613ff8de764e33fafc9db5 to c1e9f46825023ff23c4fc466eccc386e01a74661b5a4472241d38d769f9a9c59. The metadata is not deterministic and this needs to be fixed.\nERROR: The following commands may help:\nERROR: $ bitbake test -cdo_unpack -Snone\nERROR: Then:\nERROR: $ bitbake test -cdo_unpack -Sprintdiff\n\nERROR: When reparsing /tmp/selftest-fetchx0er_ja4/test.bb:do_cleanall, the basehash value changed from 7ccd4ffa6bc0d08dc152aa634becb06c88614ebec4660837b92527a8b5cc6e5c to bce0ec8c074ed3641063dc215d193b50dfc1b957c022fbbbd876c012f08fc165. The metadata is not deterministic and this needs to be fixed.\nERROR: The following commands may help:\nERROR: $ bitbake test -cdo_cleanall -Snone\nERROR: Then:\nERROR: $ bitbake test -cdo_cleanall -Sprintdiff\n\nERROR: When reparsing /tmp/selftest-fetchx0er_ja4/test.bb:do_recipe_qa, the basehash value changed from 964198f8783a20391fd6ed9760c6a89088086ffc9f0a5fdad7ca1449933949d6 to 717e46cd527184da263b1a59d4980c1e30496a9df8de7e75d0fa3876db5fc701. The metadata is not deterministic and this needs to be fixed.\nERROR: The following commands may help:\nERROR: $ bitbake test -cdo_recipe_qa -Snone\nERROR: Then:\nERROR: $ bitbake test -cdo_recipe_qa -Sprintdiff\n\nERROR: When reparsing /tmp/selftest-fetchx0er_ja4/test.bb:do_populate_lic, the basehash value changed from 88935d951651e5ba5080ed188241c53949a30abdc635f4d2159da83e0b7e0b63 to 2a296be537f1f7427ac845a9b6b892e45e5cde98c7f30d82911008963bbdeb46. The metadata is not deterministic and this needs to be fixed.\nERROR: The following commands may help:\nERROR: $ bitbake test -cdo_populate_lic -Snone\nERROR: Then:\nERROR: $ bitbake test -cdo_populate_lic -Sprintdiff\n\nERROR: When reparsing /tmp/selftest-fetchx0er_ja4/test.bb:do_create_spdx, the basehash value changed from bf1130ce4225c2f382944d1b86404f6aae76f76eb958cb0bafafadf8ce0795e0 to ff02303219a5cc5903c8756743ff7fd765b4d8a648741124547b534fc921c197. The metadata is not deterministic and this needs to be fixed.\nERROR: The following commands may help:\nERROR: $ bitbake test -cdo_create_spdx -Snone\nERROR: Then:\nERROR: $ bitbake test -cdo_create_spdx -Sprintdiff\n\nWARNING: test: LICENSE is using \"CLOSED\", which is deprecated. Convert to using a license ref pointing to an actual license file, e.g.\nLICENSE = \"LicenseRef-test-CLOSED\"\nERROR: When reparsing /tmp/selftest-fetchx0er_ja4/test.bb:do_checkuri, the basehash value changed from e72dac1bf99cbba0f6b792a038f71d7c07e3cc27dc2043baae03ec487f0ebdaa to 261db4eebbd1d6d909256dfbd186d4d697f44f92401c3621d2ac3f18c4206df5. The metadata is not deterministic and this needs to be fixed.\nERROR: The following commands may help:\nERROR: $ bitbake test -cdo_checkuri -Snone\nERROR: Then:\nERROR: $ bitbake test -cdo_checkuri -Sprintdiff\n\nERROR: When reparsing /tmp/selftest-fetchx0er_ja4/test.bb:do_fetch, the basehash value changed from 9653a6f3415263e3c8a21ae071c51dd73592f80029c041b83aabcaae6359abf4 to 61a0644ebeeeb417de89b733a902a3b3d034ff6e44257ace9e5c62395eb1d012. The metadata is not deterministic and this needs to be fixed.\nERROR: The following commands may help:\nERROR: $ bitbake test -cdo_fetch -Snone\nERROR: Then:\nERROR: $ bitbake test -cdo_fetch -Sprintdiff\n\nERROR: When reparsing /tmp/selftest-fetchx0er_ja4/test.bb:do_unpack, the basehash value changed from c1e9f46825023ff23c4fc466eccc386e01a74661b5a4472241d38d769f9a9c59 to 3608b030c8c95a7784f40b86ee3d612a172fbe37ac79c5819e5522a625397139. The metadata is not deterministic and this needs to be fixed.\nERROR: The following commands may help:\nERROR: $ bitbake test -cdo_unpack -Snone\nERROR: Then:\nERROR: $ bitbake test -cdo_unpack -Sprintdiff\n\nERROR: When reparsing /tmp/selftest-fetchx0er_ja4/test.bb:do_cleanall, the basehash value changed from bce0ec8c074ed3641063dc215d193b50dfc1b957c022fbbbd876c012f08fc165 to dcecc6c2b1eb25d072c325b51e33b4a7d2a0d23c0df74522a6c8a6c31363b8df. The metadata is not deterministic and this needs to be fixed.\nERROR: The following commands may help:\nERROR: $ bitbake test -cdo_cleanall -Snone\nERROR: Then:\nERROR: $ bitbake test -cdo_cleanall -Sprintdiff\n\nERROR: When reparsing /tmp/selftest-fetchx0er_ja4/test.bb:do_recipe_qa, the basehash value changed from 717e46cd527184da263b1a59d4980c1e30496a9df8de7e75d0fa3876db5fc701 to 90c0ddb2ee6b09d1e252516dd4df76da78f9110bc4ab1d403c8646a9476d5011. The metadata is not deterministic and this needs to be fixed.\nERROR: The following commands may help:\nERROR: $ bitbake test -cdo_recipe_qa -Snone\nERROR: Then:\nERROR: $ bitbake test -cdo_recipe_qa -Sprintdiff\n\nERROR: When reparsing /tmp/selftest-fetchx0er_ja4/test.bb:do_populate_lic, the basehash value changed from 2a296be537f1f7427ac845a9b6b892e45e5cde98c7f30d82911008963bbdeb46 to 4c29ce3340d19084b74a9fc73951823c5276387b2656eb2508c1cc6f2a71fd6e. The metadata is not deterministic and this needs to be fixed.\nERROR: The following commands may help:\nERROR: $ bitbake test -cdo_populate_lic -Snone\nERROR: Then:\nERROR: $ bitbake test -cdo_populate_lic -Sprintdiff\n\nERROR: When reparsing /tmp/selftest-fetchx0er_ja4/test.bb:do_create_spdx, the basehash value changed from ff02303219a5cc5903c8756743ff7fd765b4d8a648741124547b534fc921c197 to b56cbedbc839c09c7b89b8ec02c3bed6259560b942ba8fed657a5c5cc7ee5630. The metadata is not deterministic and this needs to be fixed.\nERROR: The following commands may help:\nERROR: $ bitbake test -cdo_create_spdx -Snone\nERROR: Then:\nERROR: $ bitbake test -cdo_create_spdx -Sprintdiff\n\n",
    "status": "FAILED"
   },
   "incompatible_lic.NoGPL3InImagesTests.test_core_image_minimal": {
    "duration": 65.324,
    "status": "PASSED"
   },
   "install.InstallTests.test_gstreamer_plugins": {
    "duration": 372.634,
    "status": "PASSED"
   },
   "install.InstallTests.test_linux_firmware": {
    "duration": 124.134,
    "status": "PASSED"
   },
   "install.InstallTests.test_linux_modules": {
    "duration": 80.559,
    "status": "PASSED"
   },
   "install.InstallTests.test_perl": {
    "duration": 72.41,
    "status": "PASSED"
   },
   "install.InstallTests.test_python": {
    "duration": 99.088,
    "status": "PASSED"
   },
   "intercept.GitCheck.test_git_intercept": {
    "duration": 40.241,
    "status": "PASSED"
   },
   "kerneldevelopment.KernelDev.test_apply_patches": {
    "duration": 122.79,
    "status": "PASSED"
   },
   "kernelmodulesplit.KernelModuleSplit.test_cross_recipe_module_dependency": {
    "duration": 2385.102,
    "status": "PASSED"
   },
   "layerappend.LayerAppendTests.test_layer_appends": {
    "duration": 61.302,
    "status": "PASSED"
   },
   "liboe.CopyTreeTests.test_copy_hardlink_tree_count": {
    "duration": 0.01402,
    "status": "PASSED"
   },
   "liboe.CopyTreeTests.test_copy_tree_special": {
    "duration": 0.01016,
    "status": "PASSED"
   },
   "liboe.CopyTreeTests.test_copy_tree_xattr": {
    "duration": 42.038,
    "status": "PASSED"
   },
   "liboe.PathTests.test_canonicalize_empty_string_returns_empty_string": {
    "duration": 0.009109,
    "status": "PASSED"
   },
   "liboe.PathTests.test_canonicalize_empty_token_between_paths_is_dropped": {
    "duration": 0.008,
    "status": "PASSED"
   },
   "liboe.PathTests.test_canonicalize_multiple_variable_tokens_all_skipped": {
    "duration": 0.007622,
    "status": "PASSED"
   },
   "liboe.PathTests.test_canonicalize_none_returns_empty_string": {
    "duration": 0.006963,
    "status": "PASSED"
   },
   "liboe.PathTests.test_canonicalize_real_path_returned": {
    "duration": 0.007195,
    "status": "PASSED"
   },
   "liboe.PathTests.test_canonicalize_trailing_slash_preserved": {
    "duration": 0.006952,
    "status": "PASSED"
   },
   "liboe.PathTests.test_canonicalize_unexpanded_variable_is_skipped": {
    "duration": 0.00697,
    "status": "PASSED"
   },
   "liboe.PathTests.test_canonicalize_variable_and_trailing_slash_path": {
    "duration": 0.007324,
    "status": "PASSED"
   },
   "liboe.PathTests.test_canonicalize_variable_token_dropped_leaving_real_path": {
    "duration": 0.007095,
    "status": "PASSED"
   },
   "liboe.PathTests.test_is_path_parent_all_paths_must_be_below": {
    "duration": 0.007147,
    "status": "PASSED"
   },
   "liboe.PathTests.test_is_path_parent_child_is_not_parent_of_its_parent": {
    "duration": 0.00741,
    "status": "PASSED"
   },
   "liboe.PathTests.test_is_path_parent_direct_child": {
    "duration": 0.00703,
    "status": "PASSED"
   },
   "liboe.PathTests.test_is_path_parent_no_paths_returns_false": {
    "duration": 0.006966,
    "status": "PASSED"
   },
   "liboe.PathTests.test_is_path_parent_one_path_outside_fails": {
    "duration": 0.007188,
    "status": "PASSED"
   },
   "liboe.PathTests.test_is_path_parent_prefix_string_is_not_a_path_parent": {
    "duration": 0.007273,
    "status": "PASSED"
   },
   "liboe.PathTests.test_is_path_parent_unrelated_path": {
    "duration": 0.007072,
    "status": "PASSED"
   },
   "liboe.PathTests.test_join_absolute_rhs_is_not_special": {
    "duration": 0.007042,
    "status": "PASSED"
   },
   "liboe.PathTests.test_join_empty_leading_component_is_absolute": {
    "duration": 0.007252,
    "status": "PASSED"
   },
   "liboe.PathTests.test_join_pardir_normalised": {
    "duration": 0.00713,
    "status": "PASSED"
   },
   "liboe.PathTests.test_join_redundant_separators_normalised": {
    "duration": 0.006934,
    "status": "PASSED"
   },
   "liboe.PathTests.test_join_two_paths": {
    "duration": 0.00688,
    "status": "PASSED"
   },
   "liboe.PathTests.test_make_relative_symlink_absolute_becomes_relative_and_resolves": {
    "duration": 0.007379,
    "status": "PASSED"
   },
   "liboe.PathTests.test_make_relative_symlink_already_relative_unchanged": {
    "duration": 0.007036,
    "status": "PASSED"
   },
   "liboe.PathTests.test_make_relative_symlink_non_symlink_is_ignored": {
    "duration": 0.007218,
    "status": "PASSED"
   },
   "liboe.PathTests.test_make_relative_symlink_several_levels_deep_becomes_relative": {
    "duration": 0.008004,
    "status": "PASSED"
   },
   "liboe.PathTests.test_realpath_isdir_failure_falls_back_without_nameerror": {
    "duration": 0.008242,
    "status": "PASSED"
   },
   "liboe.PathTests.test_realpath_missing_component_raises_enoent_without_assume_dir": {
    "duration": 0.00775,
    "status": "PASSED"
   },
   "liboe.PathTests.test_realpath_missing_component_tolerated_with_assume_dir": {
    "duration": 0.007205,
    "status": "PASSED"
   },
   "liboe.PathTests.test_realpath_mutual_symlink_cycle_raises_eloop": {
    "duration": 0.00862,
    "status": "PASSED"
   },
   "liboe.PathTests.test_realpath_path_outside_root_raises": {
    "duration": 0.008346,
    "status": "PASSED"
   },
   "liboe.PathTests.test_realpath_plain_path_is_returned": {
    "duration": 0.00722,
    "status": "PASSED"
   },
   "liboe.PathTests.test_realpath_resolves_symlink_below_root": {
    "duration": 0.009564,
    "status": "PASSED"
   },
   "liboe.PathTests.test_realpath_resolves_symlink_several_components_deep": {
    "duration": 0.007619,
    "status": "PASSED"
   },
   "liboe.PathTests.test_realpath_self_referential_symlink_raises_eloop": {
    "duration": 0.0125,
    "status": "PASSED"
   },
   "liboe.PathTests.test_symlink_conflicting_existing_raises": {
    "duration": 0.007123,
    "status": "PASSED"
   },
   "liboe.PathTests.test_symlink_creates_dangling_symlink": {
    "duration": 0.006916,
    "status": "PASSED"
   },
   "liboe.PathTests.test_symlink_creates_symlink": {
    "duration": 0.007032,
    "status": "PASSED"
   },
   "liboe.PathTests.test_symlink_force_does_not_delete_glob_siblings": {
    "duration": 0.006668,
    "status": "PASSED"
   },
   "liboe.PathTests.test_symlink_force_overwrites_existing_symlink": {
    "duration": 0.006807,
    "status": "PASSED"
   },
   "liboe.PathTests.test_symlink_force_replaces_destination_with_glob_metacharacters": {
    "duration": 0.006649,
    "status": "PASSED"
   },
   "liboe.PathTests.test_symlink_force_replaces_existing_directory": {
    "duration": 0.006939,
    "status": "PASSED"
   },
   "liboe.PathTests.test_symlink_matching_existing_is_idempotent": {
    "duration": 0.006636,
    "status": "PASSED"
   },
   "liboe.PathTests.test_which_wild_explicit_search_path": {
    "duration": 0.006676,
    "status": "PASSED"
   },
   "liboe.PathTests.test_which_wild_first_match_per_name_wins": {
    "duration": 0.00665,
    "status": "PASSED"
   },
   "liboe.PathTests.test_which_wild_missing_tool_returns_empty": {
    "duration": 0.006551,
    "status": "PASSED"
   },
   "liboe.PathTests.test_which_wild_wildcard_pattern": {
    "duration": 0.007085,
    "status": "PASSED"
   },
   "liboe.SubprocessTests.test_subprocess_tweak": {
    "duration": 0.0146,
    "status": "PASSED"
   },
   "lic_checksum.LicenseTests.test_checksum_with_space": {
    "duration": 29.172,
    "status": "PASSED"
   },
   "lic_checksum.LicenseTests.test_nonmatching_checksum": {
    "duration": 24.35,
    "status": "PASSED"
   },
   "locales.LocalesTest.test_locales_off": {
    "duration": 621.158,
    "status": "PASSED"
   },
   "locales.LocalesTest.test_locales_on": {
    "duration": 119.163,
    "status": "PASSED"
   },
   "manifest.VerifyManifest.test_SDK_manifest_entries": {
    "duration": 337.421,
    "status": "PASSED"
   },
   "manifest.VerifyManifest.test_image_manifest_entries": {
    "duration": 12.204,
    "status": "PASSED"
   },
   "minidebuginfo.Minidebuginfo.test_minidebuginfo": {
    "duration": 2178.408,
    "status": "PASSED"
   },
   "minidebuginfo.Minidebuginfo.test_minidebuginfo_qemu": {
    "duration": 951.153,
    "oetags": [
     "runqemu"
    ],
    "status": "PASSED"
   },
   "multiconfig.MultiConfig.test_multiconfig": {
    "duration": 330.645,
    "status": "PASSED"
   },
   "multiconfig.MultiConfig.test_multiconfig_inlayer": {
    "duration": 47.659,
    "status": "PASSED"
   },
   "multiconfig.MultiConfig.test_multiconfig_reparse": {
    "duration": 88.996,
    "status": "PASSED"
   },
   "newlib.NewlibTest.test_newlib": {
    "duration": 50.387,
    "status": "PASSED"
   },
   "oelib.buildhistory.TestBlobParsing.test_blob_to_dict": {
    "duration": 1.215,
    "status": "PASSED"
   },
   "oelib.buildhistory.TestBlobParsing.test_compare_dict_blobs": {
    "duration": 1.019,
    "status": "PASSED"
   },
   "oelib.buildhistory.TestBlobParsing.test_compare_dict_blobs_default": {
    "duration": 1.004,
    "status": "PASSED"
   },
   "oelib.buildhistory.TestFileListCompare.test_compare_file_lists": {
    "duration": 0.161,
    "status": "PASSED"
   },
   "oelib.elf.TestElf.test_machine_name": {
    "duration": 0.000911,
    "status": "PASSED"
   },
   "oelib.license.TestComplexCombinations.test_tests": {
    "duration": 0.002577,
    "status": "PASSED"
   },
   "oelib.license.TestIsIncluded.test_tests": {
    "duration": 0.005463,
    "status": "PASSED"
   },
   "oelib.license.TestSimpleCombinations.test_tests": {
    "duration": 0.002733,
    "status": "PASSED"
   },
   "oelib.license.TestSingleLicense.test_invalid_licenses": {
    "duration": 0.0007901,
    "status": "PASSED"
   },
   "oelib.license.TestSingleLicense.test_single_licenses": {
    "duration": 0.000952,
    "status": "PASSED"
   },
   "oelib.license.TestSort.test_sort": {
    "duration": 0.008674,
    "status": "PASSED"
   },
   "oelib.package.TestCopyDebugSources.test_copydebugsources_copies_files_and_dereferences_links": {
    "duration": 0.01061,
    "status": "PASSED"
   },
   "oelib.package.TestCopyDebugSources.test_copydebugsources_ignores_copy_failure": {
    "duration": 0.003898,
    "status": "PASSED"
   },
   "oelib.package.TestCopyDebugSources.test_copydebugsources_ignores_empty_externalsrc_relocation": {
    "duration": 0.005454,
    "status": "PASSED"
   },
   "oelib.package.TestCopyDebugSources.test_copydebugsources_moves_externalsrc_relocation": {
    "duration": 0.006177,
    "status": "PASSED"
   },
   "oelib.patch.TestGitApplyTree.test_dirty_push_run_false_returns_argv": {
    "duration": 0.2901,
    "status": "PASSED"
   },
   "oelib.patch.TestGitApplyTree.test_fallback_preserves_original_patch_name": {
    "duration": 0.6676,
    "status": "PASSED"
   },
   "oelib.patch.TestGitApplyTree.test_git_am_preserves_original_patch_name": {
    "duration": 0.6197,
    "status": "PASSED"
   },
   "oelib.patch.TestGitApplyTree.test_push_run_false_returns_argv": {
    "duration": 0.3946,
    "status": "PASSED"
   },
   "oelib.patch.TestPatchTree.test_push_run_false_returns_argv": {
    "duration": 0.00137,
    "status": "PASSED"
   },
   "oelib.patch.TestRunCmd.test_runcmd_allows_explicit_shell": {
    "duration": 0.001598,
    "status": "PASSED"
   },
   "oelib.patch.TestRunCmd.test_runcmd_preserves_argv_elements": {
    "duration": 0.01704,
    "status": "PASSED"
   },
   "oelib.patch.TestRunCmd.test_runcmd_reports_exit_status": {
    "duration": 0.01572,
    "status": "PASSED"
   },
   "oelib.patch.TestRunCmd.test_runcmd_wraps_exec_failure": {
    "duration": 0.0009243,
    "status": "PASSED"
   },
   "oelib.path.TestRealPath.test_loop": {
    "duration": 0.004057,
    "status": "PASSED"
   },
   "oelib.path.TestRealPath.test_norm": {
    "duration": 0.003604,
    "status": "PASSED"
   },
   "oelib.path.TestRealPath.test_phys": {
    "duration": 0.002039,
    "status": "PASSED"
   },
   "oelib.types.TestBooleanType.test_bool_equality": {
    "duration": 0.0008769,
    "status": "PASSED"
   },
   "oelib.types.TestBooleanType.test_false": {
    "duration": 0.0005684,
    "status": "PASSED"
   },
   "oelib.types.TestBooleanType.test_invalid": {
    "duration": 0.0006449,
    "status": "PASSED"
   },
   "oelib.types.TestBooleanType.test_true": {
    "duration": 0.000355,
    "status": "PASSED"
   },
   "oelib.types.TestList.test_list_nosep": {
    "duration": 0.0009081,
    "status": "PASSED"
   },
   "oelib.types.TestList.test_list_usersep": {
    "duration": 0.0008237,
    "status": "PASSED"
   },
   "oelib.utils.TestDefaultFeatures.test_filter_default_features": {
    "duration": 0.003205,
    "status": "PASSED"
   },
   "oelib.utils.TestMultiprocessLaunch.test_multiprocesslaunch": {
    "duration": 0.05539,
    "status": "PASSED"
   },
   "oelib.utils.TestPackagesFilterOutSystem.test_filter": {
    "duration": 0.0009062,
    "status": "PASSED"
   },
   "oelib.utils.TestTrimVersion.test_num_exception": {
    "duration": 0.0008674,
    "status": "PASSED"
   },
   "oelib.utils.TestTrimVersion.test_valid": {
    "duration": 0.0007124,
    "status": "PASSED"
   },
   "oelib.utils.TestTrimVersion.test_version_exception": {
    "duration": 0.0007746,
    "status": "PASSED"
   },
   "oescripts.OEGitproxyTests.test_oegitproxy_help": {
    "duration": 0.06066,
    "status": "PASSED"
   },
   "oescripts.OEGitproxyTests.test_oegitproxy_proxy": {
    "duration": 0.1313,
    "status": "PASSED"
   },
   "oescripts.OEGitproxyTests.test_oegitproxy_proxy_dash": {
    "duration": 0.1946,
    "status": "PASSED"
   },
   "oescripts.OEListPackageconfigTests.test_packageconfig_flags_default": {
    "duration": 276.092,
    "status": "PASSED"
   },
   "oescripts.OEListPackageconfigTests.test_packageconfig_flags_help": {
    "duration": 0.2258,
    "status": "PASSED"
   },
   "oescripts.OEListPackageconfigTests.test_packageconfig_flags_option_all": {
    "duration": 265.346,
    "status": "PASSED"
   },
   "oescripts.OEListPackageconfigTests.test_packageconfig_flags_option_flags": {
    "duration": 308.849,
    "status": "PASSED"
   },
   "oescripts.OEListPackageconfigTests.test_packageconfig_flags_options_preferred_only": {
    "duration": 331.256,
    "status": "PASSED"
   },
   "oescripts.OEPybootchartguyTests.test_pybootchartguy_help": {
    "duration": 0.1599,
    "status": "PASSED"
   },
   "oescripts.OEPybootchartguyTests.test_pybootchartguy_to_generate_build_pdf_output": {
    "duration": 0.2586,
    "status": "PASSED"
   },
   "oescripts.OEPybootchartguyTests.test_pybootchartguy_to_generate_build_png_output": {
    "duration": 0.4169,
    "status": "PASSED"
   },
   "oescripts.OEPybootchartguyTests.test_pybootchartguy_to_generate_build_svg_output": {
    "duration": 0.2853,
    "status": "PASSED"
   },
   "oescripts.OeRunNativeTest.test_oe_run_native": {
    "duration": 15.808,
    "status": "PASSED"
   },
   "overlayfs.OverlayFSEtcRunTimeTests.test_all_required_variables_set": {
    "duration": 1624.535,
    "oetags": [
     "runqemu"
    ],
    "status": "PASSED"
   },
   "overlayfs.OverlayFSEtcRunTimeTests.test_image_feature_conflict": {
    "duration": 6.03,
    "oetags": [
     "runqemu"
    ],
    "status": "PASSED"
   },
   "overlayfs.OverlayFSEtcRunTimeTests.test_image_feature_is_missing": {
    "duration": 297.318,
    "oetags": [
     "runqemu"
    ],
    "status": "PASSED"
   },
   "overlayfs.OverlayFSEtcRunTimeTests.test_lower_layer_access": {
    "duration": 347.797,
    "oetags": [
     "runqemu"
    ],
    "status": "PASSED"
   },
   "overlayfs.OverlayFSEtcRunTimeTests.test_postinst_on_target_for_read_only_rootfs": {
    "duration": 119.879,
    "oetags": [
     "runqemu"
    ],
    "status": "PASSED"
   },
   "overlayfs.OverlayFSEtcRunTimeTests.test_sbin_init_original": {
    "duration": 133.145,
    "oetags": [
     "runqemu"
    ],
    "status": "PASSED"
   },
   "overlayfs.OverlayFSEtcRunTimeTests.test_sbin_init_preinit": {
    "duration": 111.285,
    "oetags": [
     "runqemu"
    ],
    "status": "PASSED"
   },
   "overlayfs.OverlayFSEtcRunTimeTests.test_sbin_init_read_only": {
    "duration": 106.439,
    "oetags": [
     "runqemu"
    ],
    "status": "PASSED"
   },
   "overlayfs.OverlayFSTests.test_correct_image_fstab": {
    "duration": 898.228,
    "oetags": [
     "runqemu"
    ],
    "status": "PASSED"
   },
   "overlayfs.OverlayFSTests.test_correct_image_unit": {
    "duration": 97.259,
    "oetags": [
     "runqemu"
    ],
    "status": "PASSED"
   },
   "overlayfs.OverlayFSTests.test_distro_features_missing": {
    "duration": 26.948,
    "status": "PASSED"
   },
   "overlayfs.OverlayFSTests.test_mount_unit_not_set": {
    "duration": 17.16,
    "status": "PASSED"
   },
   "overlayfs.OverlayFSTests.test_not_all_units_installed": {
    "duration": 269.382,
    "status": "PASSED"
   },
   "overlayfs.OverlayFSTests.test_not_all_units_installed_but_qa_skipped": {
    "duration": 78.646,
    "status": "PASSED"
   },
   "overlayfs.OverlayFSTests.test_wrong_mount_unit_set": {
    "duration": 17.947,
    "status": "PASSED"
   },
   "package.PackageTests.test_gdb_hardlink_debug": {
    "duration": 95.439,
    "status": "PASSED"
   },
   "package.PackageTests.test_package_name_conflict": {
    "duration": 19.226,
    "status": "PASSED"
   },
   "package.PackageTests.test_preserve_ownership": {
    "duration": 95.986,
    "status": "PASSED"
   },
   "package.PackageTests.test_preserve_sparse_hardlinks": {
    "duration": 47.282,
    "status": "PASSED"
   },
   "package.VersionOrdering.test_dpkg": {
    "duration": 0.02295,
    "status": "PASSED"
   },
   "package.VersionOrdering.test_opkg": {
    "duration": 0.03028,
    "status": "PASSED"
   },
   "package.VersionOrdering.test_rpm": {
    "duration": 0.1886,
    "status": "PASSED"
   },
   "picolibc.PicolibcTest.test_picolibc": {
    "duration": 0.8001,
    "log": "This test only works with machines : qemuarm qemuarm64 qemuriscv32 qemuriscv64\n",
    "status": "SKIPPED"
   },
   "pkgdata.OePkgdataUtilTests.test_find_path": {
    "duration": 2.706,
    "status": "PASSED"
   },
   "pkgdata.OePkgdataUtilTests.test_glob": {
    "duration": 1.978,
    "status": "PASSED"
   },
   "pkgdata.OePkgdataUtilTests.test_list_pkg_files": {
    "duration": 8.05,
    "status": "PASSED"
   },
   "pkgdata.OePkgdataUtilTests.test_list_pkgs": {
    "duration": 7.999,
    "status": "PASSED"
   },
   "pkgdata.OePkgdataUtilTests.test_lookup_pkg": {
    "duration": 5.898,
    "status": "PASSED"
   },
   "pkgdata.OePkgdataUtilTests.test_lookup_recipe": {
    "duration": 3.267,
    "status": "PASSED"
   },
   "pkgdata.OePkgdataUtilTests.test_multilib_variables": {
    "duration": 2236.848,
    "status": "PASSED"
   },
   "pkgdata.OePkgdataUtilTests.test_no_param": {
    "duration": 0.05744,
    "status": "PASSED"
   },
   "pkgdata.OePkgdataUtilTests.test_read_value": {
    "duration": 3.138,
    "status": "PASSED"
   },
   "pkgdata.OePkgdataUtilTests.test_specify_pkgdatadir": {
    "duration": 1.134,
    "status": "PASSED"
   },
   "pokybleeding.PokyBleeding.test_poky_bleeding_autorev": {
    "duration": 74.794,
    "status": "PASSED"
   },
   "prservice.BitbakePrTests.test_import_export_override_db": {
    "duration": 1271.131,
    "status": "PASSED"
   },
   "prservice.BitbakePrTests.test_import_export_replace_db": {
    "duration": 122.73,
    "status": "PASSED"
   },
   "prservice.BitbakePrTests.test_pr_service_deb_arch_dep": {
    "duration": 84.666,
    "status": "PASSED"
   },
   "prservice.BitbakePrTests.test_pr_service_deb_arch_indep": {
    "duration": 37.941,
    "status": "PASSED"
   },
   "prservice.BitbakePrTests.test_pr_service_ipk_arch_dep": {
    "duration": 90.327,
    "status": "PASSED"
   },
   "prservice.BitbakePrTests.test_pr_service_ipk_arch_indep": {
    "duration": 33.303,
    "status": "PASSED"
   },
   "prservice.BitbakePrTests.test_pr_service_rpm_arch_dep": {
    "duration": 57.732,
    "status": "PASSED"
   },
   "prservice.BitbakePrTests.test_pr_service_rpm_arch_indep": {
    "duration": 28.431,
    "status": "PASSED"
   },
   "prservice.BitbakePrTests.test_stopping_prservice_message": {
    "duration": 0.3061,
    "status": "PASSED"
   },
   "pseudo.Pseudo.test_pseudo_pyc_creation": {
    "duration": 11.399,
    "status": "PASSED"
   },
   "recipetool.RecipetoolAppendTests.test_recipetool_appendfile_add": {
    "duration": 82.423,
    "status": "PASSED"
   },
   "recipetool.RecipetoolAppendTests.test_recipetool_appendfile_add_bindir": {
    "duration": 34.172,
    "status": "PASSED"
   },
   "recipetool.RecipetoolAppendTests.test_recipetool_appendfile_add_machine": {
    "duration": 35.072,
    "status": "PASSED"
   },
   "recipetool.RecipetoolAppendTests.test_recipetool_appendfile_alternatives": {
    "duration": 36.111,
    "status": "PASSED"
   },
   "recipetool.RecipetoolAppendTests.test_recipetool_appendfile_basic": {
    "duration": 35.615,
    "status": "PASSED"
   },
   "recipetool.RecipetoolAppendTests.test_recipetool_appendfile_binary": {
    "duration": 25.175,
    "status": "PASSED"
   },
   "recipetool.RecipetoolAppendTests.test_recipetool_appendfile_extlayer": {
    "duration": 8.375,
    "status": "PASSED"
   },
   "recipetool.RecipetoolAppendTests.test_recipetool_appendfile_inst_func": {
    "duration": 33.903,
    "status": "PASSED"
   },
   "recipetool.RecipetoolAppendTests.test_recipetool_appendfile_inst_glob": {
    "duration": 28.999,
    "status": "PASSED"
   },
   "recipetool.RecipetoolAppendTests.test_recipetool_appendfile_inst_todir_glob": {
    "duration": 31.395,
    "status": "PASSED"
   },
   "recipetool.RecipetoolAppendTests.test_recipetool_appendfile_invalid": {
    "duration": 32.624,
    "status": "PASSED"
   },
   "recipetool.RecipetoolAppendTests.test_recipetool_appendfile_orig": {
    "duration": 36.023,
    "status": "PASSED"
   },
   "recipetool.RecipetoolAppendTests.test_recipetool_appendfile_patch": {
    "duration": 29.908,
    "status": "PASSED"
   },
   "recipetool.RecipetoolAppendTests.test_recipetool_appendfile_postinstall": {
    "duration": 34.292,
    "status": "PASSED"
   },
   "recipetool.RecipetoolAppendTests.test_recipetool_appendfile_renamed": {
    "duration": 30.766,
    "status": "PASSED"
   },
   "recipetool.RecipetoolAppendTests.test_recipetool_appendfile_script": {
    "duration": 31.8,
    "status": "PASSED"
   },
   "recipetool.RecipetoolAppendTests.test_recipetool_appendfile_subdir": {
    "duration": 35.548,
    "status": "PASSED"
   },
   "recipetool.RecipetoolAppendTests.test_recipetool_appendfile_todir": {
    "duration": 34.502,
    "status": "PASSED"
   },
   "recipetool.RecipetoolAppendTests.test_recipetool_appendfile_wildcard": {
    "duration": 15.303,
    "status": "PASSED"
   },
   "recipetool.RecipetoolAppendsrcTests.test_recipetool_appendsrcfile_basic": {
    "duration": 78.087,
    "status": "PASSED"
   },
   "recipetool.RecipetoolAppendsrcTests.test_recipetool_appendsrcfile_basic_wildcard": {
    "duration": 46.283,
    "status": "PASSED"
   },
   "recipetool.RecipetoolAppendsrcTests.test_recipetool_appendsrcfile_existing_in_src_uri": {
    "duration": 23.611,
    "status": "PASSED"
   },
   "recipetool.RecipetoolAppendsrcTests.test_recipetool_appendsrcfile_existing_in_src_uri_diff_params": {
    "duration": 21.244,
    "status": "PASSED"
   },
   "recipetool.RecipetoolAppendsrcTests.test_recipetool_appendsrcfile_machine": {
    "duration": 55.26,
    "status": "PASSED"
   },
   "recipetool.RecipetoolAppendsrcTests.test_recipetool_appendsrcfile_replace_file_srcdir": {
    "duration": 33.09,
    "status": "PASSED"
   },
   "recipetool.RecipetoolAppendsrcTests.test_recipetool_appendsrcfile_srcdir_basic": {
    "duration": 24.906,
    "status": "PASSED"
   },
   "recipetool.RecipetoolAppendsrcTests.test_recipetool_appendsrcfile_subdir_basic": {
    "duration": 34.313,
    "status": "PASSED"
   },
   "recipetool.RecipetoolAppendsrcTests.test_recipetool_appendsrcfile_subdir_basic_dirdest": {
    "duration": 33.846,
    "status": "PASSED"
   },
   "recipetool.RecipetoolAppendsrcTests.test_recipetool_appendsrcfile_update_recipe_basic": {
    "duration": 9.414,
    "status": "PASSED"
   },
   "recipetool.RecipetoolAppendsrcTests.test_recipetool_appendsrcfiles_basic": {
    "duration": 46.308,
    "status": "PASSED"
   },
   "recipetool.RecipetoolAppendsrcTests.test_recipetool_appendsrcfiles_basic_subdir": {
    "duration": 45.046,
    "status": "PASSED"
   },
   "recipetool.RecipetoolCreateTests.test_recipetool_create": {
    "duration": 31.624,
    "status": "PASSED"
   },
   "recipetool.RecipetoolCreateTests.test_recipetool_create_autotools": {
    "duration": 75.356,
    "status": "PASSED"
   },
   "recipetool.RecipetoolCreateTests.test_recipetool_create_cmake": {
    "duration": 32.412,
    "status": "PASSED"
   },
   "recipetool.RecipetoolCreateTests.test_recipetool_create_git_http": {
    "duration": 33.62,
    "status": "PASSED"
   },
   "recipetool.RecipetoolCreateTests.test_recipetool_create_git_srcbranch": {
    "duration": 30.158,
    "status": "PASSED"
   },
   "recipetool.RecipetoolCreateTests.test_recipetool_create_git_srcuri_branch": {
    "duration": 31.116,
    "status": "PASSED"
   },
   "recipetool.RecipetoolCreateTests.test_recipetool_create_git_srcuri_master": {
    "duration": 32.264,
    "status": "PASSED"
   },
   "recipetool.RecipetoolCreateTests.test_recipetool_create_github": {
    "duration": 35.881,
    "status": "PASSED"
   },
   "recipetool.RecipetoolCreateTests.test_recipetool_create_github_tarball": {
    "duration": 34.152,
    "status": "PASSED"
   },
   "recipetool.RecipetoolCreateTests.test_recipetool_create_go": {
    "duration": 56.276,
    "status": "PASSED"
   },
   "recipetool.RecipetoolCreateTests.test_recipetool_create_npm": {
    "duration": 1.36,
    "log": "Test needs meta-oe for nodejs\n",
    "status": "SKIPPED"
   },
   "recipetool.RecipetoolCreateTests.test_recipetool_create_python3_pep517_flit_core_buildapi": {
    "duration": 29.674,
    "status": "PASSED"
   },
   "recipetool.RecipetoolCreateTests.test_recipetool_create_python3_pep517_hatchling": {
    "duration": 33.128,
    "status": "PASSED"
   },
   "recipetool.RecipetoolCreateTests.test_recipetool_create_python3_pep517_maturin": {
    "duration": 32.501,
    "status": "PASSED"
   },
   "recipetool.RecipetoolCreateTests.test_recipetool_create_python3_pep517_mesonpy": {
    "duration": 32.135,
    "status": "PASSED"
   },
   "recipetool.RecipetoolCreateTests.test_recipetool_create_python3_pep517_poetry_core_masonry_api": {
    "duration": 33.561,
    "status": "PASSED"
   },
   "recipetool.RecipetoolCreateTests.test_recipetool_create_python3_pep517_setuptools_build_meta": {
    "duration": 36.485,
    "status": "PASSED"
   },
   "recipetool.RecipetoolCreateTests.test_recipetool_create_python3_pep517_setuptools_build_meta_license_pep639": {
    "duration": 35.265,
    "status": "PASSED"
   },
   "recipetool.RecipetoolCreateTests.test_recipetool_create_python3_pep517_setuptools_build_meta_license_prepep639": {
    "duration": 33.561,
    "status": "PASSED"
   },
   "recipetool.RecipetoolCreateTests.test_recipetool_create_python3_setuptools": {
    "duration": 34.204,
    "status": "PASSED"
   },
   "recipetool.RecipetoolCreateTests.test_recipetool_create_python3_setuptools_pypi": {
    "duration": 61.797,
    "status": "PASSED"
   },
   "recipetool.RecipetoolCreateTests.test_recipetool_create_python3_setuptools_pypi_tarball": {
    "duration": 33.361,
    "status": "PASSED"
   },
   "recipetool.RecipetoolCreateTests.test_recipetool_create_simple": {
    "duration": 33.263,
    "status": "PASSED"
   },
   "recipetool.RecipetoolTests.test_recipetool_handle_license_vars": {
    "duration": 2.061,
    "status": "PASSED"
   },
   "recipetool.RecipetoolTests.test_recipetool_load_plugin": {
    "duration": 9.581,
    "status": "PASSED"
   },
   "recipetool.RecipetoolTests.test_recipetool_split_pkg_licenses": {
    "duration": 0.01144,
    "status": "PASSED"
   },
   "recipeutils.RecipeUtilsTests.test_patch_recipe_appends": {
    "duration": 0.1028,
    "status": "PASSED"
   },
   "recipeutils.RecipeUtilsTests.test_patch_recipe_singleappend": {
    "duration": 0.1062,
    "status": "PASSED"
   },
   "recipeutils.RecipeUtilsTests.test_patch_recipe_varflag": {
    "duration": 0.0755,
    "status": "PASSED"
   },
   "recipeutils.RecipeUtilsTests.test_split_var_value": {
    "duration": 0.00697,
    "status": "PASSED"
   },
   "recipeutils.RecipeUtilsTests.test_validate_pn": {
    "duration": 0.006528,
    "status": "PASSED"
   },
   "reproducible.DiffoscopeTests.test_diffoscope": {
    "log": "Skip by the command line argument \"reproducible\"\n",
    "status": "SKIPPED"
   },
   "reproducible.ReproducibleTests.test_reproducible_builds": {
    "log": "Skip by the command line argument \"reproducible\"\n",
    "status": "SKIPPED"
   },
   "resulttooltests.ResultToolTests.test_can_compare_ltp_tests": {
    "duration": 0.005906,
    "status": "PASSED"
   },
   "resulttooltests.ResultToolTests.test_can_match_non_static_ptest_names": {
    "duration": 0.00594,
    "status": "PASSED"
   },
   "resulttooltests.ResultToolTests.test_can_not_compare_non_ltp_tests": {
    "duration": 0.005658,
    "status": "PASSED"
   },
   "resulttooltests.ResultToolTests.test_junit_empty_testresults": {
    "duration": 0.005461,
    "status": "PASSED"
   },
   "resulttooltests.ResultToolTests.test_junit_log_attached": {
    "duration": 0.006039,
    "status": "PASSED"
   },
   "resulttooltests.ResultToolTests.test_junit_log_inline": {
    "duration": 0.005465,
    "status": "PASSED"
   },
   "resulttooltests.ResultToolTests.test_junit_missing_image_tests": {
    "duration": 0.005488,
    "status": "PASSED"
   },
   "resulttooltests.ResultToolTests.test_junit_missing_ptests": {
    "duration": 0.005674,
    "status": "PASSED"
   },
   "resulttooltests.ResultToolTests.test_machine_matches": {
    "duration": 0.00556,
    "status": "PASSED"
   },
   "resulttooltests.ResultToolTests.test_machine_mismatches": {
    "duration": 0.00563,
    "status": "PASSED"
   },
   "resulttooltests.ResultToolTests.test_merge_can_merged_results": {
    "duration": 0.004661,
    "status": "PASSED"
   },
   "resulttooltests.ResultToolTests.test_metadata_matching_is_only_checked_for_relevant_test_type": {
    "duration": 0.004068,
    "status": "PASSED"
   },
   "resulttooltests.ResultToolTests.test_regression_can_get_regression_base_target_pair": {
    "duration": 0.004076,
    "status": "PASSED"
   },
   "resulttooltests.ResultToolTests.test_regression_can_get_regression_result": {
    "duration": 0.004065,
    "status": "PASSED"
   },
   "resulttooltests.ResultToolTests.test_report_can_aggregate_test_result": {
    "duration": 0.004081,
    "status": "PASSED"
   },
   "resulttooltests.ResultToolTests.test_results_with_matching_metadata_can_be_compared": {
    "duration": 0.004047,
    "status": "PASSED"
   },
   "resulttooltests.ResultToolTests.test_results_with_mismatching_metadata_can_not_be_compared": {
    "duration": 0.004019,
    "status": "PASSED"
   },
   "resulttooltests.ResultToolTests.test_results_without_metadata_can_be_compared": {
    "duration": 0.00403,
    "status": "PASSED"
   },
   "resulttooltests.ResultToolTests.test_target_result_with_missing_metadata_can_not_be_compared": {
    "duration": 0.003979,
    "status": "PASSED"
   },
   "retain.Retain.test_retain_always": {
    "duration": 40.442,
    "status": "PASSED"
   },
   "retain.Retain.test_retain_failure": {
    "duration": 52.432,
    "status": "PASSED"
   },
   "retain.Retain.test_retain_global": {
    "duration": 78.853,
    "status": "PASSED"
   },
   "retain.Retain.test_retain_misc": {
    "duration": 86.654,
    "status": "PASSED"
   },
   "rootfspostcommandstests.ShadowUtilsTidyFiles.test_shadowutils_backup_files": {
    "duration": 28.158,
    "log": "Testcase skipped as 'tidy_shadowutils_files' rootfs post process command is not the set SORT_PASSWD_POSTPROCESS_COMMAND.\n",
    "status": "SKIPPED"
   },
   "rootfspostcommandstests.ShadowUtilsTidyFiles.test_shadowutils_sorted_files": {
    "duration": 7.152,
    "log": "Testcase skipped as 'tidy_shadowutils_files' rootfs post process command is not the set SORT_PASSWD_POSTPROCESS_COMMAND.\n",
    "status": "SKIPPED"
   },
   "rpmtests.BitbakeTests.test_rpm_filenames": {
    "duration": 6.63,
    "status": "PASSED"
   },
   "runcmd.RunCmdTests.test_list_not_found": {
    "duration": 0.007102,
    "status": "PASSED"
   },
   "runcmd.RunCmdTests.test_list_okay": {
    "duration": 0.7194,
    "status": "PASSED"
   },
   "runcmd.RunCmdTests.test_log": {
    "duration": 0.007428,
    "status": "PASSED"
   },
   "runcmd.RunCmdTests.test_log_split": {
    "duration": 0.007242,
    "status": "PASSED"
   },
   "runcmd.RunCmdTests.test_no_shell": {
    "duration": 0.006531,
    "status": "PASSED"
   },
   "runcmd.RunCmdTests.test_output": {
    "duration": 0.005877,
    "status": "PASSED"
   },
   "runcmd.RunCmdTests.test_output_split": {
    "duration": 0.007039,
    "status": "PASSED"
   },
   "runcmd.RunCmdTests.test_result_assertion": {
    "duration": 0.2184,
    "status": "PASSED"
   },
   "runcmd.RunCmdTests.test_result_exception": {
    "duration": 0.08235,
    "status": "PASSED"
   },
   "runcmd.RunCmdTests.test_result_false": {
    "duration": 0.03008,
    "status": "PASSED"
   },
   "runcmd.RunCmdTests.test_result_okay": {
    "duration": 0.0194,
    "status": "PASSED"
   },
   "runcmd.RunCmdTests.test_shell": {
    "duration": 0.02152,
    "status": "PASSED"
   },
   "runcmd.RunCmdTests.test_stdin": {
    "duration": 0.008034,
    "status": "PASSED"
   },
   "runcmd.RunCmdTests.test_stdin_timeout": {
    "duration": 10.008,
    "status": "PASSED"
   },
   "runcmd.RunCmdTests.test_timeout": {
    "duration": 10.007,
    "status": "PASSED"
   },
   "runcmd.RunCmdTests.test_timeout_split": {
    "duration": 10.011,
    "status": "PASSED"
   },
   "runqemu.RunqemuTests.test_boot_compressed_wic_by_path": {
    "duration": 136.915,
    "oetags": [
     "runqemu"
    ],
    "status": "PASSED"
   },
   "runqemu.RunqemuTests.test_boot_compressed_wic_by_recipe": {
    "duration": 24.448,
    "oetags": [
     "runqemu"
    ],
    "status": "PASSED"
   },
   "runqemu.RunqemuTests.test_boot_deploy": {
    "duration": 20.848,
    "oetags": [
     "runqemu"
    ],
    "status": "PASSED"
   },
   "runqemu.RunqemuTests.test_boot_deploy_hddimg": {
    "duration": 20.273,
    "oetags": [
     "runqemu"
    ],
    "status": "PASSED"
   },
   "runqemu.RunqemuTests.test_boot_machine": {
    "duration": 23.608,
    "oetags": [
     "runqemu"
    ],
    "status": "PASSED"
   },
   "runqemu.RunqemuTests.test_boot_machine_ext4": {
    "duration": 28.897,
    "oetags": [
     "runqemu"
    ],
    "status": "PASSED"
   },
   "runqemu.RunqemuTests.test_boot_machine_iso": {
    "duration": 23.674,
    "oetags": [
     "runqemu"
    ],
    "status": "PASSED"
   },
   "runqemu.RunqemuTests.test_boot_machine_slirp": {
    "duration": 26.406,
    "oetags": [
     "runqemu"
    ],
    "status": "PASSED"
   },
   "runqemu.RunqemuTests.test_boot_machine_slirp_qcow2": {
    "duration": 25.325,
    "oetags": [
     "runqemu"
    ],
    "status": "PASSED"
   },
   "runqemu.RunqemuTests.test_boot_qemu_boot": {
    "duration": 25.24,
    "oetags": [
     "runqemu"
    ],
    "status": "PASSED"
   },
   "runqemu.RunqemuTests.test_boot_recipe_image": {
    "duration": 27.043,
    "oetags": [
     "runqemu"
    ],
    "status": "PASSED"
   },
   "runqemu.RunqemuTests.test_boot_recipe_image_vdi": {
    "duration": 25.578,
    "oetags": [
     "runqemu"
    ],
    "status": "PASSED"
   },
   "runqemu.RunqemuTests.test_boot_recipe_image_vmdk": {
    "duration": 25.625,
    "oetags": [
     "runqemu"
    ],
    "status": "PASSED"
   },
   "runqemu.RunqemuTests.test_boot_rootfs": {
    "duration": 20.757,
    "oetags": [
     "runqemu"
    ],
    "status": "PASSED"
   },
   "runtime_test.Postinst.test_failing_postinst": {
    "duration": 170.43,
    "oetags": [
     "runqemu"
    ],
    "status": "PASSED"
   },
   "runtime_test.Postinst.test_postinst_rootfs_and_boot_systemd": {
    "duration": 566.696,
    "oetags": [
     "runqemu"
    ],
    "status": "PASSED"
   },
   "runtime_test.Postinst.test_postinst_rootfs_and_boot_sysvinit": {
    "duration": 279.632,
    "oetags": [
     "runqemu"
    ],
    "status": "PASSED"
   },
   "runtime_test.RustKernel.test_kernel_rust_sample": {
    "duration": 88.776,
    "oetags": [
     "runqemu"
    ],
    "status": "PASSED"
   },
   "runtime_test.SystemTap.test_crosstap_helloworld": {
    "duration": 297.451,
    "oetags": [
     "runqemu"
    ],
    "status": "PASSED"
   },
   "runtime_test.SystemTap.test_crosstap_pstree": {
    "duration": 52.381,
    "oetags": [
     "runqemu"
    ],
    "status": "PASSED"
   },
   "runtime_test.SystemTap.test_crosstap_syscalls_by_pid": {
    "duration": 50.484,
    "oetags": [
     "runqemu"
    ],
    "status": "PASSED"
   },
   "runtime_test.SystemTap.test_crosstap_syscalls_by_proc": {
    "duration": 48.954,
    "oetags": [
     "runqemu"
    ],
    "status": "PASSED"
   },
   "runtime_test.TestExport.test_testexport_basic": {
    "duration": 106.708,
    "oetags": [
     "runqemu"
    ],
    "status": "PASSED"
   },
   "runtime_test.TestExport.test_testexport_sdk": {
    "duration": 116.863,
    "status": "PASSED"
   },
   "runtime_test.TestImage.test_testimage_apt": {
    "duration": 237.149,
    "oetags": [
     "runqemu"
    ],
    "status": "PASSED"
   },
   "runtime_test.TestImage.test_testimage_dnf": {
    "duration": 159.013,
    "oetags": [
     "runqemu"
    ],
    "status": "PASSED"
   },
   "runtime_test.TestImage.test_testimage_install": {
    "duration": 124.967,
    "oetags": [
     "runqemu"
    ],
    "status": "PASSED"
   },
   "runtime_test.TestImage.test_testimage_slirp": {
    "duration": 97.371,
    "oetags": [
     "runqemu"
    ],
    "status": "PASSED"
   },
   "runtime_test.TestImage.test_testimage_virgl_gtk_sdl": {
    "duration": 250.433,
    "oetags": [
     "runqemu"
    ],
    "status": "PASSED"
   },
   "runtime_test.TestImage.test_testimage_virgl_headless": {
    "duration": 81.131,
    "oetags": [
     "runqemu"
    ],
    "status": "PASSED"
   },
   "rust.RustStaticMuslTest.test_static_musl_linking": {
    "duration": 56.18,
    "status": "PASSED"
   },
   "sdk.SDKTests.test_sdk_manifests": {
    "duration": 470.419,
    "status": "PASSED"
   },
   "sdk.SDKTests.test_sdk_runqemu": {
    "duration": 497.104,
    "status": "PASSED"
   },
   "selftest.ExternalLayer.test_list_imported": {
    "duration": 0.00934,
    "status": "PASSED"
   },
   "signing.LockedSignatures.test_locked_signatures": {
    "duration": 126.12,
    "status": "PASSED"
   },
   "signing.Signing.test_signing_packages": {
    "duration": 1624.868,
    "status": "PASSED"
   },
   "signing.Signing.test_signing_sstate_archive": {
    "duration": 185.105,
    "status": "PASSED"
   },
   "spdx.SPDX30Check.test_baremetal_helloworld": {
    "duration": 73.912,
    "status": "PASSED"
   },
   "spdx.SPDX30Check.test_base_files": {
    "duration": 48.886,
    "status": "PASSED"
   },
   "spdx.SPDX30Check.test_core_image_minimal": {
    "duration": 71.293,
    "status": "PASSED"
   },
   "spdx.SPDX30Check.test_core_image_minimal_sdk": {
    "duration": 350.145,
    "status": "PASSED"
   },
   "spdx.SPDX30Check.test_custom_annotation_vars": {
    "duration": 28.189,
    "status": "PASSED"
   },
   "spdx.SPDX30Check.test_download_location_defensive_handling": {
    "duration": 12.901,
    "status": "PASSED"
   },
   "spdx.SPDX30Check.test_extra_opts": {
    "duration": 182.558,
    "status": "PASSED"
   },
   "spdx.SPDX30Check.test_gcc_include_source": {
    "duration": 1029.918,
    "status": "PASSED"
   },
   "spdx.SPDX30Check.test_kernel_config_spdx": {
    "duration": 47.143,
    "status": "PASSED"
   },
   "spdx.SPDX30Check.test_packageconfig_spdx": {
    "duration": 34.237,
    "status": "PASSED"
   },
   "spdx.SPDX30Check.test_version_extraction_patterns": {
    "duration": 14.687,
    "status": "PASSED"
   },
   "spdx.SPDX30Check.test_world_sbom": {
    "duration": 46.107,
    "status": "PASSED"
   },
   "sstatetests.SStateCacheManagement.test_sstate_cache_management_script_using_machine": {
    "duration": 159.207,
    "status": "PASSED"
   },
   "sstatetests.SStateCacheManagement.test_sstate_cache_management_script_using_pr_1": {
    "duration": 148.172,
    "status": "PASSED"
   },
   "sstatetests.SStateCacheManagement.test_sstate_cache_management_script_using_pr_2": {
    "duration": 180.315,
    "status": "PASSED"
   },
   "sstatetests.SStateCacheManagement.test_sstate_cache_management_script_using_pr_3": {
    "duration": 337.189,
    "status": "PASSED"
   },
   "sstatetests.SStateCleanup.test_cleansstate_task_distro_nonspecific": {
    "duration": 41.922,
    "status": "PASSED"
   },
   "sstatetests.SStateCleanup.test_cleansstate_task_distro_specific": {
    "duration": 48.07,
    "status": "PASSED"
   },
   "sstatetests.SStateCleanup.test_cleansstate_task_distro_specific_nonspecific": {
    "duration": 40.435,
    "status": "PASSED"
   },
   "sstatetests.SStateCreation.test_sstate_creation_distro_nonspecific": {
    "duration": 38.892,
    "status": "PASSED"
   },
   "sstatetests.SStateCreation.test_sstate_creation_distro_specific": {
    "duration": 33.814,
    "status": "PASSED"
   },
   "sstatetests.SStateDistroTests.test_rebuild_distro_specific_sstate_cross_native_targets": {
    "duration": 68.698,
    "status": "PASSED"
   },
   "sstatetests.SStateDistroTests.test_rebuild_distro_specific_sstate_cross_target": {
    "duration": 56.439,
    "status": "PASSED"
   },
   "sstatetests.SStateDistroTests.test_rebuild_distro_specific_sstate_native_target": {
    "duration": 64.213,
    "status": "PASSED"
   },
   "sstatetests.SStateFindSiginfo.test_sstate_compare_sigfiles_and_find_siginfo": {
    "duration": 667.64,
    "status": "PASSED"
   },
   "sstatetests.SStateHashSameSigs.test_sstate_32_64_same_hash": {
    "duration": 109.809,
    "status": "PASSED"
   },
   "sstatetests.SStateHashSameSigs.test_sstate_nativelsbstring_same_hash": {
    "duration": 107.322,
    "status": "PASSED"
   },
   "sstatetests.SStateHashSameSigs.test_sstate_sdk_arch_same_hash": {
    "duration": 118.519,
    "status": "PASSED"
   },
   "sstatetests.SStateHashSameSigs2.test_sstate_allarch_samesigs": {
    "duration": 127.615,
    "status": "PASSED"
   },
   "sstatetests.SStateHashSameSigs2.test_sstate_nativesdk_samesigs_multilib": {
    "duration": 181.067,
    "status": "PASSED"
   },
   "sstatetests.SStateHashSameSigs3.test_sstate_multilib_or_not_native_samesigs": {
    "duration": 84.509,
    "status": "PASSED"
   },
   "sstatetests.SStateHashSameSigs3.test_sstate_sametune_samesigs": {
    "duration": 224.135,
    "status": "PASSED"
   },
   "sstatetests.SStateHashSameSigs4.test_sstate_movelayer_samesigs": {
    "duration": 88.386,
    "status": "PASSED"
   },
   "sstatetests.SStateHashSameSigs4.test_sstate_noop_samesigs": {
    "duration": 147.283,
    "status": "PASSED"
   },
   "sstatetests.SStatePrintdiff.test_gcc_runtime_vs_gcc_source": {
    "duration": 1004.675,
    "status": "PASSED"
   },
   "sstatetests.SStatePrintdiff.test_image_minimal_vs_base_do_configure": {
    "duration": 598.118,
    "status": "PASSED"
   },
   "sstatetests.SStatePrintdiff.test_image_minimal_vs_perlcross": {
    "duration": 317.46,
    "status": "PASSED"
   },
   "sstatetests.SStateTests.test_autorev_sstate_works": {
    "duration": 110.032,
    "status": "PASSED"
   },
   "sysroot.SysrootTests.test_sysroot_cleanup": {
    "duration": 86.052,
    "status": "PASSED"
   },
   "sysroot.SysrootTests.test_sysroot_la": {
    "duration": 36.52,
    "status": "PASSED"
   },
   "sysroot.SysrootTests.test_sysroot_max_shebang": {
    "duration": 17.551,
    "status": "PASSED"
   },
   "sysroot.SysrootTests.test_sysroot_pkgconfig": {
    "duration": 33.333,
    "status": "PASSED"
   },
   "systemd_boot.Systemdboot.test_efi_systemdboot_images_can_be_built": {
    "duration": 391.99,
    "status": "PASSED"
   },
   "tinfoil.TinfoilTests.test_datastore_operations": {
    "duration": 0.6315,
    "status": "PASSED"
   },
   "tinfoil.TinfoilTests.test_expand": {
    "duration": 0.5094,
    "status": "PASSED"
   },
   "tinfoil.TinfoilTests.test_getvar": {
    "duration": 1.011,
    "status": "PASSED"
   },
   "tinfoil.TinfoilTests.test_getvar_bb_origenv": {
    "duration": 1.014,
    "status": "PASSED"
   },
   "tinfoil.TinfoilTests.test_list_recipes": {
    "duration": 5.127,
    "status": "PASSED"
   },
   "tinfoil.TinfoilTests.test_parse_recipe": {
    "duration": 5.144,
    "status": "PASSED"
   },
   "tinfoil.TinfoilTests.test_parse_recipe_copy_expand": {
    "duration": 5.078,
    "status": "PASSED"
   },
   "tinfoil.TinfoilTests.test_parse_recipe_custom_data": {
    "duration": 4.747,
    "status": "PASSED"
   },
   "tinfoil.TinfoilTests.test_parse_virtual_recipe": {
    "duration": 4.958,
    "status": "PASSED"
   },
   "tinfoil.TinfoilTests.test_parse_virtual_recipe_custom_data": {
    "duration": 4.983,
    "status": "PASSED"
   },
   "tinfoil.TinfoilTests.test_run_prepared_task": {
    "duration": 71.626,
    "status": "PASSED"
   },
   "tinfoil.TinfoilTests.test_setvariable_clean": {
    "duration": 3.021,
    "status": "PASSED"
   },
   "tinfoil.TinfoilTests.test_variable_history": {
    "duration": 4.801,
    "status": "PASSED"
   },
   "tinfoil.TinfoilTests.test_wait_event": {
    "duration": 2.004,
    "status": "PASSED"
   },
   "toolchain.ToolchainTests.test_toolchain_switching": {
    "duration": 111.253,
    "status": "PASSED"
   },
   "uboot.UBootConfigTest.test_uboot_config_extract": {
    "duration": 28.812,
    "status": "PASSED"
   },
   "uboot.UBootConfigTest.test_uboot_config_extract_error_missing_config": {
    "duration": 26.416,
    "status": "PASSED"
   },
   "uboot.UBootConfigTest.test_uboot_config_extract_error_nothing_set": {
    "duration": 27.071,
    "status": "PASSED"
   },
   "uboot.UBootConfigTest.test_uboot_config_extract_error_set_both_config_and_machine": {
    "duration": 25.14,
    "status": "PASSED"
   },
   "uboot.UBootConfigTest.test_uboot_config_extract_error_set_uboot_config_binary": {
    "duration": 26.586,
    "status": "PASSED"
   },
   "uboot.UBootConfigTest.test_uboot_config_extract_error_set_uboot_config_fragments": {
    "duration": 25.166,
    "status": "PASSED"
   },
   "uboot.UBootConfigTest.test_uboot_config_extract_error_set_uboot_config_image_fstypes": {
    "duration": 26.622,
    "status": "PASSED"
   },
   "uboot.UBootConfigTest.test_uboot_config_extract_error_set_uboot_config_make_opts": {
    "duration": 22.338,
    "status": "PASSED"
   },
   "uboot.UBootConfigTest.test_uboot_config_extract_legacy": {
    "duration": 30.798,
    "status": "PASSED"
   },
   "uboot.UBootConfigTest.test_uboot_config_extract_single_config": {
    "duration": 28.141,
    "status": "PASSED"
   },
   "uboot.UBootTest.test_boot_uboot": {
    "duration": 0.001062,
    "log": "Test skipped on x86_64\n",
    "oetags": [
     "runqemu"
    ],
    "status": "SKIPPED"
   },
   "uboot.UBootTest.test_boot_uboot_kvm_to_full_target": {
    "duration": 0.001775,
    "log": "Test skipped on x86_64\n",
    "oetags": [
     "runqemu"
    ],
    "status": "SKIPPED"
   },
   "uboot.UBootTest.test_uboot_config_initial_env_binary": {
    "duration": 122.797,
    "status": "PASSED"
   },
   "uboot.UBootTest.test_uboot_initial_env_binary": {
    "duration": 114.976,
    "status": "PASSED"
   },
   "uki.UkiTest.test_uki_boot_systemd": {
    "duration": 727.666,
    "oetags": [
     "runqemu"
    ],
    "status": "PASSED"
   },
   "uki.UkiTest.test_uki_sysvinit": {
    "duration": 710.24,
    "oetags": [
     "runqemu"
    ],
    "status": "PASSED"
   },
   "usergrouptests.UserGroupTests.test_add_task_between_p_sysroot_and_package": {
    "duration": 25.484,
    "status": "PASSED"
   },
   "usergrouptests.UserGroupTests.test_group_from_dep_package": {
    "duration": 33.817,
    "status": "PASSED"
   },
   "usergrouptests.UserGroupTests.test_postinst_order": {
    "duration": 18.312,
    "status": "PASSED"
   },
   "usergrouptests.UserGroupTests.test_static_useradd_from_dynamic": {
    "duration": 115.662,
    "status": "PASSED"
   },
   "usergrouptests.UserGroupTests.test_useradd_depends_only": {
    "duration": 9.544,
    "status": "PASSED"
   },
   "wic.CLITests.test_createhelp": {
    "duration": 89.885,
    "status": "PASSED"
   },
   "wic.CLITests.test_help": {
    "duration": 4.094,
    "status": "PASSED"
   },
   "wic.CLITests.test_help_create": {
    "duration": 4.206,
    "status": "PASSED"
   },
   "wic.CLITests.test_help_kickstart": {
    "duration": 3.899,
    "status": "PASSED"
   },
   "wic.CLITests.test_help_list": {
    "duration": 5.437,
    "status": "PASSED"
   },
   "wic.CLITests.test_help_overview": {
    "duration": 4.813,
    "status": "PASSED"
   },
   "wic.CLITests.test_help_plugins": {
    "duration": 5.017,
    "status": "PASSED"
   },
   "wic.CLITests.test_list_images": {
    "duration": 6.653,
    "status": "PASSED"
   },
   "wic.CLITests.test_list_source_plugins": {
    "duration": 11.041,
    "status": "PASSED"
   },
   "wic.CLITests.test_listed_images_help": {
    "duration": 71.218,
    "status": "PASSED"
   },
   "wic.CLITests.test_listhelp": {
    "duration": 4.953,
    "status": "PASSED"
   },
   "wic.CLITests.test_no_command": {
    "duration": 4.764,
    "status": "PASSED"
   },
   "wic.CLITests.test_unsupported_subcommand": {
    "duration": 4.433,
    "status": "PASSED"
   },
   "wic.CLITests.test_version": {
    "duration": 4.485,
    "status": "PASSED"
   },
   "wic.ModifyTests.test_wic_cp": {
    "duration": 109.701,
    "status": "PASSED"
   },
   "wic.ModifyTests.test_wic_cp_ext": {
    "duration": 68.393,
    "status": "PASSED"
   },
   "wic.ModifyTests.test_wic_ls": {
    "duration": 40.882,
    "status": "PASSED"
   },
   "wic.ModifyTests.test_wic_ls_ext": {
    "duration": 34.332,
    "status": "PASSED"
   },
   "wic.ModifyTests.test_wic_rm": {
    "duration": 53.48,
    "status": "PASSED"
   },
   "wic.ModifyTests.test_wic_rm_ext": {
    "duration": 57.192,
    "status": "PASSED"
   },
   "wic.Wic.test_bootloader_config": {
    "duration": 270.088,
    "status": "PASSED"
   },
   "wic.Wic.test_build_artifacts": {
    "duration": 40.104,
    "status": "PASSED"
   },
   "wic.Wic.test_build_image_name": {
    "duration": 28.339,
    "status": "PASSED"
   },
   "wic.Wic.test_build_rootfs_long": {
    "duration": 73.426,
    "status": "PASSED"
   },
   "wic.Wic.test_build_rootfs_short": {
    "duration": 44.443,
    "status": "PASSED"
   },
   "wic.Wic.test_change_directory": {
    "duration": 29.274,
    "status": "PASSED"
   },
   "wic.Wic.test_change_directory_errors": {
    "duration": 50.71,
    "status": "PASSED"
   },
   "wic.Wic.test_compress_bzip2": {
    "duration": 33.82,
    "status": "PASSED"
   },
   "wic.Wic.test_compress_gzip": {
    "duration": 30.582,
    "status": "PASSED"
   },
   "wic.Wic.test_compress_xz": {
    "duration": 36.033,
    "status": "PASSED"
   },
   "wic.Wic.test_debug_long": {
    "duration": 31.717,
    "status": "PASSED"
   },
   "wic.Wic.test_debug_short": {
    "duration": 30.995,
    "status": "PASSED"
   },
   "wic.Wic.test_default_output_dir": {
    "duration": 73.57,
    "status": "PASSED"
   },
   "wic.Wic.test_efi_bootpart": {
    "duration": 64.77,
    "status": "PASSED"
   },
   "wic.Wic.test_exclude_path": {
    "duration": 35.633,
    "status": "PASSED"
   },
   "wic.Wic.test_exclude_path_errors": {
    "duration": 51.602,
    "status": "PASSED"
   },
   "wic.Wic.test_exclude_path_with_extra_space": {
    "duration": 105.209,
    "status": "PASSED"
   },
   "wic.Wic.test_extra_space": {
    "duration": 27.323,
    "status": "PASSED"
   },
   "wic.Wic.test_gpt_image": {
    "duration": 28.302,
    "status": "PASSED"
   },
   "wic.Wic.test_grub_install_pcbios": {
    "duration": 104.158,
    "status": "PASSED"
   },
   "wic.Wic.test_include_path": {
    "duration": 36.156,
    "status": "PASSED"
   },
   "wic.Wic.test_include_path_embeded": {
    "duration": 36.313,
    "status": "PASSED"
   },
   "wic.Wic.test_include_path_errors": {
    "duration": 96.766,
    "status": "PASSED"
   },
   "wic.Wic.test_iso_image": {
    "duration": 232.243,
    "status": "PASSED"
   },
   "wic.Wic.test_kernel_install": {
    "duration": 42.535,
    "status": "PASSED"
   },
   "wic.Wic.test_mkefidisk": {
    "duration": 30.756,
    "status": "PASSED"
   },
   "wic.Wic.test_no_fstab_update": {
    "duration": 50.107,
    "status": "PASSED"
   },
   "wic.Wic.test_no_fstab_update_errors": {
    "duration": 52.964,
    "status": "PASSED"
   },
   "wic.Wic.test_no_table": {
    "duration": 27.798,
    "status": "PASSED"
   },
   "wic.Wic.test_partition_hidden_attributes": {
    "duration": 34.095,
    "status": "PASSED"
   },
   "wic.Wic.test_permissions": {
    "duration": 300.481,
    "status": "PASSED"
   },
   "wic.Wic.test_qemux86_directdisk": {
    "duration": 24.068,
    "status": "PASSED"
   },
   "wic.Wic.test_rootfs_artifacts": {
    "duration": 52.665,
    "status": "PASSED"
   },
   "wic.Wic.test_rootfs_indirect_recipes": {
    "duration": 25.345,
    "status": "PASSED"
   },
   "wic.Wic.test_sdimage_bootpart": {
    "duration": 49.577,
    "status": "PASSED"
   },
   "wic.Wic.test_skip_build_check_long": {
    "duration": 23.109,
    "status": "PASSED"
   },
   "wic.Wic.test_skip_build_check_short": {
    "duration": 23.987,
    "status": "PASSED"
   },
   "wic.Wic.test_skip_kernel_install": {
    "duration": 40.52,
    "status": "PASSED"
   },
   "wic.Wic.test_systemd_bootdisk": {
    "duration": 87.829,
    "status": "PASSED"
   },
   "wic.Wic.test_wic_sector_size_cli": {
    "duration": 76.108,
    "status": "PASSED"
   },
   "wic.Wic.test_wic_sector_size_env": {
    "duration": 68.924,
    "status": "PASSED"
   },
   "wic.Wic.test_wrong_compressor": {
    "duration": 5.795,
    "status": "PASSED"
   },
   "wic.Wic2.test_biosplusefi_plugin": {
    "duration": 232.817,
    "status": "PASSED"
   },
   "wic.Wic2.test_biosplusefi_plugin_qemu": {
    "duration": 45.782,
    "oetags": [
     "runqemu"
    ],
    "status": "PASSED"
   },
   "wic.Wic2.test_bmap_long": {
    "duration": 30.075,
    "status": "PASSED"
   },
   "wic.Wic2.test_bmap_short": {
    "duration": 30.005,
    "status": "PASSED"
   },
   "wic.Wic2.test_diskid_on_gpt_partition": {
    "duration": 31.616,
    "status": "PASSED"
   },
   "wic.Wic2.test_diskid_on_msdos_partition": {
    "duration": 28.587,
    "status": "PASSED"
   },
   "wic.Wic2.test_efi_plugin_plain_systemd_boot_qemu_aarch64": {
    "duration": 0.0006714,
    "log": "Test skipped on x86_64\n",
    "oetags": [
     "runqemu"
    ],
    "status": "SKIPPED"
   },
   "wic.Wic2.test_efi_plugin_plain_systemd_boot_qemu_x86": {
    "duration": 485.178,
    "oetags": [
     "runqemu"
    ],
    "status": "PASSED"
   },
   "wic.Wic2.test_efi_plugin_unified_kernel_image_qemu": {
    "duration": 114.073,
    "oetags": [
     "runqemu"
    ],
    "status": "PASSED"
   },
   "wic.Wic2.test_empty_plugin": {
    "duration": 70.861,
    "status": "PASSED"
   },
   "wic.Wic2.test_empty_zeroize_plugin": {
    "duration": 38.212,
    "status": "PASSED"
   },
   "wic.Wic2.test_expand_mbr_image": {
    "duration": 71.124,
    "oetags": [
     "runqemu"
    ],
    "status": "PASSED"
   },
   "wic.Wic2.test_extra_filesystem_space": {
    "duration": 26.739,
    "status": "PASSED"
   },
   "wic.Wic2.test_extra_partition_plugin": {
    "duration": 65.682,
    "status": "PASSED"
   },
   "wic.Wic2.test_extra_partition_space": {
    "duration": 28.551,
    "status": "PASSED"
   },
   "wic.Wic2.test_fixed_size": {
    "duration": 24.35,
    "status": "PASSED"
   },
   "wic.Wic2.test_fixed_size_error": {
    "duration": 23.422,
    "status": "PASSED"
   },
   "wic.Wic2.test_fs_types": {
    "duration": 23.288,
    "status": "PASSED"
   },
   "wic.Wic2.test_gpt_partition_name": {
    "duration": 64.652,
    "status": "PASSED"
   },
   "wic.Wic2.test_image_bootpart_globbed": {
    "duration": 43.361,
    "status": "PASSED"
   },
   "wic.Wic2.test_image_env": {
    "duration": 40.491,
    "status": "PASSED"
   },
   "wic.Wic2.test_image_vars_dir_long": {
    "duration": 8.235,
    "status": "PASSED"
   },
   "wic.Wic2.test_image_vars_dir_short": {
    "duration": 8.572,
    "status": "PASSED"
   },
   "wic.Wic2.test_kickstart_parser": {
    "duration": 22.086,
    "status": "PASSED"
   },
   "wic.Wic2.test_mkfs_extraopts": {
    "duration": 23.976,
    "status": "PASSED"
   },
   "wic.Wic2.test_offset": {
    "duration": 134.263,
    "status": "PASSED"
   },
   "wic.Wic2.test_qemu": {
    "duration": 97.887,
    "oetags": [
     "runqemu"
    ],
    "status": "PASSED"
   },
   "wic.Wic2.test_qemu_efi": {
    "duration": 83.969,
    "oetags": [
     "runqemu"
    ],
    "status": "PASSED"
   },
   "wic.Wic2.test_rawcopy_plugin": {
    "duration": 79.078,
    "status": "PASSED"
   },
   "wic.Wic2.test_rawcopy_plugin_qemu": {
    "duration": 93.685,
    "oetags": [
     "runqemu"
    ],
    "status": "PASSED"
   },
   "wic.Wic2.test_rawcopy_plugin_unpack": {
    "duration": 75.375,
    "status": "PASSED"
   },
   "wic.Wic2.test_uefi_kernel": {
    "duration": 75.972,
    "status": "PASSED"
   },
   "wic.Wic2.test_wic_image_type": {
    "duration": 28.561,
    "status": "PASSED"
   },
   "wrapper.WrapperTests.test_shebang_wrapper": {
    "duration": 33.937,
    "status": "PASSED"
   },
   "yoctotestresultsquerytests.TestResultsQueryTests.test_create_workdir": {
    "duration": 4.25,
    "status": "PASSED"
   },
   "yoctotestresultsquerytests.TestResultsQueryTests.test_get_sha1": {
    "duration": 0.06992,
    "status": "PASSED"
   }
  }
 }
}