{
 "oeselftest_rocky-10.2_qemux86-64_20260926060455": {
  "configuration": {
   "HOST_DISTRO": "rocky-10.2",
   "HOST_NAME": "rocky10-vk-1",
   "LAYERS": {
    "meta": {
     "branch": "master-next",
     "commit": "eb9d909c16b2ad65a9c41a848a7190b6dd26a430",
     "commit_count": 69039,
     "commit_time": 1790401706
    },
    "meta-poky": {
     "branch": "master",
     "commit": "d36c827e02ab138b446386792fd7588b5a041507",
     "commit_count": 1824,
     "commit_time": 1789659791
    },
    "meta-selftest": {
     "branch": "master-next",
     "commit": "eb9d909c16b2ad65a9c41a848a7190b6dd26a430",
     "commit_count": 69039,
     "commit_time": 1790401706
    },
    "meta-yocto-bsp": {
     "branch": "master",
     "commit": "d36c827e02ab138b446386792fd7588b5a041507",
     "commit_count": 1824,
     "commit_time": 1789659791
    }
   },
   "MACHINE": "qemux86-64",
   "OESELFTEST_METADATA": {
    "exclude_tags": [
     "yocto-mirrors",
     "machine",
     "toolchain-user",
     "toolchain-system"
    ],
    "run_all_tests": true,
    "run_tests": null,
    "select_tags": null,
    "skips": [
     "distrodata.Distrodata.test_checkpkg",
     "reproducible"
    ]
   },
   "STARTTIME": "20260926060455",
   "TESTSERIES": "oeqa",
   "TEST_TYPE": "oeselftest"
  },
  "result": {
   "archiver.Archiver.test_archiver_allows_to_filter_on_recipe_name": {
    "duration": 37.595,
    "status": "PASSED"
   },
   "archiver.Archiver.test_archiver_cleanup": {
    "duration": 77.588,
    "status": "PASSED"
   },
   "archiver.Archiver.test_archiver_filters_by_type": {
    "duration": 32.513,
    "status": "PASSED"
   },
   "archiver.Archiver.test_archiver_filters_by_type_and_name": {
    "duration": 38.745,
    "status": "PASSED"
   },
   "archiver.Archiver.test_archiver_mode_configured": {
    "duration": 40.527,
    "status": "PASSED"
   },
   "archiver.Archiver.test_archiver_mode_diff": {
    "duration": 41.114,
    "status": "PASSED"
   },
   "archiver.Archiver.test_archiver_mode_dumpdata": {
    "duration": 11.842,
    "status": "PASSED"
   },
   "archiver.Archiver.test_archiver_mode_mirror": {
    "duration": 49.378,
    "status": "PASSED"
   },
   "archiver.Archiver.test_archiver_mode_mirror_combined": {
    "duration": 59.933,
    "status": "PASSED"
   },
   "archiver.Archiver.test_archiver_mode_mirror_excludes": {
    "duration": 34.884,
    "status": "PASSED"
   },
   "archiver.Archiver.test_archiver_mode_mirror_gitsm": {
    "duration": 20.721,
    "status": "PASSED"
   },
   "archiver.Archiver.test_archiver_mode_mirror_gitsm_shallow": {
    "duration": 78.661,
    "status": "PASSED"
   },
   "archiver.Archiver.test_archiver_mode_original": {
    "duration": 58.183,
    "status": "PASSED"
   },
   "archiver.Archiver.test_archiver_mode_patched": {
    "duration": 16.653,
    "status": "PASSED"
   },
   "archiver.Archiver.test_archiver_mode_recipe": {
    "duration": 55.922,
    "status": "PASSED"
   },
   "archiver.Archiver.test_archiver_multiconfig_shared_unpack_and_patch": {
    "duration": 210.333,
    "status": "PASSED"
   },
   "barebox.BareboxTest.test_boot_barebox": {
    "duration": 0.00217,
    "log": "Test skipped on x86_64\n",
    "oetags": [
     "runqemu"
    ],
    "status": "SKIPPED"
   },
   "baremetal.BaremetalTest.test_baremetal": {
    "duration": 10145.398,
    "status": "PASSED"
   },
   "bbclasses.Systemd.test_systemd_in_distro": {
    "duration": 68.499,
    "status": "PASSED"
   },
   "bbclasses.Systemd.test_sysvinit_in_distro": {
    "duration": 43.159,
    "status": "PASSED"
   },
   "bblayers.BitbakeConfigBuild.test_enable_disable_builtin_fragments": {
    "duration": 10.844,
    "status": "PASSED"
   },
   "bblayers.BitbakeConfigBuild.test_enable_disable_fragments": {
    "duration": 17.538,
    "status": "PASSED"
   },
   "bblayers.BitbakeConfigBuild.test_show_fragment": {
    "duration": 2.341,
    "status": "PASSED"
   },
   "bblayers.BitbakeLayers.test_bitbakelayers_add_remove": {
    "duration": 9.4,
    "status": "PASSED"
   },
   "bblayers.BitbakeLayers.test_bitbakelayers_createlayer": {
    "duration": 7.612,
    "status": "PASSED"
   },
   "bblayers.BitbakeLayers.test_bitbakelayers_flatten": {
    "duration": 73.791,
    "status": "PASSED"
   },
   "bblayers.BitbakeLayers.test_bitbakelayers_layerindexshowdepends": {
    "duration": 1.696,
    "status": "PASSED"
   },
   "bblayers.BitbakeLayers.test_bitbakelayers_setup": {
    "duration": 31.498,
    "status": "PASSED"
   },
   "bblayers.BitbakeLayers.test_bitbakelayers_showappends": {
    "duration": 7.75,
    "status": "PASSED"
   },
   "bblayers.BitbakeLayers.test_bitbakelayers_showcrossdepends": {
    "duration": 27.965,
    "status": "PASSED"
   },
   "bblayers.BitbakeLayers.test_bitbakelayers_showlayers": {
    "duration": 0.5496,
    "status": "PASSED"
   },
   "bblayers.BitbakeLayers.test_bitbakelayers_showoverlayed": {
    "duration": 3.947,
    "status": "PASSED"
   },
   "bblayers.BitbakeLayers.test_bitbakelayers_showrecipes": {
    "duration": 25.513,
    "status": "PASSED"
   },
   "bblayers.BitbakeLayers.test_bitbakelayers_updatelayer": {
    "duration": 5.851,
    "status": "PASSED"
   },
   "bblayers.BitbakeLayers.test_validate_bitbake_setup_default_registry": {
    "duration": 2.796,
    "status": "PASSED"
   },
   "bblayers.BitbakeLayers.test_validate_examplelayersjson": {
    "duration": 0.2521,
    "status": "PASSED"
   },
   "bblock.BBLock.test_lock_architecture_specific": {
    "duration": 95.706,
    "status": "PASSED"
   },
   "bblock.BBLock.test_lock_multiple_recipe_single_task": {
    "duration": 557.766,
    "status": "PASSED"
   },
   "bblock.BBLock.test_lock_single_recipe_all_tasks": {
    "duration": 899.692,
    "status": "PASSED"
   },
   "bblock.BBLock.test_lock_single_recipe_multiple_tasks": {
    "duration": 900.397,
    "status": "PASSED"
   },
   "bblock.BBLock.test_lock_single_recipe_single_task": {
    "duration": 813.347,
    "status": "PASSED"
   },
   "bblogging.BitBakeLogging.test_python_exec_func_python_loggingA": {
    "duration": 39.553,
    "status": "PASSED"
   },
   "bblogging.BitBakeLogging.test_python_exec_func_python_loggingB": {
    "duration": 34.333,
    "status": "PASSED"
   },
   "bblogging.BitBakeLogging.test_python_exec_func_python_loggingC": {
    "duration": 35.004,
    "status": "PASSED"
   },
   "bblogging.BitBakeLogging.test_python_exec_func_python_loggingD": {
    "duration": 11.694,
    "status": "PASSED"
   },
   "bblogging.BitBakeLogging.test_python_exec_func_shell_loggingA": {
    "duration": 13.577,
    "status": "PASSED"
   },
   "bblogging.BitBakeLogging.test_python_exec_func_shell_loggingB": {
    "duration": 13.166,
    "status": "PASSED"
   },
   "bblogging.BitBakeLogging.test_python_exec_func_shell_loggingC": {
    "duration": 12.722,
    "status": "PASSED"
   },
   "bblogging.BitBakeLogging.test_python_exec_func_shell_loggingD": {
    "duration": 15.869,
    "status": "PASSED"
   },
   "bblogging.BitBakeLogging.test_python_exit_loggingA": {
    "duration": 11.51,
    "status": "PASSED"
   },
   "bblogging.BitBakeLogging.test_python_exit_loggingB": {
    "duration": 12.961,
    "status": "PASSED"
   },
   "bblogging.BitBakeLogging.test_python_exit_loggingC": {
    "duration": 12.638,
    "status": "PASSED"
   },
   "bblogging.BitBakeLogging.test_python_exit_loggingD": {
    "duration": 13.938,
    "status": "PASSED"
   },
   "bblogging.BitBakeLogging.test_python_fatal_loggingA": {
    "duration": 25.196,
    "status": "PASSED"
   },
   "bblogging.BitBakeLogging.test_python_fatal_loggingB": {
    "duration": 13.491,
    "status": "PASSED"
   },
   "bblogging.BitBakeLogging.test_python_fatal_loggingC": {
    "duration": 14.088,
    "status": "PASSED"
   },
   "bblogging.BitBakeLogging.test_python_fatal_loggingD": {
    "duration": 15.595,
    "status": "PASSED"
   },
   "bblogging.BitBakeLogging.test_shell_loggingA": {
    "duration": 15.052,
    "status": "PASSED"
   },
   "bblogging.BitBakeLogging.test_shell_loggingB": {
    "duration": 14.54,
    "status": "PASSED"
   },
   "bblogging.BitBakeLogging.test_shell_loggingC": {
    "duration": 16.32,
    "status": "PASSED"
   },
   "bblogging.BitBakeLogging.test_shell_loggingD": {
    "duration": 13.397,
    "status": "PASSED"
   },
   "bbtests.BitbakeTests.test_bb_env_bb_getvar_equality": {
    "duration": 2.489,
    "status": "PASSED"
   },
   "bbtests.BitbakeTests.test_bbappend_order": {
    "duration": 33.137,
    "status": "PASSED"
   },
   "bbtests.BitbakeTests.test_bitbake_g": {
    "duration": 8.094,
    "status": "PASSED"
   },
   "bbtests.BitbakeTests.test_bitbake_invalid_recipe": {
    "duration": 2.272,
    "status": "PASSED"
   },
   "bbtests.BitbakeTests.test_bitbake_invalid_target": {
    "duration": 5.111,
    "status": "PASSED"
   },
   "bbtests.BitbakeTests.test_checkuri": {
    "duration": 16.393,
    "status": "PASSED"
   },
   "bbtests.BitbakeTests.test_continue": {
    "duration": 42.211,
    "status": "PASSED"
   },
   "bbtests.BitbakeTests.test_dry_run": {
    "duration": 7.818,
    "status": "PASSED"
   },
   "bbtests.BitbakeTests.test_environment": {
    "duration": 1.986,
    "status": "PASSED"
   },
   "bbtests.BitbakeTests.test_event_handler": {
    "duration": 34.276,
    "status": "PASSED"
   },
   "bbtests.BitbakeTests.test_force_task_1": {
    "duration": 77.239,
    "status": "PASSED"
   },
   "bbtests.BitbakeTests.test_force_task_2": {
    "duration": 61.089,
    "status": "PASSED"
   },
   "bbtests.BitbakeTests.test_git_patchtool": {
    "duration": 30.669,
    "status": "PASSED"
   },
   "bbtests.BitbakeTests.test_git_patchtool2": {
    "duration": 29.837,
    "status": "PASSED"
   },
   "bbtests.BitbakeTests.test_git_unpack_nonetwork": {
    "duration": 48.618,
    "status": "PASSED"
   },
   "bbtests.BitbakeTests.test_git_unpack_nonetwork_fail": {
    "duration": 13.63,
    "status": "PASSED"
   },
   "bbtests.BitbakeTests.test_image_manifest": {
    "duration": 7833.812,
    "status": "PASSED"
   },
   "bbtests.BitbakeTests.test_invalid_patch": {
    "duration": 46.869,
    "status": "PASSED"
   },
   "bbtests.BitbakeTests.test_invalid_recipe_src_uri": {
    "duration": 4.314,
    "status": "PASSED"
   },
   "bbtests.BitbakeTests.test_just_parse": {
    "duration": 3.39,
    "status": "PASSED"
   },
   "bbtests.BitbakeTests.test_local_sstate": {
    "duration": 23.386,
    "status": "PASSED"
   },
   "bbtests.BitbakeTests.test_non_gplv3": {
    "duration": 31.401,
    "status": "PASSED"
   },
   "bbtests.BitbakeTests.test_postfile": {
    "duration": 4.372,
    "status": "PASSED"
   },
   "bbtests.BitbakeTests.test_prefile": {
    "duration": 7.323,
    "status": "PASSED"
   },
   "bbtests.BitbakeTests.test_rename_downloaded_file": {
    "duration": 29.9,
    "status": "PASSED"
   },
   "bbtests.BitbakeTests.test_run_bitbake_from_dir_1": {
    "duration": 2.498,
    "status": "PASSED"
   },
   "bbtests.BitbakeTests.test_run_bitbake_from_dir_2": {
    "duration": 3.124,
    "status": "PASSED"
   },
   "bbtests.BitbakeTests.test_run_bitbake_from_dir_3": {
    "duration": 3.147,
    "status": "PASSED"
   },
   "bbtests.BitbakeTests.test_setscene_only": {
    "duration": 22.425,
    "status": "PASSED"
   },
   "bbtests.BitbakeTests.test_skip_setscene": {
    "duration": 49.088,
    "status": "PASSED"
   },
   "bbtests.BitbakeTests.test_unexpanded_variable_in_path": {
    "duration": 28.806,
    "status": "PASSED"
   },
   "bbtests.BitbakeTests.test_version": {
    "duration": 3.624,
    "status": "PASSED"
   },
   "bbtests.BitbakeTests.test_warnings_errors": {
    "duration": 1.072,
    "status": "PASSED"
   },
   "buildhistory.BuildhistoryTests.test_buildhistory_basic": {
    "duration": 58.067,
    "status": "PASSED"
   },
   "buildhistory.BuildhistoryTests.test_buildhistory_buildtime_pr_backwards": {
    "duration": 87.297,
    "status": "PASSED"
   },
   "buildhistory.BuildhistoryTests.test_buildhistory_diff": {
    "duration": 80.98,
    "status": "PASSED"
   },
   "buildhistory.BuildhistoryTests.test_fileinfo": {
    "duration": 30.157,
    "status": "PASSED"
   },
   "buildoptions.ArchiverTest.test_arch_work_dir_and_export_source": {
    "duration": 46.837,
    "status": "PASSED"
   },
   "buildoptions.DiskMonTest.test_stoptask_behavior": {
    "duration": 103.55,
    "status": "PASSED"
   },
   "buildoptions.ImageOptionsTests.test_ccache_tool": {
    "duration": 198.101,
    "status": "PASSED"
   },
   "buildoptions.ImageOptionsTests.test_incremental_image_generation": {
    "duration": 7597.277,
    "status": "PASSED"
   },
   "buildoptions.ImageOptionsTests.test_read_only_image": {
    "duration": 269.75,
    "status": "PASSED"
   },
   "buildoptions.Poisoning.test_poisoning": {
    "duration": 47.376,
    "status": "PASSED"
   },
   "buildoptions.SanityOptionsTest.test_layer_without_git_dir": {
    "duration": 38.9,
    "status": "PASSED"
   },
   "buildoptions.SanityOptionsTest.test_options_warnqa_errorqa_switch": {
    "duration": 90.221,
    "status": "PASSED"
   },
   "buildoptions.ToolchainOptions.test_toolchain_fortran": {
    "duration": 2696.872,
    "status": "PASSED"
   },
   "c_cpp.CMakeTests.test_cmake_qemu": {
    "duration": 50.057,
    "status": "PASSED"
   },
   "c_cpp.CMakeTests.test_cmake_qemu_failing": {
    "duration": 45.355,
    "status": "PASSED"
   },
   "c_cpp.MesonTests.test_meson_qemu": {
    "duration": 61.485,
    "status": "PASSED"
   },
   "c_cpp.MesonTests.test_meson_qemu_failing": {
    "duration": 53.775,
    "status": "PASSED"
   },
   "containerimage.ContainerImageTests.test_expected_files": {
    "duration": 6412.712,
    "status": "PASSED"
   },
   "cve_check.CVECheck.test_convert_cve_version": {
    "duration": 0.007667,
    "status": "PASSED"
   },
   "cve_check.CVECheck.test_parse_cve_from_patch_contents": {
    "duration": 0.004803,
    "status": "PASSED"
   },
   "cve_check.CVECheck.test_parse_cve_from_patch_filename": {
    "duration": 0.00436,
    "status": "PASSED"
   },
   "cve_check.CVECheck.test_product_match": {
    "duration": 0.004234,
    "status": "PASSED"
   },
   "cve_check.CVECheck.test_version_compare": {
    "duration": 0.005368,
    "status": "PASSED"
   },
   "debuginfod.Debuginfod.test_debuginfod_native": {
    "duration": 73.899,
    "status": "PASSED"
   },
   "debuginfod.Debuginfod.test_debuginfod_qemu": {
    "duration": 178.709,
    "oetags": [
     "runqemu"
    ],
    "status": "PASSED"
   },
   "devtool.DevtoolAddTests.test_devtool_add": {
    "duration": 108.055,
    "status": "PASSED"
   },
   "devtool.DevtoolAddTests.test_devtool_add_binary": {
    "duration": 87.027,
    "status": "PASSED"
   },
   "devtool.DevtoolAddTests.test_devtool_add_build_finish": {
    "duration": 133.623,
    "status": "PASSED"
   },
   "devtool.DevtoolAddTests.test_devtool_add_build_finish_force": {
    "duration": 133.619,
    "status": "PASSED"
   },
   "devtool.DevtoolAddTests.test_devtool_add_fetch": {
    "duration": 127.15,
    "status": "PASSED"
   },
   "devtool.DevtoolAddTests.test_devtool_add_fetch_git": {
    "duration": 93.771,
    "status": "PASSED"
   },
   "devtool.DevtoolAddTests.test_devtool_add_fetch_simple": {
    "duration": 51.243,
    "status": "PASSED"
   },
   "devtool.DevtoolAddTests.test_devtool_add_git_local": {
    "duration": 67.995,
    "status": "PASSED"
   },
   "devtool.DevtoolAddTests.test_devtool_add_git_style1": {
    "duration": 57.081,
    "status": "PASSED"
   },
   "devtool.DevtoolAddTests.test_devtool_add_git_style2": {
    "duration": 57.584,
    "status": "PASSED"
   },
   "devtool.DevtoolAddTests.test_devtool_add_library": {
    "duration": 71.449,
    "status": "PASSED"
   },
   "devtool.DevtoolAddTests.test_devtool_add_npm": {
    "duration": 1.276,
    "log": "Test needs meta-oe for nodejs\n",
    "status": "SKIPPED"
   },
   "devtool.DevtoolAddTests.test_devtool_add_python_egg_requires": {
    "duration": 44.031,
    "status": "PASSED"
   },
   "devtool.DevtoolBuildImageTests.test_devtool_build_image": {
    "duration": 7920.343,
    "status": "PASSED"
   },
   "devtool.DevtoolDeployTargetTests.test_devtool_deploy_target": {
    "duration": 459.374,
    "oetags": [
     "runqemu"
    ],
    "status": "PASSED"
   },
   "devtool.DevtoolDeployTargetTests.test_devtool_deploy_target_path": {
    "duration": 337.716,
    "oetags": [
     "runqemu"
    ],
    "status": "PASSED"
   },
   "devtool.DevtoolExtractTests.test_devtool_extract": {
    "duration": 85.053,
    "status": "PASSED"
   },
   "devtool.DevtoolExtractTests.test_devtool_extract_virtual": {
    "duration": 50.331,
    "status": "PASSED"
   },
   "devtool.DevtoolIdeSdkClangTests.test_code_and_none_qemu": {
    "duration": 8558.958,
    "oetags": [
     "runqemu"
    ],
    "status": "PASSED"
   },
   "devtool.DevtoolIdeSdkClangTests.test_sdk_code_nfs_debug_rootfs": {
    "duration": 328.964,
    "status": "PASSED"
   },
   "devtool.DevtoolIdeSdkClangTests.test_sdk_none_nfs_qemu": {
    "duration": 585.474,
    "oetags": [
     "runqemu"
    ],
    "status": "PASSED"
   },
   "devtool.DevtoolIdeSdkClangTests.test_sdk_none_nfs_qemu_slirp": {
    "duration": 708.192,
    "oetags": [
     "runqemu"
    ],
    "status": "PASSED"
   },
   "devtool.DevtoolIdeSdkClangTests.test_sdk_none_qemu_slirp": {
    "duration": 625.712,
    "oetags": [
     "runqemu"
    ],
    "status": "PASSED"
   },
   "devtool.DevtoolIdeSdkGccTests.test_code_and_none_nfs_qemu": {
    "duration": 8070.575,
    "oetags": [
     "runqemu"
    ],
    "status": "PASSED"
   },
   "devtool.DevtoolIdeSdkGccTests.test_code_and_none_nfs_qemu_slirp": {
    "duration": 522.93,
    "oetags": [
     "runqemu"
    ],
    "status": "PASSED"
   },
   "devtool.DevtoolIdeSdkGccTests.test_code_and_none_qemu": {
    "duration": 440.931,
    "oetags": [
     "runqemu"
    ],
    "status": "PASSED"
   },
   "devtool.DevtoolIdeSdkGccTests.test_code_and_none_qemu_slirp": {
    "duration": 450.448,
    "oetags": [
     "runqemu"
    ],
    "status": "PASSED"
   },
   "devtool.DevtoolIdeSdkGccTests.test_code_nfs_debug_rootfs": {
    "duration": 295.17,
    "status": "PASSED"
   },
   "devtool.DevtoolIdeSdkKernelTests.test_code_kernel_module": {
    "duration": 347.354,
    "oetags": [
     "runqemu"
    ],
    "status": "PASSED"
   },
   "devtool.DevtoolIdeSdkMiscTests.test_plugins": {
    "duration": 107.366,
    "status": "PASSED"
   },
   "devtool.DevtoolIdeSdkSharedTests.test_shared_sysroots": {
    "duration": 7548.182,
    "status": "PASSED"
   },
   "devtool.DevtoolModifyTests.test_devtool_buildclean": {
    "duration": 514.578,
    "status": "PASSED"
   },
   "devtool.DevtoolModifyTests.test_devtool_modify": {
    "duration": 208.692,
    "status": "PASSED"
   },
   "devtool.DevtoolModifyTests.test_devtool_modify_git": {
    "duration": 123.796,
    "status": "PASSED"
   },
   "devtool.DevtoolModifyTests.test_devtool_modify_git_crates_subpath": {
    "duration": 136.008,
    "status": "PASSED"
   },
   "devtool.DevtoolModifyTests.test_devtool_modify_git_no_extract": {
    "duration": 41.552,
    "status": "PASSED"
   },
   "devtool.DevtoolModifyTests.test_devtool_modify_go": {
    "duration": 65.642,
    "status": "PASSED"
   },
   "devtool.DevtoolModifyTests.test_devtool_modify_invalid": {
    "duration": 167.183,
    "status": "PASSED"
   },
   "devtool.DevtoolModifyTests.test_devtool_modify_kernel_cfg_subdirs": {
    "duration": 606.514,
    "status": "PASSED"
   },
   "devtool.DevtoolModifyTests.test_devtool_modify_localfiles": {
    "duration": 148.533,
    "status": "PASSED"
   },
   "devtool.DevtoolModifyTests.test_devtool_modify_localfiles_only": {
    "duration": 88.476,
    "status": "PASSED"
   },
   "devtool.DevtoolModifyTests.test_devtool_modify_multiple_sources": {
    "duration": 3410.913,
    "status": "PASSED"
   },
   "devtool.DevtoolModifyTests.test_devtool_modify_native": {
    "duration": 518.504,
    "status": "PASSED"
   },
   "devtool.DevtoolModifyTests.test_devtool_modify_nested_gitsm": {
    "duration": 62.296,
    "status": "PASSED"
   },
   "devtool.DevtoolModifyTests.test_devtool_modify_overrides": {
    "duration": 52.258,
    "status": "PASSED"
   },
   "devtool.DevtoolModifyTests.test_devtool_modify_virtual": {
    "duration": 53.752,
    "status": "PASSED"
   },
   "devtool.DevtoolResetTests.test_devtool_reset_all": {
    "duration": 238.573,
    "status": "PASSED"
   },
   "devtool.DevtoolResetTests.test_devtool_reset_re_plus_plus": {
    "duration": 47.195,
    "status": "PASSED"
   },
   "devtool.DevtoolTests.test_create_workspace": {
    "duration": 7.464,
    "status": "PASSED"
   },
   "devtool.DevtoolUpdateTests.test_devtool_finish_modify_git_subdir": {
    "duration": 149.881,
    "status": "PASSED"
   },
   "devtool.DevtoolUpdateTests.test_devtool_git_submodules": {
    "duration": 181.885,
    "status": "PASSED"
   },
   "devtool.DevtoolUpdateTests.test_devtool_update_recipe": {
    "duration": 64.719,
    "status": "PASSED"
   },
   "devtool.DevtoolUpdateTests.test_devtool_update_recipe_append": {
    "duration": 145.73,
    "status": "PASSED"
   },
   "devtool.DevtoolUpdateTests.test_devtool_update_recipe_append_git": {
    "duration": 125.739,
    "status": "PASSED"
   },
   "devtool.DevtoolUpdateTests.test_devtool_update_recipe_git": {
    "duration": 53.562,
    "status": "PASSED"
   },
   "devtool.DevtoolUpdateTests.test_devtool_update_recipe_gitsm": {
    "duration": 51.491,
    "status": "PASSED"
   },
   "devtool.DevtoolUpdateTests.test_devtool_update_recipe_local_files": {
    "duration": 121.62,
    "status": "PASSED"
   },
   "devtool.DevtoolUpdateTests.test_devtool_update_recipe_local_files_3": {
    "duration": 48.282,
    "status": "PASSED"
   },
   "devtool.DevtoolUpdateTests.test_devtool_update_recipe_local_files_subdir": {
    "duration": 50.19,
    "status": "PASSED"
   },
   "devtool.DevtoolUpdateTests.test_devtool_update_recipe_local_patch_gz": {
    "duration": 49.858,
    "status": "PASSED"
   },
   "devtool.DevtoolUpdateTests.test_devtool_update_recipe_long_filename": {
    "duration": 70.64,
    "status": "PASSED"
   },
   "devtool.DevtoolUpdateTests.test_devtool_update_recipe_with_gitignore": {
    "duration": 68.18,
    "status": "PASSED"
   },
   "devtool.DevtoolUpgradeTests.test_devtool_finish_modify_origlayer": {
    "duration": 104.268,
    "status": "PASSED"
   },
   "devtool.DevtoolUpgradeTests.test_devtool_finish_modify_otherlayer": {
    "duration": 64.352,
    "status": "PASSED"
   },
   "devtool.DevtoolUpgradeTests.test_devtool_finish_update_patch": {
    "duration": 79.246,
    "status": "PASSED"
   },
   "devtool.DevtoolUpgradeTests.test_devtool_finish_upgrade_origlayer": {
    "duration": 108.563,
    "status": "PASSED"
   },
   "devtool.DevtoolUpgradeTests.test_devtool_finish_upgrade_otherlayer": {
    "duration": 118.634,
    "status": "PASSED"
   },
   "devtool.DevtoolUpgradeTests.test_devtool_layer_plugins": {
    "duration": 3.084,
    "status": "PASSED"
   },
   "devtool.DevtoolUpgradeTests.test_devtool_load_plugin": {
    "duration": 13.101,
    "status": "PASSED"
   },
   "devtool.DevtoolUpgradeTests.test_devtool_rename": {
    "duration": 148.213,
    "status": "PASSED"
   },
   "devtool.DevtoolUpgradeTests.test_devtool_upgrade": {
    "duration": 95.641,
    "status": "PASSED"
   },
   "devtool.DevtoolUpgradeTests.test_devtool_upgrade_all_checksums": {
    "duration": 87.326,
    "status": "PASSED"
   },
   "devtool.DevtoolUpgradeTests.test_devtool_upgrade_drop_md5sum": {
    "duration": 110.074,
    "status": "PASSED"
   },
   "devtool.DevtoolUpgradeTests.test_devtool_upgrade_git": {
    "duration": 63.384,
    "status": "PASSED"
   },
   "devtool.DevtoolUpgradeTests.test_devtool_upgrade_gitsm": {
    "duration": 72.838,
    "status": "PASSED"
   },
   "devtool.DevtoolUpgradeTests.test_devtool_upgrade_recipe_upgrade_extra_tasks": {
    "duration": 102.565,
    "status": "PASSED"
   },
   "devtool.DevtoolUpgradeTests.test_devtool_virtual_kernel_modify": {
    "duration": 5211.247,
    "status": "PASSED"
   },
   "distrodata.Distrodata.test_checkpkg": {
    "duration": 0.002867,
    "log": "Skip by the command line argument \"distrodata.Distrodata.test_checkpkg\"\n",
    "status": "SKIPPED"
   },
   "distrodata.Distrodata.test_common_include_recipes": {
    "duration": 66.237,
    "status": "PASSED"
   },
   "distrodata.Distrodata.test_maintainers": {
    "duration": 97.038,
    "status": "PASSED"
   },
   "efibootpartition.GenericEFITest.test_boot_efi": {
    "duration": 850.236,
    "status": "PASSED"
   },
   "esdk.oeSDKExtSelfTest.test_image_generation_binary_feeds": {
    "duration": 121.269,
    "status": "PASSED"
   },
   "esdk.oeSDKExtSelfTest.test_install_libraries_headers": {
    "duration": 42.742,
    "status": "PASSED"
   },
   "esdk.oeSDKExtSelfTest.test_sdk_install_assembles_the_shared_sysroot": {
    "duration": 96.215,
    "status": "PASSED"
   },
   "externalsrc.ExternalSrc.test_externalsrc_srctree_hash_files": {
    "duration": 37.362,
    "status": "PASSED"
   },
   "fetch.Dependencies.test_dependencies": {
    "duration": 32.835,
    "status": "PASSED"
   },
   "fetch.Fetch.test_git_mirrors": {
    "duration": 92.597,
    "status": "PASSED"
   },
   "fitimage.FitImagePyTests.test_fitimage_py_conf_extra_mappings_unused_error": {
    "duration": 0.01105,
    "status": "PASSED"
   },
   "fitimage.FitImagePyTests.test_fitimage_py_conf_loadables": {
    "duration": 0.009811,
    "status": "PASSED"
   },
   "fitimage.FitImagePyTests.test_fitimage_py_conf_mappings": {
    "duration": 0.009864,
    "status": "PASSED"
   },
   "fitimage.FitImagePyTests.test_fitimage_py_conf_mappings_unused_error": {
    "duration": 0.008845,
    "status": "PASSED"
   },
   "fitimage.FitImagePyTests.test_fitimage_py_conf_mappings_with_alias": {
    "duration": 0.00947,
    "status": "PASSED"
   },
   "fitimage.FitImagePyTests.test_fitimage_py_conf_os": {
    "duration": 0.009259,
    "status": "PASSED"
   },
   "fitimage.FitImagePyTests.test_fitimage_py_default": {
    "duration": 0.009757,
    "status": "PASSED"
   },
   "fitimage.FitImagePyTests.test_fitimage_py_default_dtb": {
    "duration": 0.00964,
    "status": "PASSED"
   },
   "fitimage.KernelFitImageRecipeTests.test_fit_image": {
    "duration": 100.72,
    "status": "PASSED"
   },
   "fitimage.KernelFitImageRecipeTests.test_fit_image_ext_dtb_dtbo": {
    "duration": 46.486,
    "status": "PASSED"
   },
   "fitimage.KernelFitImageRecipeTests.test_fit_image_sign_initramfs": {
    "duration": 292.999,
    "status": "PASSED"
   },
   "fitimage.KernelFitImageRecipeTests.test_fit_image_sign_initramfs_bundle": {
    "duration": 288.604,
    "status": "PASSED"
   },
   "fitimage.KernelFitImageRecipeTests.test_get_compatible_from_dtb": {
    "duration": 24.313,
    "status": "PASSED"
   },
   "fitimage.KernelFitImageRecipeTests.test_sign_fit_image_configurations": {
    "duration": 73.775,
    "status": "PASSED"
   },
   "fitimage.KernelFitImageRecipeTests.test_sign_fit_image_individual": {
    "duration": 60.733,
    "status": "PASSED"
   },
   "fitimage.KernelFitImageRecipeTests.test_vendored_dtb_with_kernel_dtbvendored": {
    "duration": 190.345,
    "status": "PASSED"
   },
   "fitimage.KernelFitImageRecipeTests.test_vendored_dtb_without_kernel_dtbvendored": {
    "duration": 57.359,
    "status": "PASSED"
   },
   "fitimage.UBootFitImageTests.test_sign_cascaded_uboot_fit_image": {
    "duration": 0.6717,
    "log": "MACHINE=qemux86-64 does not provide capability _cap_spl_dtb\n",
    "status": "SKIPPED"
   },
   "fitimage.UBootFitImageTests.test_sign_standalone_uboot_atf_tee_fit_image": {
    "duration": 0.5117,
    "log": "MACHINE=qemux86-64 does not provide capability _cap_spl_dtb\n",
    "status": "SKIPPED"
   },
   "fitimage.UBootFitImageTests.test_sign_standalone_uboot_fit_image": {
    "duration": 0.7317,
    "log": "MACHINE=qemux86-64 does not provide capability _cap_spl_dtb\n",
    "status": "SKIPPED"
   },
   "fitimage.UBootFitImageTests.test_sign_uboot_fit_image_without_spl": {
    "duration": 278.02,
    "status": "PASSED"
   },
   "fitimage.UBootFitImageTests.test_sign_uboot_kernel_individual": {
    "duration": 134.113,
    "status": "PASSED"
   },
   "fitimage.UBootFitImageTests.test_uboot_atf_tee_fit_image": {
    "duration": 0.9518,
    "log": "MACHINE=qemux86-64 does not provide capability _cap_atf_tee\n",
    "status": "SKIPPED"
   },
   "fitimage.UBootFitImageTests.test_uboot_fit_image": {
    "duration": 82.612,
    "status": "PASSED"
   },
   "gdbserver.GdbServerTest.test_gdb_server": {
    "duration": 194.857,
    "status": "PASSED"
   },
   "gitarchivetests.GitArchiveTests.test_create_first_test_tag": {
    "duration": 0.8936,
    "status": "PASSED"
   },
   "gitarchivetests.GitArchiveTests.test_create_second_test_tag": {
    "duration": 1.154,
    "status": "PASSED"
   },
   "gitarchivetests.GitArchiveTests.test_get_revs_on_branch": {
    "duration": 0.677,
    "status": "PASSED"
   },
   "gitarchivetests.GitArchiveTests.test_get_tags_with_only_local_tag": {
    "duration": 0.6803,
    "status": "PASSED"
   },
   "gitarchivetests.GitArchiveTests.test_get_tags_without_valid_remote": {
    "duration": 0.612,
    "status": "PASSED"
   },
   "gitarchivetests.GitArchiveTests.test_get_tags_without_valid_remote_and_wrong_url": {
    "duration": 0.5115,
    "status": "PASSED"
   },
   "gotoolchain.oeGoToolchainSelfTest.test_go_dep_build": {
    "duration": 11.492,
    "status": "PASSED"
   },
   "govendor.GoVendorSrcUriTests.test_basic": {
    "duration": 0.00761,
    "status": "PASSED"
   },
   "govendor.GoVendorSrcUriTests.test_non_git_vcs": {
    "duration": 0.006785,
    "status": "PASSED"
   },
   "govendor.GoVendorSrcUriTests.test_path_override": {
    "duration": 0.006649,
    "status": "PASSED"
   },
   "govendor.GoVendorSrcUriTests.test_pathmajor": {
    "duration": 0.008794,
    "status": "PASSED"
   },
   "govendor.GoVendorSrcUriTests.test_replaces": {
    "duration": 0.006757,
    "status": "PASSED"
   },
   "govendor.GoVendorSrcUriTests.test_subdir": {
    "duration": 0.01103,
    "status": "PASSED"
   },
   "govendor.GoVendorTaskTests.test_do_compile_succeeds": {
    "duration": 22.843,
    "status": "PASSED"
   },
   "govendor.GoVendorTaskTests.test_external_dep_copied_to_vendor": {
    "duration": 0.01055,
    "status": "PASSED"
   },
   "govendor.GoVendorTaskTests.test_go_import_vendor_symlink": {
    "duration": 0.007633,
    "status": "PASSED"
   },
   "govendor.GoVendorTaskTests.test_local_replacement_symlink": {
    "duration": 0.008953,
    "status": "PASSED"
   },
   "govendor.GoVendorTaskTests.test_modules_txt_in_vendor": {
    "duration": 0.007488,
    "status": "PASSED"
   },
   "govendor.GoVendorTaskTests.test_pathmajor_falls_back_to_root": {
    "duration": 0.009998,
    "status": "PASSED"
   },
   "govendor.GoVendorTaskTests.test_test_files_excluded_from_vendor": {
    "duration": 0.008714,
    "status": "PASSED"
   },
   "image_typedep.ImageTypeDepTests.test_conversion_typedep_added": {
    "duration": 48.491,
    "status": "PASSED"
   },
   "imagefeatures.ImageFeatures.test_all_users_can_connect_via_ssh_without_password": {
    "duration": 260.911,
    "oetags": [
     "runqemu"
    ],
    "status": "PASSED"
   },
   "imagefeatures.ImageFeatures.test_bmap": {
    "duration": 87.813,
    "status": "PASSED"
   },
   "imagefeatures.ImageFeatures.test_empty_image": {
    "duration": 33.128,
    "status": "PASSED"
   },
   "imagefeatures.ImageFeatures.test_hypervisor_fmts": {
    "duration": 91.96,
    "status": "PASSED"
   },
   "imagefeatures.ImageFeatures.test_image_fstypes": {
    "duration": 149.377,
    "status": "PASSED"
   },
   "imagefeatures.ImageFeatures.test_image_gen_debugfs": {
    "duration": 119.864,
    "status": "PASSED"
   },
   "imagefeatures.ImageFeatures.test_long_chain_conversion": {
    "duration": 80.8,
    "status": "PASSED"
   },
   "imagefeatures.ImageFeatures.test_mandb": {
    "duration": 3937.87,
    "status": "PASSED"
   },
   "imagefeatures.ImageFeatures.test_no_busybox_base_utils": {
    "duration": 35.707,
    "status": "PASSED"
   },
   "imagefeatures.ImageFeatures.test_non_root_user_can_connect_via_ssh_without_password": {
    "duration": 90.474,
    "oetags": [
     "runqemu"
    ],
    "status": "PASSED"
   },
   "imagefeatures.ImageFeatures.test_useradd_static": {
    "duration": 94.964,
    "status": "PASSED"
   },
   "imagefeatures.ImageFeatures.test_wayland_support_in_image": {
    "duration": 139.567,
    "status": "PASSED"
   },
   "incompatible_lic.IncompatibleLicensePerImageTests.test_bash_and_license": {
    "duration": 225.167,
    "status": "PASSED"
   },
   "incompatible_lic.IncompatibleLicensePerImageTests.test_bash_default": {
    "duration": 61.276,
    "status": "PASSED"
   },
   "incompatible_lic.IncompatibleLicensePerImageTests.test_bash_license_exceptions": {
    "duration": 68.982,
    "status": "PASSED"
   },
   "incompatible_lic.IncompatibleLicensePerImageTests.test_bash_or_license": {
    "duration": 99.321,
    "status": "PASSED"
   },
   "incompatible_lic.IncompatibleLicensePerImageTests.test_spdx_exception": {
    "duration": 183.213,
    "status": "PASSED"
   },
   "incompatible_lic.IncompatibleLicenseTestObsolete.test_incompatible_alias_spdx_license": {
    "duration": 6.977,
    "status": "PASSED"
   },
   "incompatible_lic.IncompatibleLicenseTestObsolete.test_incompatible_alias_spdx_license_alias": {
    "duration": 6.134,
    "status": "PASSED"
   },
   "incompatible_lic.IncompatibleLicenseTestObsolete.test_incompatible_alias_spdx_license_alias_wildcard": {
    "duration": 6.628,
    "status": "PASSED"
   },
   "incompatible_lic.IncompatibleLicenseTestObsolete.test_incompatible_alias_spdx_license_wildcard": {
    "duration": 6.502,
    "status": "PASSED"
   },
   "incompatible_lic.IncompatibleLicenseTestObsolete.test_incompatible_all_licenses_wildcard": {
    "duration": 7.779,
    "status": "PASSED"
   },
   "incompatible_lic.IncompatibleLicenseTestObsolete.test_incompatible_spdx_license_alias_wildcard": {
    "duration": 8.738,
    "status": "PASSED"
   },
   "incompatible_lic.IncompatibleLicenseTestObsolete.test_incompatible_spdx_licenses_wildcard": {
    "duration": 7.074,
    "status": "PASSED"
   },
   "incompatible_lic.IncompatibleLicenseTests.test_incompatible_nonspdx_license": {
    "duration": 23.939,
    "status": "PASSED"
   },
   "incompatible_lic.IncompatibleLicenseTests.test_incompatible_spdx_license": {
    "duration": 23.876,
    "status": "PASSED"
   },
   "incompatible_lic.IncompatibleLicenseTests.test_incompatible_spdx_license_alias": {
    "duration": 3.651,
    "status": "PASSED"
   },
   "incompatible_lic.IncompatibleLicenseTests.test_incompatible_spdx_license_wildcard": {
    "duration": 20.96,
    "status": "PASSED"
   },
   "incompatible_lic.IncompatibleLicenseTests.test_incompatible_spdx_licenses": {
    "duration": 23.079,
    "status": "PASSED"
   },
   "incompatible_lic.NoGPL3InImagesTests.test_core_image_full_cmdline_weston": {
    "duration": 8455.924,
    "status": "PASSED"
   },
   "incompatible_lic.NoGPL3InImagesTests.test_core_image_minimal": {
    "duration": 71.776,
    "status": "PASSED"
   },
   "install.InstallTests.test_gstreamer_plugins": {
    "duration": 652.274,
    "status": "PASSED"
   },
   "install.InstallTests.test_linux_firmware": {
    "duration": 151.589,
    "status": "PASSED"
   },
   "install.InstallTests.test_linux_modules": {
    "duration": 64.453,
    "status": "PASSED"
   },
   "install.InstallTests.test_perl": {
    "duration": 65.83,
    "status": "PASSED"
   },
   "install.InstallTests.test_python": {
    "duration": 65.319,
    "status": "PASSED"
   },
   "intercept.GitCheck.test_git_intercept": {
    "duration": 44.939,
    "status": "PASSED"
   },
   "kerneldevelopment.KernelDev.test_apply_patches": {
    "duration": 158.335,
    "status": "PASSED"
   },
   "kernelmodulesplit.KernelModuleSplit.test_cross_recipe_module_dependency": {
    "duration": 5023.023,
    "status": "PASSED"
   },
   "layerappend.LayerAppendTests.test_layer_appends": {
    "duration": 74.513,
    "status": "PASSED"
   },
   "liboe.CopyTreeTests.test_copy_hardlink_tree_count": {
    "duration": 0.02331,
    "status": "PASSED"
   },
   "liboe.CopyTreeTests.test_copy_tree_special": {
    "duration": 0.02277,
    "status": "PASSED"
   },
   "liboe.CopyTreeTests.test_copy_tree_xattr": {
    "duration": 62.716,
    "status": "PASSED"
   },
   "liboe.PathTests.test_canonicalize_empty_string_returns_empty_string": {
    "duration": 0.01183,
    "status": "PASSED"
   },
   "liboe.PathTests.test_canonicalize_empty_token_between_paths_is_dropped": {
    "duration": 0.00824,
    "status": "PASSED"
   },
   "liboe.PathTests.test_canonicalize_multiple_variable_tokens_all_skipped": {
    "duration": 0.007889,
    "status": "PASSED"
   },
   "liboe.PathTests.test_canonicalize_none_returns_empty_string": {
    "duration": 0.008743,
    "status": "PASSED"
   },
   "liboe.PathTests.test_canonicalize_real_path_returned": {
    "duration": 0.007838,
    "status": "PASSED"
   },
   "liboe.PathTests.test_canonicalize_trailing_slash_preserved": {
    "duration": 0.008907,
    "status": "PASSED"
   },
   "liboe.PathTests.test_canonicalize_unexpanded_variable_is_skipped": {
    "duration": 0.008099,
    "status": "PASSED"
   },
   "liboe.PathTests.test_canonicalize_variable_and_trailing_slash_path": {
    "duration": 0.007812,
    "status": "PASSED"
   },
   "liboe.PathTests.test_canonicalize_variable_token_dropped_leaving_real_path": {
    "duration": 0.007748,
    "status": "PASSED"
   },
   "liboe.PathTests.test_is_path_parent_all_paths_must_be_below": {
    "duration": 0.008269,
    "status": "PASSED"
   },
   "liboe.PathTests.test_is_path_parent_child_is_not_parent_of_its_parent": {
    "duration": 0.007809,
    "status": "PASSED"
   },
   "liboe.PathTests.test_is_path_parent_direct_child": {
    "duration": 0.00923,
    "status": "PASSED"
   },
   "liboe.PathTests.test_is_path_parent_no_paths_returns_false": {
    "duration": 0.008013,
    "status": "PASSED"
   },
   "liboe.PathTests.test_is_path_parent_one_path_outside_fails": {
    "duration": 0.008651,
    "status": "PASSED"
   },
   "liboe.PathTests.test_is_path_parent_prefix_string_is_not_a_path_parent": {
    "duration": 0.008424,
    "status": "PASSED"
   },
   "liboe.PathTests.test_is_path_parent_unrelated_path": {
    "duration": 0.008036,
    "status": "PASSED"
   },
   "liboe.PathTests.test_join_absolute_rhs_is_not_special": {
    "duration": 0.01095,
    "status": "PASSED"
   },
   "liboe.PathTests.test_join_empty_leading_component_is_absolute": {
    "duration": 0.01055,
    "status": "PASSED"
   },
   "liboe.PathTests.test_join_pardir_normalised": {
    "duration": 0.00862,
    "status": "PASSED"
   },
   "liboe.PathTests.test_join_redundant_separators_normalised": {
    "duration": 0.009861,
    "status": "PASSED"
   },
   "liboe.PathTests.test_join_two_paths": {
    "duration": 0.009788,
    "status": "PASSED"
   },
   "liboe.PathTests.test_make_relative_symlink_absolute_becomes_relative_and_resolves": {
    "duration": 0.008282,
    "status": "PASSED"
   },
   "liboe.PathTests.test_make_relative_symlink_already_relative_unchanged": {
    "duration": 0.008178,
    "status": "PASSED"
   },
   "liboe.PathTests.test_make_relative_symlink_non_symlink_is_ignored": {
    "duration": 0.008173,
    "status": "PASSED"
   },
   "liboe.PathTests.test_make_relative_symlink_several_levels_deep_becomes_relative": {
    "duration": 0.008825,
    "status": "PASSED"
   },
   "liboe.PathTests.test_realpath_isdir_failure_falls_back_without_nameerror": {
    "duration": 0.01095,
    "status": "PASSED"
   },
   "liboe.PathTests.test_realpath_missing_component_raises_enoent_without_assume_dir": {
    "duration": 0.01181,
    "status": "PASSED"
   },
   "liboe.PathTests.test_realpath_missing_component_tolerated_with_assume_dir": {
    "duration": 0.007881,
    "status": "PASSED"
   },
   "liboe.PathTests.test_realpath_mutual_symlink_cycle_raises_eloop": {
    "duration": 0.01828,
    "status": "PASSED"
   },
   "liboe.PathTests.test_realpath_path_outside_root_raises": {
    "duration": 0.007878,
    "status": "PASSED"
   },
   "liboe.PathTests.test_realpath_plain_path_is_returned": {
    "duration": 0.01109,
    "status": "PASSED"
   },
   "liboe.PathTests.test_realpath_resolves_symlink_below_root": {
    "duration": 0.007858,
    "status": "PASSED"
   },
   "liboe.PathTests.test_realpath_resolves_symlink_several_components_deep": {
    "duration": 0.007793,
    "status": "PASSED"
   },
   "liboe.PathTests.test_realpath_self_referential_symlink_raises_eloop": {
    "duration": 0.007639,
    "status": "PASSED"
   },
   "liboe.PathTests.test_symlink_conflicting_existing_raises": {
    "duration": 0.007316,
    "status": "PASSED"
   },
   "liboe.PathTests.test_symlink_creates_dangling_symlink": {
    "duration": 0.00695,
    "status": "PASSED"
   },
   "liboe.PathTests.test_symlink_creates_symlink": {
    "duration": 0.007274,
    "status": "PASSED"
   },
   "liboe.PathTests.test_symlink_force_does_not_delete_glob_siblings": {
    "duration": 0.007863,
    "status": "PASSED"
   },
   "liboe.PathTests.test_symlink_force_overwrites_existing_symlink": {
    "duration": 0.007921,
    "status": "PASSED"
   },
   "liboe.PathTests.test_symlink_force_replaces_destination_with_glob_metacharacters": {
    "duration": 0.008145,
    "status": "PASSED"
   },
   "liboe.PathTests.test_symlink_force_replaces_existing_directory": {
    "duration": 0.01109,
    "status": "PASSED"
   },
   "liboe.PathTests.test_symlink_matching_existing_is_idempotent": {
    "duration": 0.008109,
    "status": "PASSED"
   },
   "liboe.PathTests.test_which_wild_explicit_search_path": {
    "duration": 0.007914,
    "status": "PASSED"
   },
   "liboe.PathTests.test_which_wild_first_match_per_name_wins": {
    "duration": 0.008279,
    "status": "PASSED"
   },
   "liboe.PathTests.test_which_wild_missing_tool_returns_empty": {
    "duration": 0.01156,
    "status": "PASSED"
   },
   "liboe.PathTests.test_which_wild_wildcard_pattern": {
    "duration": 0.008424,
    "status": "PASSED"
   },
   "liboe.SubprocessTests.test_subprocess_tweak": {
    "duration": 0.0179,
    "status": "PASSED"
   },
   "lic_checksum.LicenseTests.test_checksum_with_space": {
    "duration": 32.333,
    "status": "PASSED"
   },
   "lic_checksum.LicenseTests.test_nonmatching_checksum": {
    "duration": 23.771,
    "status": "PASSED"
   },
   "locales.LocalesTest.test_locales_off": {
    "duration": 3083.687,
    "status": "PASSED"
   },
   "locales.LocalesTest.test_locales_on": {
    "duration": 97.641,
    "status": "PASSED"
   },
   "manifest.VerifyManifest.test_SDK_manifest_entries": {
    "duration": 495.102,
    "status": "PASSED"
   },
   "manifest.VerifyManifest.test_image_manifest_entries": {
    "duration": 12.968,
    "status": "PASSED"
   },
   "minidebuginfo.Minidebuginfo.test_minidebuginfo": {
    "duration": 3509.443,
    "status": "PASSED"
   },
   "minidebuginfo.Minidebuginfo.test_minidebuginfo_qemu": {
    "duration": 995.645,
    "oetags": [
     "runqemu"
    ],
    "status": "PASSED"
   },
   "multiconfig.MultiConfig.test_multiconfig": {
    "duration": 322.082,
    "status": "PASSED"
   },
   "multiconfig.MultiConfig.test_multiconfig_inlayer": {
    "duration": 39.3,
    "status": "PASSED"
   },
   "multiconfig.MultiConfig.test_multiconfig_reparse": {
    "duration": 87.379,
    "status": "PASSED"
   },
   "newlib.NewlibTest.test_newlib": {
    "duration": 40.783,
    "status": "PASSED"
   },
   "oelib.buildhistory.TestBlobParsing.test_blob_to_dict": {
    "duration": 1.304,
    "status": "PASSED"
   },
   "oelib.buildhistory.TestBlobParsing.test_compare_dict_blobs": {
    "duration": 0.6393,
    "status": "PASSED"
   },
   "oelib.buildhistory.TestBlobParsing.test_compare_dict_blobs_default": {
    "duration": 0.9201,
    "status": "PASSED"
   },
   "oelib.buildhistory.TestFileListCompare.test_compare_file_lists": {
    "duration": 0.0981,
    "status": "PASSED"
   },
   "oelib.elf.TestElf.test_machine_name": {
    "duration": 0.001046,
    "status": "PASSED"
   },
   "oelib.fs_uuid.TestGetRootfsUuid.test_fatal_on_empty_tune2fs_output": {
    "duration": 0.003013,
    "status": "PASSED"
   },
   "oelib.fs_uuid.TestGetRootfsUuid.test_fatal_when_uuid_line_missing": {
    "duration": 0.001743,
    "status": "PASSED"
   },
   "oelib.fs_uuid.TestGetRootfsUuid.test_first_uuid_line_wins": {
    "duration": 0.001456,
    "status": "PASSED"
   },
   "oelib.fs_uuid.TestGetRootfsUuid.test_ignores_uuid_text_that_is_not_at_line_start": {
    "duration": 0.002489,
    "status": "PASSED"
   },
   "oelib.fs_uuid.TestGetRootfsUuid.test_missing_tune2fs_propagates": {
    "duration": 0.001243,
    "status": "PASSED"
   },
   "oelib.fs_uuid.TestGetRootfsUuid.test_notes_path_and_uuid": {
    "duration": 0.0006199,
    "status": "PASSED"
   },
   "oelib.fs_uuid.TestGetRootfsUuid.test_parses_typical_tune2fs_output": {
    "duration": 0.001699,
    "status": "PASSED"
   },
   "oelib.fs_uuid.TestGetRootfsUuid.test_tune2fs_failure_propagates": {
    "duration": 0.0007303,
    "status": "PASSED"
   },
   "oelib.fs_uuid.TestGetRootfsUuid.test_uses_rootfs_variable": {
    "duration": 0.0007784,
    "status": "PASSED"
   },
   "oelib.fs_uuid.TestGetRootfsUuid.test_uuid_is_last_token_on_the_line": {
    "duration": 0.001602,
    "status": "PASSED"
   },
   "oelib.fs_uuid.TestGetRootfsUuidLive.test_reads_uuid_from_real_ext_image": {
    "duration": 0.01632,
    "status": "PASSED"
   },
   "oelib.fs_uuid.TestReplaceRootfsUuid.test_empty_string_is_noop": {
    "duration": 0.002076,
    "status": "PASSED"
   },
   "oelib.fs_uuid.TestReplaceRootfsUuid.test_near_miss_placeholders_are_left_alone": {
    "duration": 0.002281,
    "status": "PASSED"
   },
   "oelib.fs_uuid.TestReplaceRootfsUuid.test_no_placeholder_is_noop": {
    "duration": 0.002562,
    "status": "PASSED"
   },
   "oelib.fs_uuid.TestReplaceRootfsUuid.test_placeholder_as_substring_is_replaced": {
    "duration": 0.003455,
    "status": "PASSED"
   },
   "oelib.fs_uuid.TestReplaceRootfsUuid.test_placeholder_only": {
    "duration": 0.003285,
    "status": "PASSED"
   },
   "oelib.fs_uuid.TestReplaceRootfsUuid.test_replacement_failure_when_uuid_cannot_be_read": {
    "duration": 0.004374,
    "status": "PASSED"
   },
   "oelib.fs_uuid.TestReplaceRootfsUuid.test_replaces_every_placeholder": {
    "duration": 0.004422,
    "status": "PASSED"
   },
   "oelib.fs_uuid.TestReplaceRootfsUuid.test_replaces_grub_style_root_argument": {
    "duration": 0.004429,
    "status": "PASSED"
   },
   "oelib.fs_uuid.TestReplaceRootfsUuid.test_replaces_syslinux_style_append": {
    "duration": 0.004461,
    "status": "PASSED"
   },
   "oelib.fs_uuid.TestReplaceRootfsUuid.test_replaces_systemd_boot_options_line": {
    "duration": 0.004456,
    "status": "PASSED"
   },
   "oelib.license.TestComplexCombinations.test_tests": {
    "duration": 0.003543,
    "status": "PASSED"
   },
   "oelib.license.TestIsIncluded.test_tests": {
    "duration": 0.005407,
    "status": "PASSED"
   },
   "oelib.license.TestSimpleCombinations.test_tests": {
    "duration": 0.001918,
    "status": "PASSED"
   },
   "oelib.license.TestSingleLicense.test_invalid_licenses": {
    "duration": 0.007346,
    "status": "PASSED"
   },
   "oelib.license.TestSingleLicense.test_single_licenses": {
    "duration": 0.002107,
    "status": "PASSED"
   },
   "oelib.license.TestSort.test_sort": {
    "duration": 0.007029,
    "status": "PASSED"
   },
   "oelib.package.TestCopyDebugSources.test_copydebugsources_copies_files_and_dereferences_links": {
    "duration": 0.01406,
    "status": "PASSED"
   },
   "oelib.package.TestCopyDebugSources.test_copydebugsources_ignores_copy_failure": {
    "duration": 0.008262,
    "status": "PASSED"
   },
   "oelib.package.TestCopyDebugSources.test_copydebugsources_ignores_empty_externalsrc_relocation": {
    "duration": 0.006633,
    "status": "PASSED"
   },
   "oelib.package.TestCopyDebugSources.test_copydebugsources_moves_externalsrc_relocation": {
    "duration": 0.009272,
    "status": "PASSED"
   },
   "oelib.package.TestCopyDebugSources.test_copydebugsources_recovers_kernel_source_files": {
    "duration": 0.00827,
    "status": "PASSED"
   },
   "oelib.patch.TestGitApplyTree.test_dirty_push_run_false_returns_argv": {
    "duration": 0.2983,
    "status": "PASSED"
   },
   "oelib.patch.TestGitApplyTree.test_fallback_preserves_original_patch_name": {
    "duration": 0.7538,
    "status": "PASSED"
   },
   "oelib.patch.TestGitApplyTree.test_git_am_preserves_original_patch_name": {
    "duration": 0.7333,
    "status": "PASSED"
   },
   "oelib.patch.TestGitApplyTree.test_push_run_false_returns_argv": {
    "duration": 0.4639,
    "status": "PASSED"
   },
   "oelib.patch.TestPatchTree.test_push_run_false_returns_argv": {
    "duration": 0.00459,
    "status": "PASSED"
   },
   "oelib.patch.TestRunCmd.test_runcmd_allows_explicit_shell": {
    "duration": 0.003102,
    "status": "PASSED"
   },
   "oelib.patch.TestRunCmd.test_runcmd_preserves_argv_elements": {
    "duration": 0.01467,
    "status": "PASSED"
   },
   "oelib.patch.TestRunCmd.test_runcmd_reports_exit_status": {
    "duration": 0.0173,
    "status": "PASSED"
   },
   "oelib.patch.TestRunCmd.test_runcmd_wraps_exec_failure": {
    "duration": 0.000782,
    "status": "PASSED"
   },
   "oelib.path.TestRealPath.test_loop": {
    "duration": 0.005815,
    "status": "PASSED"
   },
   "oelib.path.TestRealPath.test_norm": {
    "duration": 0.004331,
    "status": "PASSED"
   },
   "oelib.path.TestRealPath.test_phys": {
    "duration": 0.003147,
    "status": "PASSED"
   },
   "oelib.types.TestBooleanType.test_bool_equality": {
    "duration": 0.0005209,
    "status": "PASSED"
   },
   "oelib.types.TestBooleanType.test_false": {
    "duration": 0.0006416,
    "status": "PASSED"
   },
   "oelib.types.TestBooleanType.test_invalid": {
    "duration": 0.0007961,
    "status": "PASSED"
   },
   "oelib.types.TestBooleanType.test_true": {
    "duration": 0.0009446,
    "status": "PASSED"
   },
   "oelib.types.TestList.test_list_nosep": {
    "duration": 0.001111,
    "status": "PASSED"
   },
   "oelib.types.TestList.test_list_usersep": {
    "duration": 0.0006232,
    "status": "PASSED"
   },
   "oelib.utils.TestDefaultFeatures.test_filter_default_features": {
    "duration": 0.0006137,
    "status": "PASSED"
   },
   "oelib.utils.TestMultiprocessLaunch.test_multiprocesslaunch": {
    "duration": 0.04571,
    "status": "PASSED"
   },
   "oelib.utils.TestPackagesFilterOutSystem.test_filter": {
    "duration": 0.004441,
    "status": "PASSED"
   },
   "oelib.utils.TestTrimVersion.test_num_exception": {
    "duration": 0.001265,
    "status": "PASSED"
   },
   "oelib.utils.TestTrimVersion.test_valid": {
    "duration": 0.001821,
    "status": "PASSED"
   },
   "oelib.utils.TestTrimVersion.test_version_exception": {
    "duration": 0.002471,
    "status": "PASSED"
   },
   "oescripts.OEGitproxyTests.test_oegitproxy_help": {
    "duration": 0.3295,
    "status": "PASSED"
   },
   "oescripts.OEGitproxyTests.test_oegitproxy_proxy": {
    "duration": 0.3254,
    "status": "PASSED"
   },
   "oescripts.OEGitproxyTests.test_oegitproxy_proxy_dash": {
    "duration": 0.009787,
    "log": "No \"dash\" found on test system.\n",
    "status": "SKIPPED"
   },
   "oescripts.OEListPackageconfigTests.test_packageconfig_flags_default": {
    "duration": 270.631,
    "status": "PASSED"
   },
   "oescripts.OEListPackageconfigTests.test_packageconfig_flags_help": {
    "duration": 0.2526,
    "status": "PASSED"
   },
   "oescripts.OEListPackageconfigTests.test_packageconfig_flags_option_all": {
    "duration": 282.658,
    "status": "PASSED"
   },
   "oescripts.OEListPackageconfigTests.test_packageconfig_flags_option_flags": {
    "duration": 275.518,
    "status": "PASSED"
   },
   "oescripts.OEListPackageconfigTests.test_packageconfig_flags_options_preferred_only": {
    "duration": 284.619,
    "status": "PASSED"
   },
   "oescripts.OEPybootchartguyTests.test_pybootchartguy_help": {
    "duration": 0.0009725,
    "log": "Python cairo module is not present\n",
    "status": "SKIPPED"
   },
   "oescripts.OEPybootchartguyTests.test_pybootchartguy_to_generate_build_pdf_output": {
    "duration": 0.001118,
    "log": "Python cairo module is not present\n",
    "status": "SKIPPED"
   },
   "oescripts.OEPybootchartguyTests.test_pybootchartguy_to_generate_build_png_output": {
    "duration": 0.001512,
    "log": "Python cairo module is not present\n",
    "status": "SKIPPED"
   },
   "oescripts.OEPybootchartguyTests.test_pybootchartguy_to_generate_build_svg_output": {
    "duration": 0.00193,
    "log": "Python cairo module is not present\n",
    "status": "SKIPPED"
   },
   "oescripts.OeRunNativeTest.test_oe_run_native": {
    "duration": 15.123,
    "status": "PASSED"
   },
   "overlayfs.OverlayFSEtcRunTimeTests.test_all_required_variables_set": {
    "duration": 285.371,
    "oetags": [
     "runqemu"
    ],
    "status": "PASSED"
   },
   "overlayfs.OverlayFSEtcRunTimeTests.test_image_feature_conflict": {
    "duration": 37.92,
    "oetags": [
     "runqemu"
    ],
    "status": "PASSED"
   },
   "overlayfs.OverlayFSEtcRunTimeTests.test_image_feature_is_missing": {
    "duration": 150.088,
    "oetags": [
     "runqemu"
    ],
    "status": "PASSED"
   },
   "overlayfs.OverlayFSEtcRunTimeTests.test_lower_layer_access": {
    "duration": 149.762,
    "oetags": [
     "runqemu"
    ],
    "status": "PASSED"
   },
   "overlayfs.OverlayFSEtcRunTimeTests.test_postinst_on_target_for_read_only_rootfs": {
    "duration": 142.144,
    "oetags": [
     "runqemu"
    ],
    "status": "PASSED"
   },
   "overlayfs.OverlayFSEtcRunTimeTests.test_sbin_init_original": {
    "duration": 152.294,
    "oetags": [
     "runqemu"
    ],
    "status": "PASSED"
   },
   "overlayfs.OverlayFSEtcRunTimeTests.test_sbin_init_preinit": {
    "duration": 143.402,
    "oetags": [
     "runqemu"
    ],
    "status": "PASSED"
   },
   "overlayfs.OverlayFSEtcRunTimeTests.test_sbin_init_read_only": {
    "duration": 135.727,
    "oetags": [
     "runqemu"
    ],
    "status": "PASSED"
   },
   "overlayfs.OverlayFSTests.test_correct_image_fstab": {
    "duration": 151.748,
    "oetags": [
     "runqemu"
    ],
    "status": "PASSED"
   },
   "overlayfs.OverlayFSTests.test_correct_image_unit": {
    "duration": 110.662,
    "oetags": [
     "runqemu"
    ],
    "status": "PASSED"
   },
   "overlayfs.OverlayFSTests.test_distro_features_missing": {
    "duration": 30.565,
    "status": "PASSED"
   },
   "overlayfs.OverlayFSTests.test_mount_unit_not_set": {
    "duration": 23.428,
    "status": "PASSED"
   },
   "overlayfs.OverlayFSTests.test_not_all_units_installed": {
    "duration": 87.908,
    "status": "PASSED"
   },
   "overlayfs.OverlayFSTests.test_not_all_units_installed_but_qa_skipped": {
    "duration": 112.987,
    "status": "PASSED"
   },
   "overlayfs.OverlayFSTests.test_wrong_mount_unit_set": {
    "duration": 20.457,
    "status": "PASSED"
   },
   "package.PackageKeepSections.test_package_keep_sections": {
    "duration": 467.607,
    "status": "PASSED"
   },
   "package.PackageTests.test_gdb_hardlink_debug": {
    "duration": 152.001,
    "status": "PASSED"
   },
   "package.PackageTests.test_package_name_conflict": {
    "duration": 20.941,
    "status": "PASSED"
   },
   "package.PackageTests.test_preserve_ownership": {
    "duration": 103.556,
    "status": "PASSED"
   },
   "package.PackageTests.test_preserve_sparse_hardlinks": {
    "duration": 51.331,
    "status": "PASSED"
   },
   "package.VersionOrdering.test_dpkg": {
    "duration": 0.03129,
    "status": "PASSED"
   },
   "package.VersionOrdering.test_opkg": {
    "duration": 0.05184,
    "status": "PASSED"
   },
   "package.VersionOrdering.test_rpm": {
    "duration": 0.2829,
    "status": "PASSED"
   },
   "picolibc.PicolibcTest.test_picolibc": {
    "duration": 0.5744,
    "log": "This test only works with machines : qemuarm qemuarm64 qemuriscv32 qemuriscv64\n",
    "status": "SKIPPED"
   },
   "pkgdata.OePkgdataUtilTests.test_find_path": {
    "duration": 4.032,
    "status": "PASSED"
   },
   "pkgdata.OePkgdataUtilTests.test_glob": {
    "duration": 1.97,
    "status": "PASSED"
   },
   "pkgdata.OePkgdataUtilTests.test_list_pkg_files": {
    "duration": 9.858,
    "status": "PASSED"
   },
   "pkgdata.OePkgdataUtilTests.test_list_pkgs": {
    "duration": 8.019,
    "status": "PASSED"
   },
   "pkgdata.OePkgdataUtilTests.test_lookup_pkg": {
    "duration": 6.217,
    "status": "PASSED"
   },
   "pkgdata.OePkgdataUtilTests.test_lookup_recipe": {
    "duration": 2.802,
    "status": "PASSED"
   },
   "pkgdata.OePkgdataUtilTests.test_multilib_variables": {
    "duration": 1689.601,
    "status": "PASSED"
   },
   "pkgdata.OePkgdataUtilTests.test_no_param": {
    "duration": 0.08735,
    "status": "PASSED"
   },
   "pkgdata.OePkgdataUtilTests.test_read_value": {
    "duration": 2.986,
    "status": "PASSED"
   },
   "pkgdata.OePkgdataUtilTests.test_specify_pkgdatadir": {
    "duration": 1.048,
    "status": "PASSED"
   },
   "pokybleeding.PokyBleeding.test_poky_bleeding_autorev": {
    "duration": 70.212,
    "status": "PASSED"
   },
   "prservice.BitbakePrTests.test_import_export_override_db": {
    "duration": 1519.697,
    "status": "PASSED"
   },
   "prservice.BitbakePrTests.test_import_export_replace_db": {
    "duration": 128.345,
    "status": "PASSED"
   },
   "prservice.BitbakePrTests.test_pr_service_deb_arch_dep": {
    "duration": 83.521,
    "status": "PASSED"
   },
   "prservice.BitbakePrTests.test_pr_service_deb_arch_indep": {
    "duration": 37.903,
    "status": "PASSED"
   },
   "prservice.BitbakePrTests.test_pr_service_ipk_arch_dep": {
    "duration": 79.604,
    "status": "PASSED"
   },
   "prservice.BitbakePrTests.test_pr_service_ipk_arch_indep": {
    "duration": 32.833,
    "status": "PASSED"
   },
   "prservice.BitbakePrTests.test_pr_service_rpm_arch_dep": {
    "duration": 61.604,
    "status": "PASSED"
   },
   "prservice.BitbakePrTests.test_pr_service_rpm_arch_indep": {
    "duration": 28.014,
    "status": "PASSED"
   },
   "prservice.BitbakePrTests.test_stopping_prservice_message": {
    "duration": 0.6431,
    "status": "PASSED"
   },
   "pseudo.Pseudo.test_pseudo_pyc_creation": {
    "duration": 11.87,
    "status": "PASSED"
   },
   "recipetool.RecipetoolAppendTests.test_recipetool_appendfile_add": {
    "duration": 123.624,
    "status": "PASSED"
   },
   "recipetool.RecipetoolAppendTests.test_recipetool_appendfile_add_bindir": {
    "duration": 43.813,
    "status": "PASSED"
   },
   "recipetool.RecipetoolAppendTests.test_recipetool_appendfile_add_machine": {
    "duration": 35.663,
    "status": "PASSED"
   },
   "recipetool.RecipetoolAppendTests.test_recipetool_appendfile_alternatives": {
    "duration": 33.699,
    "status": "PASSED"
   },
   "recipetool.RecipetoolAppendTests.test_recipetool_appendfile_basic": {
    "duration": 38.94,
    "status": "PASSED"
   },
   "recipetool.RecipetoolAppendTests.test_recipetool_appendfile_binary": {
    "duration": 27.809,
    "status": "PASSED"
   },
   "recipetool.RecipetoolAppendTests.test_recipetool_appendfile_extlayer": {
    "duration": 5.806,
    "status": "PASSED"
   },
   "recipetool.RecipetoolAppendTests.test_recipetool_appendfile_inst_func": {
    "duration": 33.092,
    "status": "PASSED"
   },
   "recipetool.RecipetoolAppendTests.test_recipetool_appendfile_inst_glob": {
    "duration": 36.276,
    "status": "PASSED"
   },
   "recipetool.RecipetoolAppendTests.test_recipetool_appendfile_inst_todir_glob": {
    "duration": 32.889,
    "status": "PASSED"
   },
   "recipetool.RecipetoolAppendTests.test_recipetool_appendfile_invalid": {
    "duration": 34.226,
    "status": "PASSED"
   },
   "recipetool.RecipetoolAppendTests.test_recipetool_appendfile_orig": {
    "duration": 34.356,
    "status": "PASSED"
   },
   "recipetool.RecipetoolAppendTests.test_recipetool_appendfile_patch": {
    "duration": 33.742,
    "status": "PASSED"
   },
   "recipetool.RecipetoolAppendTests.test_recipetool_appendfile_postinstall": {
    "duration": 36.969,
    "status": "PASSED"
   },
   "recipetool.RecipetoolAppendTests.test_recipetool_appendfile_renamed": {
    "duration": 31.35,
    "status": "PASSED"
   },
   "recipetool.RecipetoolAppendTests.test_recipetool_appendfile_script": {
    "duration": 33.112,
    "status": "PASSED"
   },
   "recipetool.RecipetoolAppendTests.test_recipetool_appendfile_subdir": {
    "duration": 33.96,
    "status": "PASSED"
   },
   "recipetool.RecipetoolAppendTests.test_recipetool_appendfile_todir": {
    "duration": 34.031,
    "status": "PASSED"
   },
   "recipetool.RecipetoolAppendTests.test_recipetool_appendfile_wildcard": {
    "duration": 13.255,
    "status": "PASSED"
   },
   "recipetool.RecipetoolAppendsrcTests.test_recipetool_appendsrcfile_basic": {
    "duration": 98.492,
    "status": "PASSED"
   },
   "recipetool.RecipetoolAppendsrcTests.test_recipetool_appendsrcfile_basic_wildcard": {
    "duration": 64.733,
    "status": "PASSED"
   },
   "recipetool.RecipetoolAppendsrcTests.test_recipetool_appendsrcfile_existing_in_src_uri": {
    "duration": 23.245,
    "status": "PASSED"
   },
   "recipetool.RecipetoolAppendsrcTests.test_recipetool_appendsrcfile_existing_in_src_uri_diff_params": {
    "duration": 23.223,
    "status": "PASSED"
   },
   "recipetool.RecipetoolAppendsrcTests.test_recipetool_appendsrcfile_machine": {
    "duration": 75.243,
    "status": "PASSED"
   },
   "recipetool.RecipetoolAppendsrcTests.test_recipetool_appendsrcfile_replace_file_srcdir": {
    "duration": 39.422,
    "status": "PASSED"
   },
   "recipetool.RecipetoolAppendsrcTests.test_recipetool_appendsrcfile_srcdir_basic": {
    "duration": 28.633,
    "status": "PASSED"
   },
   "recipetool.RecipetoolAppendsrcTests.test_recipetool_appendsrcfile_subdir_basic": {
    "duration": 47.539,
    "status": "PASSED"
   },
   "recipetool.RecipetoolAppendsrcTests.test_recipetool_appendsrcfile_subdir_basic_dirdest": {
    "duration": 48.812,
    "status": "PASSED"
   },
   "recipetool.RecipetoolAppendsrcTests.test_recipetool_appendsrcfile_update_recipe_basic": {
    "duration": 11.636,
    "status": "PASSED"
   },
   "recipetool.RecipetoolAppendsrcTests.test_recipetool_appendsrcfiles_basic": {
    "duration": 65.111,
    "status": "PASSED"
   },
   "recipetool.RecipetoolAppendsrcTests.test_recipetool_appendsrcfiles_basic_subdir": {
    "duration": 57.266,
    "status": "PASSED"
   },
   "recipetool.RecipetoolCreateTests.test_recipetool_create": {
    "duration": 41.635,
    "status": "PASSED"
   },
   "recipetool.RecipetoolCreateTests.test_recipetool_create_autotools": {
    "duration": 84.836,
    "status": "PASSED"
   },
   "recipetool.RecipetoolCreateTests.test_recipetool_create_cmake": {
    "duration": 40.425,
    "status": "PASSED"
   },
   "recipetool.RecipetoolCreateTests.test_recipetool_create_git_http": {
    "duration": 36.712,
    "status": "PASSED"
   },
   "recipetool.RecipetoolCreateTests.test_recipetool_create_git_srcbranch": {
    "duration": 40.417,
    "status": "PASSED"
   },
   "recipetool.RecipetoolCreateTests.test_recipetool_create_git_srcuri_branch": {
    "duration": 31.458,
    "status": "PASSED"
   },
   "recipetool.RecipetoolCreateTests.test_recipetool_create_git_srcuri_master": {
    "duration": 33.124,
    "status": "PASSED"
   },
   "recipetool.RecipetoolCreateTests.test_recipetool_create_github": {
    "duration": 38.886,
    "status": "PASSED"
   },
   "recipetool.RecipetoolCreateTests.test_recipetool_create_github_tarball": {
    "duration": 40.002,
    "status": "PASSED"
   },
   "recipetool.RecipetoolCreateTests.test_recipetool_create_go": {
    "duration": 52.996,
    "status": "PASSED"
   },
   "recipetool.RecipetoolCreateTests.test_recipetool_create_npm": {
    "duration": 1.381,
    "log": "Test needs meta-oe for nodejs\n",
    "status": "SKIPPED"
   },
   "recipetool.RecipetoolCreateTests.test_recipetool_create_python3_pep517_flit_core_buildapi": {
    "duration": 32.956,
    "status": "PASSED"
   },
   "recipetool.RecipetoolCreateTests.test_recipetool_create_python3_pep517_hatchling": {
    "duration": 52.711,
    "status": "PASSED"
   },
   "recipetool.RecipetoolCreateTests.test_recipetool_create_python3_pep517_maturin": {
    "duration": 31.824,
    "status": "PASSED"
   },
   "recipetool.RecipetoolCreateTests.test_recipetool_create_python3_pep517_mesonpy": {
    "duration": 29.727,
    "status": "PASSED"
   },
   "recipetool.RecipetoolCreateTests.test_recipetool_create_python3_pep517_poetry_core_masonry_api": {
    "duration": 29.868,
    "status": "PASSED"
   },
   "recipetool.RecipetoolCreateTests.test_recipetool_create_python3_pep517_setuptools_build_meta": {
    "duration": 39.115,
    "status": "PASSED"
   },
   "recipetool.RecipetoolCreateTests.test_recipetool_create_python3_pep517_setuptools_build_meta_license_pep639": {
    "duration": 31.614,
    "status": "PASSED"
   },
   "recipetool.RecipetoolCreateTests.test_recipetool_create_python3_pep517_setuptools_build_meta_license_prepep639": {
    "duration": 33.983,
    "status": "PASSED"
   },
   "recipetool.RecipetoolCreateTests.test_recipetool_create_python3_setuptools": {
    "duration": 29.549,
    "status": "PASSED"
   },
   "recipetool.RecipetoolCreateTests.test_recipetool_create_python3_setuptools_pypi": {
    "duration": 58.739,
    "status": "PASSED"
   },
   "recipetool.RecipetoolCreateTests.test_recipetool_create_python3_setuptools_pypi_tarball": {
    "duration": 29.189,
    "status": "PASSED"
   },
   "recipetool.RecipetoolCreateTests.test_recipetool_create_simple": {
    "duration": 33.459,
    "status": "PASSED"
   },
   "recipetool.RecipetoolTests.test_recipetool_handle_license_vars": {
    "duration": 2.24,
    "status": "PASSED"
   },
   "recipetool.RecipetoolTests.test_recipetool_load_plugin": {
    "duration": 10.363,
    "status": "PASSED"
   },
   "recipetool.RecipetoolTests.test_recipetool_split_pkg_licenses": {
    "duration": 0.02185,
    "status": "PASSED"
   },
   "recipeutils.RecipeUtilsTests.test_patch_recipe_appends": {
    "duration": 0.08521,
    "status": "PASSED"
   },
   "recipeutils.RecipeUtilsTests.test_patch_recipe_singleappend": {
    "duration": 0.06916,
    "status": "PASSED"
   },
   "recipeutils.RecipeUtilsTests.test_patch_recipe_varflag": {
    "duration": 0.07902,
    "status": "PASSED"
   },
   "recipeutils.RecipeUtilsTests.test_split_var_value": {
    "duration": 0.01109,
    "status": "PASSED"
   },
   "recipeutils.RecipeUtilsTests.test_validate_pn": {
    "duration": 0.01152,
    "status": "PASSED"
   },
   "reproducible.DiffoscopeTests.test_diffoscope": {
    "log": "Skip by the command line argument \"reproducible\"\n",
    "status": "SKIPPED"
   },
   "reproducible.ReproducibleTests.test_reproducible_builds": {
    "log": "Skip by the command line argument \"reproducible\"\n",
    "status": "SKIPPED"
   },
   "resulttooltests.ResultToolTests.test_can_compare_ltp_tests": {
    "duration": 0.008316,
    "status": "PASSED"
   },
   "resulttooltests.ResultToolTests.test_can_match_non_static_ptest_names": {
    "duration": 0.009281,
    "status": "PASSED"
   },
   "resulttooltests.ResultToolTests.test_can_not_compare_non_ltp_tests": {
    "duration": 0.008341,
    "status": "PASSED"
   },
   "resulttooltests.ResultToolTests.test_durations_build_rows_computes_consecutive_pairs_only": {
    "duration": 0.008346,
    "status": "PASSED"
   },
   "resulttooltests.ResultToolTests.test_durations_build_rows_suppresses_pct_when_both_runs_round_to_zero": {
    "duration": 0.009109,
    "status": "PASSED"
   },
   "resulttooltests.ResultToolTests.test_durations_build_tables_hides_short_tests_by_default": {
    "duration": 0.008277,
    "status": "PASSED"
   },
   "resulttooltests.ResultToolTests.test_durations_build_tables_orders_short_tables_after_all_main_tables": {
    "duration": 0.009088,
    "status": "PASSED"
   },
   "resulttooltests.ResultToolTests.test_durations_filter_sort_rows_limit_applies_after_sort": {
    "duration": 0.007735,
    "status": "PASSED"
   },
   "resulttooltests.ResultToolTests.test_durations_filter_sort_rows_sort_by_delta_orders_by_largest_change": {
    "duration": 0.008557,
    "status": "PASSED"
   },
   "resulttooltests.ResultToolTests.test_durations_filter_sort_rows_threshold_checks_every_pair_not_just_first": {
    "duration": 0.008156,
    "status": "PASSED"
   },
   "resulttooltests.ResultToolTests.test_durations_filter_sort_rows_threshold_ignores_suppressed_none_pct": {
    "duration": 0.007502,
    "status": "PASSED"
   },
   "resulttooltests.ResultToolTests.test_durations_filter_sort_rows_threshold_keeps_rows_above_it": {
    "duration": 0.007287,
    "status": "PASSED"
   },
   "resulttooltests.ResultToolTests.test_durations_filter_sort_rows_threshold_zero_disables_filtering": {
    "duration": 0.007086,
    "status": "PASSED"
   },
   "resulttooltests.ResultToolTests.test_durations_get_durations_extracts_testcase_and_suite_durations": {
    "duration": 0.007158,
    "status": "PASSED"
   },
   "resulttooltests.ResultToolTests.test_durations_parse_report_log_extracts_time_column": {
    "duration": 0.007582,
    "status": "PASSED"
   },
   "resulttooltests.ResultToolTests.test_junit_empty_testresults": {
    "duration": 0.007393,
    "status": "PASSED"
   },
   "resulttooltests.ResultToolTests.test_junit_log_attached": {
    "duration": 0.007638,
    "status": "PASSED"
   },
   "resulttooltests.ResultToolTests.test_junit_log_inline": {
    "duration": 0.007487,
    "status": "PASSED"
   },
   "resulttooltests.ResultToolTests.test_junit_missing_image_tests": {
    "duration": 0.00773,
    "status": "PASSED"
   },
   "resulttooltests.ResultToolTests.test_junit_missing_ptests": {
    "duration": 0.007575,
    "status": "PASSED"
   },
   "resulttooltests.ResultToolTests.test_machine_matches": {
    "duration": 0.007385,
    "status": "PASSED"
   },
   "resulttooltests.ResultToolTests.test_machine_mismatches": {
    "duration": 0.0072,
    "status": "PASSED"
   },
   "resulttooltests.ResultToolTests.test_merge_can_merged_results": {
    "duration": 0.007346,
    "status": "PASSED"
   },
   "resulttooltests.ResultToolTests.test_metadata_matching_is_only_checked_for_relevant_test_type": {
    "duration": 0.007454,
    "status": "PASSED"
   },
   "resulttooltests.ResultToolTests.test_regression_can_get_regression_base_target_pair": {
    "duration": 0.007987,
    "status": "PASSED"
   },
   "resulttooltests.ResultToolTests.test_regression_can_get_regression_result": {
    "duration": 0.007671,
    "status": "PASSED"
   },
   "resulttooltests.ResultToolTests.test_report_can_aggregate_test_result": {
    "duration": 0.008244,
    "status": "PASSED"
   },
   "resulttooltests.ResultToolTests.test_results_with_matching_metadata_can_be_compared": {
    "duration": 0.00748,
    "status": "PASSED"
   },
   "resulttooltests.ResultToolTests.test_results_with_mismatching_metadata_can_not_be_compared": {
    "duration": 0.00699,
    "status": "PASSED"
   },
   "resulttooltests.ResultToolTests.test_results_without_metadata_can_be_compared": {
    "duration": 0.007066,
    "status": "PASSED"
   },
   "resulttooltests.ResultToolTests.test_target_result_with_missing_metadata_can_not_be_compared": {
    "duration": 0.007003,
    "status": "PASSED"
   },
   "retain.Retain.test_retain_always": {
    "duration": 48.178,
    "status": "PASSED"
   },
   "retain.Retain.test_retain_failure": {
    "duration": 54.657,
    "status": "PASSED"
   },
   "retain.Retain.test_retain_global": {
    "duration": 88.868,
    "status": "PASSED"
   },
   "retain.Retain.test_retain_misc": {
    "duration": 100.228,
    "status": "PASSED"
   },
   "rootfspostcommandstests.ShadowUtilsTidyFiles.test_shadowutils_backup_files": {
    "duration": 36.093,
    "log": "Testcase skipped as 'tidy_shadowutils_files' rootfs post process command is not the set SORT_PASSWD_POSTPROCESS_COMMAND.\n",
    "status": "SKIPPED"
   },
   "rootfspostcommandstests.ShadowUtilsTidyFiles.test_shadowutils_sorted_files": {
    "duration": 7.861,
    "log": "Testcase skipped as 'tidy_shadowutils_files' rootfs post process command is not the set SORT_PASSWD_POSTPROCESS_COMMAND.\n",
    "status": "SKIPPED"
   },
   "rpmtests.BitbakeTests.test_rpm_filenames": {
    "duration": 8.061,
    "status": "PASSED"
   },
   "runcmd.RunCmdTests.test_list_not_found": {
    "duration": 0.005004,
    "status": "PASSED"
   },
   "runcmd.RunCmdTests.test_list_okay": {
    "duration": 0.2174,
    "status": "PASSED"
   },
   "runcmd.RunCmdTests.test_log": {
    "duration": 0.00664,
    "status": "PASSED"
   },
   "runcmd.RunCmdTests.test_log_split": {
    "duration": 0.006293,
    "status": "PASSED"
   },
   "runcmd.RunCmdTests.test_no_shell": {
    "duration": 0.005467,
    "status": "PASSED"
   },
   "runcmd.RunCmdTests.test_output": {
    "duration": 0.005282,
    "status": "PASSED"
   },
   "runcmd.RunCmdTests.test_output_split": {
    "duration": 0.005389,
    "status": "PASSED"
   },
   "runcmd.RunCmdTests.test_result_assertion": {
    "duration": 0.0178,
    "status": "PASSED"
   },
   "runcmd.RunCmdTests.test_result_exception": {
    "duration": 0.009841,
    "status": "PASSED"
   },
   "runcmd.RunCmdTests.test_result_false": {
    "duration": 0.008817,
    "status": "PASSED"
   },
   "runcmd.RunCmdTests.test_result_okay": {
    "duration": 0.007856,
    "status": "PASSED"
   },
   "runcmd.RunCmdTests.test_shell": {
    "duration": 0.008853,
    "status": "PASSED"
   },
   "runcmd.RunCmdTests.test_stdin": {
    "duration": 0.005938,
    "status": "PASSED"
   },
   "runcmd.RunCmdTests.test_stdin_timeout": {
    "duration": 10.005,
    "status": "PASSED"
   },
   "runcmd.RunCmdTests.test_timeout": {
    "duration": 10.006,
    "status": "PASSED"
   },
   "runcmd.RunCmdTests.test_timeout_split": {
    "duration": 10.007,
    "status": "PASSED"
   },
   "runqemu.RunqemuTests.test_boot_compressed_wic_by_path": {
    "duration": 145.97,
    "oetags": [
     "runqemu"
    ],
    "status": "PASSED"
   },
   "runqemu.RunqemuTests.test_boot_compressed_wic_by_recipe": {
    "duration": 27.17,
    "oetags": [
     "runqemu"
    ],
    "status": "PASSED"
   },
   "runqemu.RunqemuTests.test_boot_deploy": {
    "duration": 21.061,
    "oetags": [
     "runqemu"
    ],
    "status": "PASSED"
   },
   "runqemu.RunqemuTests.test_boot_deploy_hddimg": {
    "duration": 23.1,
    "oetags": [
     "runqemu"
    ],
    "status": "PASSED"
   },
   "runqemu.RunqemuTests.test_boot_machine": {
    "duration": 28.218,
    "oetags": [
     "runqemu"
    ],
    "status": "PASSED"
   },
   "runqemu.RunqemuTests.test_boot_machine_ext4": {
    "duration": 26.251,
    "oetags": [
     "runqemu"
    ],
    "status": "PASSED"
   },
   "runqemu.RunqemuTests.test_boot_machine_iso": {
    "duration": 24.789,
    "oetags": [
     "runqemu"
    ],
    "status": "PASSED"
   },
   "runqemu.RunqemuTests.test_boot_machine_slirp": {
    "duration": 21.016,
    "oetags": [
     "runqemu"
    ],
    "status": "PASSED"
   },
   "runqemu.RunqemuTests.test_boot_machine_slirp_qcow2": {
    "duration": 25.16,
    "oetags": [
     "runqemu"
    ],
    "status": "PASSED"
   },
   "runqemu.RunqemuTests.test_boot_qemu_boot": {
    "duration": 23.456,
    "oetags": [
     "runqemu"
    ],
    "status": "PASSED"
   },
   "runqemu.RunqemuTests.test_boot_recipe_image": {
    "duration": 29.957,
    "oetags": [
     "runqemu"
    ],
    "status": "PASSED"
   },
   "runqemu.RunqemuTests.test_boot_recipe_image_vdi": {
    "duration": 25.999,
    "oetags": [
     "runqemu"
    ],
    "status": "PASSED"
   },
   "runqemu.RunqemuTests.test_boot_recipe_image_vmdk": {
    "duration": 25.744,
    "oetags": [
     "runqemu"
    ],
    "status": "PASSED"
   },
   "runqemu.RunqemuTests.test_boot_rootfs": {
    "duration": 23.471,
    "oetags": [
     "runqemu"
    ],
    "status": "PASSED"
   },
   "runtime_test.Postinst.test_failing_postinst": {
    "duration": 180.291,
    "oetags": [
     "runqemu"
    ],
    "status": "PASSED"
   },
   "runtime_test.Postinst.test_postinst_rootfs_and_boot_systemd": {
    "duration": 319.954,
    "oetags": [
     "runqemu"
    ],
    "status": "PASSED"
   },
   "runtime_test.Postinst.test_postinst_rootfs_and_boot_sysvinit": {
    "duration": 253.261,
    "oetags": [
     "runqemu"
    ],
    "status": "PASSED"
   },
   "runtime_test.RustKernel.test_kernel_rust_sample": {
    "duration": 652.132,
    "oetags": [
     "runqemu"
    ],
    "status": "PASSED"
   },
   "runtime_test.SystemTap.test_crosstap_helloworld": {
    "duration": 363.534,
    "oetags": [
     "runqemu"
    ],
    "status": "PASSED"
   },
   "runtime_test.SystemTap.test_crosstap_pstree": {
    "duration": 44.811,
    "oetags": [
     "runqemu"
    ],
    "status": "PASSED"
   },
   "runtime_test.SystemTap.test_crosstap_syscalls_by_pid": {
    "duration": 46.697,
    "oetags": [
     "runqemu"
    ],
    "status": "PASSED"
   },
   "runtime_test.SystemTap.test_crosstap_syscalls_by_proc": {
    "duration": 46.982,
    "oetags": [
     "runqemu"
    ],
    "status": "PASSED"
   },
   "runtime_test.TestExport.test_testexport_basic": {
    "duration": 171.814,
    "oetags": [
     "runqemu"
    ],
    "status": "PASSED"
   },
   "runtime_test.TestExport.test_testexport_sdk": {
    "duration": 151.338,
    "status": "PASSED"
   },
   "runtime_test.TestImage.test_testimage_apt": {
    "duration": 221.151,
    "oetags": [
     "runqemu"
    ],
    "status": "PASSED"
   },
   "runtime_test.TestImage.test_testimage_dnf": {
    "duration": 173.236,
    "oetags": [
     "runqemu"
    ],
    "status": "PASSED"
   },
   "runtime_test.TestImage.test_testimage_install": {
    "duration": 149.145,
    "oetags": [
     "runqemu"
    ],
    "status": "PASSED"
   },
   "runtime_test.TestImage.test_testimage_slirp": {
    "duration": 108.834,
    "oetags": [
     "runqemu"
    ],
    "status": "PASSED"
   },
   "runtime_test.TestImage.test_testimage_virgl_gtk_sdl": {
    "duration": 159.799,
    "oetags": [
     "runqemu"
    ],
    "status": "PASSED"
   },
   "runtime_test.TestImage.test_testimage_virgl_headless": {
    "duration": 0.00551,
    "log": "virgl headless cannot be tested with rocky-10.2\n",
    "oetags": [
     "runqemu"
    ],
    "status": "SKIPPED"
   },
   "rust.RustStaticMuslTest.test_static_musl_linking": {
    "duration": 79.428,
    "status": "PASSED"
   },
   "sdk.SDKTests.test_sdk_manifests": {
    "duration": 566.299,
    "status": "PASSED"
   },
   "sdk.SDKTests.test_sdk_runqemu": {
    "duration": 535.585,
    "status": "PASSED"
   },
   "selftest.ExternalLayer.test_list_imported": {
    "duration": 0.01773,
    "status": "PASSED"
   },
   "signing.LockedSignatures.test_locked_signatures": {
    "duration": 121.019,
    "status": "PASSED"
   },
   "signing.Signing.test_signing_packages": {
    "duration": 819.15,
    "status": "PASSED"
   },
   "signing.Signing.test_signing_sstate_archive": {
    "duration": 158.353,
    "status": "PASSED"
   },
   "spdx.SPDX30Check.test_baremetal_helloworld": {
    "duration": 99.361,
    "status": "PASSED"
   },
   "spdx.SPDX30Check.test_base_files": {
    "duration": 61.09,
    "status": "PASSED"
   },
   "spdx.SPDX30Check.test_core_image_minimal": {
    "duration": 97.134,
    "status": "PASSED"
   },
   "spdx.SPDX30Check.test_core_image_minimal_sdk": {
    "duration": 489.042,
    "status": "PASSED"
   },
   "spdx.SPDX30Check.test_custom_annotation_vars": {
    "duration": 32.034,
    "status": "PASSED"
   },
   "spdx.SPDX30Check.test_download_location_defensive_handling": {
    "duration": 15.144,
    "status": "PASSED"
   },
   "spdx.SPDX30Check.test_extra_opts": {
    "duration": 108.747,
    "status": "PASSED"
   },
   "spdx.SPDX30Check.test_gcc_include_source": {
    "duration": 1782.579,
    "status": "PASSED"
   },
   "spdx.SPDX30Check.test_kernel_config_spdx": {
    "duration": 99.067,
    "status": "PASSED"
   },
   "spdx.SPDX30Check.test_packageconfig_spdx": {
    "duration": 21.245,
    "status": "PASSED"
   },
   "spdx.SPDX30Check.test_version_extraction_patterns": {
    "duration": 9.563,
    "status": "PASSED"
   },
   "spdx.SPDX30Check.test_world_sbom": {
    "duration": 27.568,
    "status": "PASSED"
   },
   "sstatetests.SStateCacheManagement.test_sstate_cache_management_script_using_machine": {
    "duration": 202.724,
    "status": "PASSED"
   },
   "sstatetests.SStateCacheManagement.test_sstate_cache_management_script_using_pr_1": {
    "duration": 67.62,
    "status": "PASSED"
   },
   "sstatetests.SStateCacheManagement.test_sstate_cache_management_script_using_pr_2": {
    "duration": 107.215,
    "status": "PASSED"
   },
   "sstatetests.SStateCacheManagement.test_sstate_cache_management_script_using_pr_3": {
    "duration": 175.847,
    "status": "PASSED"
   },
   "sstatetests.SStateCleanup.test_cleansstate_task_distro_nonspecific": {
    "duration": 44.844,
    "status": "PASSED"
   },
   "sstatetests.SStateCleanup.test_cleansstate_task_distro_specific": {
    "duration": 45.082,
    "status": "PASSED"
   },
   "sstatetests.SStateCleanup.test_cleansstate_task_distro_specific_nonspecific": {
    "duration": 49.988,
    "status": "PASSED"
   },
   "sstatetests.SStateCreation.test_sstate_creation_distro_nonspecific": {
    "duration": 34.252,
    "status": "PASSED"
   },
   "sstatetests.SStateCreation.test_sstate_creation_distro_specific": {
    "duration": 39.294,
    "status": "PASSED"
   },
   "sstatetests.SStateDistroTests.test_rebuild_distro_specific_sstate_cross_native_targets": {
    "duration": 50.724,
    "status": "PASSED"
   },
   "sstatetests.SStateDistroTests.test_rebuild_distro_specific_sstate_cross_target": {
    "duration": 50.341,
    "status": "PASSED"
   },
   "sstatetests.SStateDistroTests.test_rebuild_distro_specific_sstate_native_target": {
    "duration": 48.889,
    "status": "PASSED"
   },
   "sstatetests.SStateFindSiginfo.test_sstate_compare_sigfiles_and_find_siginfo": {
    "duration": 265.375,
    "status": "PASSED"
   },
   "sstatetests.SStateHashSameSigs.test_sstate_32_64_same_hash": {
    "duration": 140.899,
    "status": "PASSED"
   },
   "sstatetests.SStateHashSameSigs.test_sstate_nativelsbstring_same_hash": {
    "duration": 153.811,
    "status": "PASSED"
   },
   "sstatetests.SStateHashSameSigs.test_sstate_sdk_arch_same_hash": {
    "duration": 135.153,
    "status": "PASSED"
   },
   "sstatetests.SStateHashSameSigs2.test_sstate_allarch_samesigs": {
    "duration": 142.784,
    "status": "PASSED"
   },
   "sstatetests.SStateHashSameSigs2.test_sstate_nativesdk_samesigs_multilib": {
    "duration": 221.773,
    "status": "PASSED"
   },
   "sstatetests.SStateHashSameSigs3.test_sstate_multilib_or_not_native_samesigs": {
    "duration": 109.86,
    "status": "PASSED"
   },
   "sstatetests.SStateHashSameSigs3.test_sstate_sametune_samesigs": {
    "duration": 234.303,
    "status": "PASSED"
   },
   "sstatetests.SStateHashSameSigs4.test_sstate_movelayer_samesigs": {
    "duration": 68.943,
    "status": "PASSED"
   },
   "sstatetests.SStateHashSameSigs4.test_sstate_noop_samesigs": {
    "duration": 110.954,
    "status": "PASSED"
   },
   "sstatetests.SStatePrintdiff.test_gcc_runtime_vs_gcc_source": {
    "duration": 844.26,
    "status": "PASSED"
   },
   "sstatetests.SStatePrintdiff.test_image_minimal_vs_base_do_configure": {
    "duration": 432.692,
    "status": "PASSED"
   },
   "sstatetests.SStatePrintdiff.test_image_minimal_vs_perlcross": {
    "duration": 213.17,
    "status": "PASSED"
   },
   "sstatetests.SStateTests.test_autorev_sstate_works": {
    "duration": 80.45,
    "status": "PASSED"
   },
   "sysroot.SysrootTests.test_sysroot_cleanup": {
    "duration": 83.553,
    "status": "PASSED"
   },
   "sysroot.SysrootTests.test_sysroot_la": {
    "duration": 36.929,
    "status": "PASSED"
   },
   "sysroot.SysrootTests.test_sysroot_max_shebang": {
    "duration": 16.083,
    "status": "PASSED"
   },
   "sysroot.SysrootTests.test_sysroot_pkgconfig": {
    "duration": 32.621,
    "status": "PASSED"
   },
   "systemd_boot.Systemdboot.test_efi_systemdboot_images_can_be_built": {
    "duration": 111.822,
    "status": "PASSED"
   },
   "tinfoil.TinfoilTests.test_datastore_operations": {
    "duration": 0.6596,
    "status": "PASSED"
   },
   "tinfoil.TinfoilTests.test_expand": {
    "duration": 0.5098,
    "status": "PASSED"
   },
   "tinfoil.TinfoilTests.test_getvar": {
    "duration": 1.011,
    "status": "PASSED"
   },
   "tinfoil.TinfoilTests.test_getvar_bb_origenv": {
    "duration": 1.011,
    "status": "PASSED"
   },
   "tinfoil.TinfoilTests.test_list_recipes": {
    "duration": 4.599,
    "status": "PASSED"
   },
   "tinfoil.TinfoilTests.test_parse_recipe": {
    "duration": 4.787,
    "status": "PASSED"
   },
   "tinfoil.TinfoilTests.test_parse_recipe_copy_expand": {
    "duration": 3.839,
    "status": "PASSED"
   },
   "tinfoil.TinfoilTests.test_parse_recipe_custom_data": {
    "duration": 4.481,
    "status": "PASSED"
   },
   "tinfoil.TinfoilTests.test_parse_virtual_recipe": {
    "duration": 4.488,
    "status": "PASSED"
   },
   "tinfoil.TinfoilTests.test_parse_virtual_recipe_custom_data": {
    "duration": 4.091,
    "status": "PASSED"
   },
   "tinfoil.TinfoilTests.test_run_prepared_task": {
    "duration": 62.017,
    "status": "PASSED"
   },
   "tinfoil.TinfoilTests.test_setvariable_clean": {
    "duration": 3.028,
    "status": "PASSED"
   },
   "tinfoil.TinfoilTests.test_variable_history": {
    "duration": 4.477,
    "status": "PASSED"
   },
   "tinfoil.TinfoilTests.test_wait_event": {
    "duration": 2.005,
    "status": "PASSED"
   },
   "toolchain.ToolchainTests.test_toolchain_switching": {
    "duration": 102.192,
    "status": "PASSED"
   },
   "uboot.UBootConfigTest.test_uboot_config_extract": {
    "duration": 19.277,
    "status": "PASSED"
   },
   "uboot.UBootConfigTest.test_uboot_config_extract_error_missing_config": {
    "duration": 15.161,
    "status": "PASSED"
   },
   "uboot.UBootConfigTest.test_uboot_config_extract_error_nothing_set": {
    "duration": 19.085,
    "status": "PASSED"
   },
   "uboot.UBootConfigTest.test_uboot_config_extract_error_set_both_config_and_machine": {
    "duration": 14.786,
    "status": "PASSED"
   },
   "uboot.UBootConfigTest.test_uboot_config_extract_error_set_uboot_config_binary": {
    "duration": 16.255,
    "status": "PASSED"
   },
   "uboot.UBootConfigTest.test_uboot_config_extract_error_set_uboot_config_fragments": {
    "duration": 14.7,
    "status": "PASSED"
   },
   "uboot.UBootConfigTest.test_uboot_config_extract_error_set_uboot_config_image_fstypes": {
    "duration": 16.016,
    "status": "PASSED"
   },
   "uboot.UBootConfigTest.test_uboot_config_extract_error_set_uboot_config_make_opts": {
    "duration": 15.079,
    "status": "PASSED"
   },
   "uboot.UBootConfigTest.test_uboot_config_extract_legacy": {
    "duration": 18.561,
    "status": "PASSED"
   },
   "uboot.UBootConfigTest.test_uboot_config_extract_single_config": {
    "duration": 18.358,
    "status": "PASSED"
   },
   "uboot.UBootTest.test_boot_uboot": {
    "duration": 0.001153,
    "log": "Test skipped on x86_64\n",
    "oetags": [
     "runqemu"
    ],
    "status": "SKIPPED"
   },
   "uboot.UBootTest.test_boot_uboot_kvm_to_full_target": {
    "duration": 0.001382,
    "log": "Test skipped on x86_64\n",
    "oetags": [
     "runqemu"
    ],
    "status": "SKIPPED"
   },
   "uboot.UBootTest.test_uboot_config_initial_env_binary": {
    "duration": 47.876,
    "status": "PASSED"
   },
   "uboot.UBootTest.test_uboot_initial_env_binary": {
    "duration": 250.104,
    "status": "PASSED"
   },
   "uki.UkiTest.test_uki_boot_systemd": {
    "duration": 157.3,
    "oetags": [
     "runqemu"
    ],
    "status": "PASSED"
   },
   "uki.UkiTest.test_uki_sysvinit": {
    "duration": 313.946,
    "oetags": [
     "runqemu"
    ],
    "status": "PASSED"
   },
   "usergrouptests.UserGroupTests.test_add_task_between_p_sysroot_and_package": {
    "duration": 26.694,
    "status": "PASSED"
   },
   "usergrouptests.UserGroupTests.test_group_from_dep_package": {
    "duration": 21.507,
    "status": "PASSED"
   },
   "usergrouptests.UserGroupTests.test_postinst_order": {
    "duration": 9.886,
    "status": "PASSED"
   },
   "usergrouptests.UserGroupTests.test_static_useradd_from_dynamic": {
    "duration": 94.015,
    "status": "PASSED"
   },
   "usergrouptests.UserGroupTests.test_useradd_depends_only": {
    "duration": 10.731,
    "status": "PASSED"
   },
   "wic.CLITests.test_createhelp": {
    "duration": 47.718,
    "status": "PASSED"
   },
   "wic.CLITests.test_help": {
    "duration": 3.135,
    "status": "PASSED"
   },
   "wic.CLITests.test_help_create": {
    "duration": 4.313,
    "status": "PASSED"
   },
   "wic.CLITests.test_help_kickstart": {
    "duration": 4.476,
    "status": "PASSED"
   },
   "wic.CLITests.test_help_list": {
    "duration": 4.512,
    "status": "PASSED"
   },
   "wic.CLITests.test_help_overview": {
    "duration": 4.382,
    "status": "PASSED"
   },
   "wic.CLITests.test_help_plugins": {
    "duration": 4.399,
    "status": "PASSED"
   },
   "wic.CLITests.test_list_images": {
    "duration": 7.448,
    "status": "PASSED"
   },
   "wic.CLITests.test_list_source_plugins": {
    "duration": 7.909,
    "status": "PASSED"
   },
   "wic.CLITests.test_listed_images_help": {
    "duration": 63.965,
    "status": "PASSED"
   },
   "wic.CLITests.test_listhelp": {
    "duration": 4.977,
    "status": "PASSED"
   },
   "wic.CLITests.test_no_command": {
    "duration": 3.686,
    "status": "PASSED"
   },
   "wic.CLITests.test_unsupported_subcommand": {
    "duration": 3.715,
    "status": "PASSED"
   },
   "wic.CLITests.test_version": {
    "duration": 3.709,
    "status": "PASSED"
   },
   "wic.ModifyTests.test_wic_cp": {
    "duration": 82.564,
    "status": "PASSED"
   },
   "wic.ModifyTests.test_wic_cp_ext": {
    "duration": 46.973,
    "status": "PASSED"
   },
   "wic.ModifyTests.test_wic_ls": {
    "duration": 27.339,
    "status": "PASSED"
   },
   "wic.ModifyTests.test_wic_ls_ext": {
    "duration": 25.578,
    "status": "PASSED"
   },
   "wic.ModifyTests.test_wic_rm": {
    "duration": 37.797,
    "status": "PASSED"
   },
   "wic.ModifyTests.test_wic_rm_ext": {
    "duration": 36.012,
    "status": "PASSED"
   },
   "wic.Wic.test_bootloader_config": {
    "duration": 204.858,
    "status": "PASSED"
   },
   "wic.Wic.test_build_artifacts": {
    "duration": 42.281,
    "status": "PASSED"
   },
   "wic.Wic.test_build_image_name": {
    "duration": 28.718,
    "status": "PASSED"
   },
   "wic.Wic.test_build_rootfs_long": {
    "duration": 76.63,
    "status": "PASSED"
   },
   "wic.Wic.test_build_rootfs_short": {
    "duration": 43.854,
    "status": "PASSED"
   },
   "wic.Wic.test_change_directory": {
    "duration": 25.844,
    "status": "PASSED"
   },
   "wic.Wic.test_change_directory_errors": {
    "duration": 48.007,
    "status": "PASSED"
   },
   "wic.Wic.test_compress_bzip2": {
    "duration": 30.713,
    "status": "PASSED"
   },
   "wic.Wic.test_compress_gzip": {
    "duration": 26.945,
    "status": "PASSED"
   },
   "wic.Wic.test_compress_xz": {
    "duration": 34.332,
    "status": "PASSED"
   },
   "wic.Wic.test_debug_long": {
    "duration": 26.07,
    "status": "PASSED"
   },
   "wic.Wic.test_debug_short": {
    "duration": 29.614,
    "status": "PASSED"
   },
   "wic.Wic.test_default_output_dir": {
    "duration": 77.584,
    "status": "PASSED"
   },
   "wic.Wic.test_efi_bootpart": {
    "duration": 72.06,
    "status": "PASSED"
   },
   "wic.Wic.test_exclude_path": {
    "duration": 36.743,
    "status": "PASSED"
   },
   "wic.Wic.test_exclude_path_errors": {
    "duration": 53.129,
    "status": "PASSED"
   },
   "wic.Wic.test_exclude_path_with_extra_space": {
    "duration": 115.749,
    "status": "PASSED"
   },
   "wic.Wic.test_extra_space": {
    "duration": 27.409,
    "status": "PASSED"
   },
   "wic.Wic.test_gpt_image": {
    "duration": 30.279,
    "status": "PASSED"
   },
   "wic.Wic.test_grub_install_pcbios": {
    "duration": 133.864,
    "status": "PASSED"
   },
   "wic.Wic.test_include_path": {
    "duration": 35.399,
    "status": "PASSED"
   },
   "wic.Wic.test_include_path_embeded": {
    "duration": 37.239,
    "status": "PASSED"
   },
   "wic.Wic.test_include_path_errors": {
    "duration": 91.865,
    "status": "PASSED"
   },
   "wic.Wic.test_iso_image": {
    "duration": 447.024,
    "status": "PASSED"
   },
   "wic.Wic.test_kernel_install": {
    "duration": 37.694,
    "status": "PASSED"
   },
   "wic.Wic.test_mkefidisk": {
    "duration": 28.222,
    "status": "PASSED"
   },
   "wic.Wic.test_no_fstab_update": {
    "duration": 41.326,
    "status": "PASSED"
   },
   "wic.Wic.test_no_fstab_update_errors": {
    "duration": 46.3,
    "status": "PASSED"
   },
   "wic.Wic.test_no_table": {
    "duration": 27.527,
    "status": "PASSED"
   },
   "wic.Wic.test_partition_hidden_attributes": {
    "duration": 33.359,
    "status": "PASSED"
   },
   "wic.Wic.test_permissions": {
    "duration": 308.605,
    "status": "PASSED"
   },
   "wic.Wic.test_qemux86_directdisk": {
    "duration": 27.55,
    "status": "PASSED"
   },
   "wic.Wic.test_rootfs_artifacts": {
    "duration": 73.335,
    "status": "PASSED"
   },
   "wic.Wic.test_rootfs_indirect_recipes": {
    "duration": 26.822,
    "status": "PASSED"
   },
   "wic.Wic.test_sdimage_bootpart": {
    "duration": 50.972,
    "status": "PASSED"
   },
   "wic.Wic.test_skip_build_check_long": {
    "duration": 26.673,
    "status": "PASSED"
   },
   "wic.Wic.test_skip_build_check_short": {
    "duration": 27.768,
    "status": "PASSED"
   },
   "wic.Wic.test_skip_kernel_install": {
    "duration": 41.242,
    "status": "PASSED"
   },
   "wic.Wic.test_systemd_bootdisk": {
    "duration": 94.177,
    "status": "PASSED"
   },
   "wic.Wic.test_wic_sector_size_cli": {
    "duration": 77.325,
    "status": "PASSED"
   },
   "wic.Wic.test_wic_sector_size_env": {
    "duration": 100.019,
    "status": "PASSED"
   },
   "wic.Wic.test_wrong_compressor": {
    "duration": 6.138,
    "status": "PASSED"
   },
   "wic.Wic2.test_biosplusefi_plugin": {
    "duration": 287.736,
    "status": "PASSED"
   },
   "wic.Wic2.test_biosplusefi_plugin_qemu": {
    "duration": 47.887,
    "oetags": [
     "runqemu"
    ],
    "status": "PASSED"
   },
   "wic.Wic2.test_bmap_long": {
    "duration": 31.746,
    "status": "PASSED"
   },
   "wic.Wic2.test_bmap_short": {
    "duration": 32.054,
    "status": "PASSED"
   },
   "wic.Wic2.test_diskid_on_gpt_partition": {
    "duration": 37.438,
    "status": "PASSED"
   },
   "wic.Wic2.test_diskid_on_msdos_partition": {
    "duration": 36.596,
    "status": "PASSED"
   },
   "wic.Wic2.test_efi_plugin_plain_systemd_boot_qemu_aarch64": {
    "duration": 0.002527,
    "log": "Test skipped on x86_64\n",
    "oetags": [
     "runqemu"
    ],
    "status": "SKIPPED"
   },
   "wic.Wic2.test_efi_plugin_plain_systemd_boot_qemu_x86": {
    "duration": 1743.695,
    "oetags": [
     "runqemu"
    ],
    "status": "PASSED"
   },
   "wic.Wic2.test_efi_plugin_unified_kernel_image_qemu": {
    "duration": 142.387,
    "oetags": [
     "runqemu"
    ],
    "status": "PASSED"
   },
   "wic.Wic2.test_empty_plugin": {
    "duration": 87.441,
    "status": "PASSED"
   },
   "wic.Wic2.test_empty_zeroize_plugin": {
    "duration": 40.78,
    "status": "PASSED"
   },
   "wic.Wic2.test_expand_mbr_image": {
    "duration": 85.007,
    "oetags": [
     "runqemu"
    ],
    "status": "PASSED"
   },
   "wic.Wic2.test_extra_filesystem_space": {
    "duration": 31.281,
    "status": "PASSED"
   },
   "wic.Wic2.test_extra_partition_plugin": {
    "duration": 71.037,
    "status": "PASSED"
   },
   "wic.Wic2.test_extra_partition_space": {
    "duration": 28.728,
    "status": "PASSED"
   },
   "wic.Wic2.test_fixed_size": {
    "duration": 32.716,
    "status": "PASSED"
   },
   "wic.Wic2.test_fixed_size_error": {
    "duration": 25.385,
    "status": "PASSED"
   },
   "wic.Wic2.test_fs_types": {
    "duration": 23.684,
    "status": "PASSED"
   },
   "wic.Wic2.test_gpt_partition_name": {
    "duration": 84.549,
    "status": "PASSED"
   },
   "wic.Wic2.test_image_bootpart_globbed": {
    "duration": 44.636,
    "status": "PASSED"
   },
   "wic.Wic2.test_image_env": {
    "duration": 38.851,
    "status": "PASSED"
   },
   "wic.Wic2.test_image_vars_dir_long": {
    "duration": 7.423,
    "status": "PASSED"
   },
   "wic.Wic2.test_image_vars_dir_short": {
    "duration": 8.053,
    "status": "PASSED"
   },
   "wic.Wic2.test_kickstart_parser": {
    "duration": 20.317,
    "status": "PASSED"
   },
   "wic.Wic2.test_mkfs_extraopts": {
    "duration": 22.451,
    "status": "PASSED"
   },
   "wic.Wic2.test_offset": {
    "duration": 125.657,
    "status": "PASSED"
   },
   "wic.Wic2.test_qemu": {
    "duration": 98.054,
    "oetags": [
     "runqemu"
    ],
    "status": "PASSED"
   },
   "wic.Wic2.test_qemu_efi": {
    "duration": 82.244,
    "oetags": [
     "runqemu"
    ],
    "status": "PASSED"
   },
   "wic.Wic2.test_rawcopy_plugin": {
    "duration": 74.548,
    "status": "PASSED"
   },
   "wic.Wic2.test_rawcopy_plugin_qemu": {
    "duration": 87.911,
    "oetags": [
     "runqemu"
    ],
    "status": "PASSED"
   },
   "wic.Wic2.test_rawcopy_plugin_unpack": {
    "duration": 73.085,
    "status": "PASSED"
   },
   "wic.Wic2.test_uefi_kernel": {
    "duration": 72.153,
    "status": "PASSED"
   },
   "wic.Wic2.test_wic_image_type": {
    "duration": 28.657,
    "status": "PASSED"
   },
   "wrapper.WrapperTests.test_shebang_wrapper": {
    "duration": 39.831,
    "status": "PASSED"
   },
   "yoctotestresultsquerytests.TestResultsQueryTests.test_create_workdir": {
    "duration": 3.11,
    "status": "PASSED"
   },
   "yoctotestresultsquerytests.TestResultsQueryTests.test_get_sha1": {
    "duration": 0.06006,
    "status": "PASSED"
   }
  }
 },
 "oeselftest_ubuntu-24.04_qemux86-64_20260926060610": {
  "configuration": {
   "HOST_DISTRO": "ubuntu-24.04",
   "HOST_NAME": "ubuntu2404-vk-3",
   "LAYERS": {
    "meta": {
     "branch": "master-next",
     "commit": "eb9d909c16b2ad65a9c41a848a7190b6dd26a430",
     "commit_count": 69039,
     "commit_time": 1790401706
    },
    "meta-poky": {
     "branch": "master",
     "commit": "d36c827e02ab138b446386792fd7588b5a041507",
     "commit_count": 1824,
     "commit_time": 1789659791
    },
    "meta-selftest": {
     "branch": "master-next",
     "commit": "eb9d909c16b2ad65a9c41a848a7190b6dd26a430",
     "commit_count": 69039,
     "commit_time": 1790401706
    },
    "meta-yocto-bsp": {
     "branch": "master",
     "commit": "d36c827e02ab138b446386792fd7588b5a041507",
     "commit_count": 1824,
     "commit_time": 1789659791
    }
   },
   "MACHINE": "qemux86-64",
   "OESELFTEST_METADATA": {
    "exclude_tags": [
     "yocto-mirrors",
     "machine",
     "toolchain-user",
     "toolchain-system"
    ],
    "run_all_tests": true,
    "run_tests": null,
    "select_tags": null,
    "skips": [
     "distrodata.Distrodata.test_checkpkg",
     "reproducible"
    ]
   },
   "STARTTIME": "20260926060610",
   "TESTSERIES": "oeqa",
   "TEST_TYPE": "oeselftest"
  },
  "result": {
   "archiver.Archiver.test_archiver_allows_to_filter_on_recipe_name": {
    "duration": 41.931,
    "status": "PASSED"
   },
   "archiver.Archiver.test_archiver_cleanup": {
    "duration": 76.102,
    "status": "PASSED"
   },
   "archiver.Archiver.test_archiver_filters_by_type": {
    "duration": 30.574,
    "status": "PASSED"
   },
   "archiver.Archiver.test_archiver_filters_by_type_and_name": {
    "duration": 33.982,
    "status": "PASSED"
   },
   "archiver.Archiver.test_archiver_mode_configured": {
    "duration": 32.067,
    "status": "PASSED"
   },
   "archiver.Archiver.test_archiver_mode_diff": {
    "duration": 32.617,
    "status": "PASSED"
   },
   "archiver.Archiver.test_archiver_mode_dumpdata": {
    "duration": 14.669,
    "status": "PASSED"
   },
   "archiver.Archiver.test_archiver_mode_mirror": {
    "duration": 38.77,
    "status": "PASSED"
   },
   "archiver.Archiver.test_archiver_mode_mirror_combined": {
    "duration": 51.298,
    "status": "PASSED"
   },
   "archiver.Archiver.test_archiver_mode_mirror_excludes": {
    "duration": 33.896,
    "status": "PASSED"
   },
   "archiver.Archiver.test_archiver_mode_mirror_gitsm": {
    "duration": 20.776,
    "status": "PASSED"
   },
   "archiver.Archiver.test_archiver_mode_mirror_gitsm_shallow": {
    "duration": 46.714,
    "status": "PASSED"
   },
   "archiver.Archiver.test_archiver_mode_original": {
    "duration": 36.491,
    "status": "PASSED"
   },
   "archiver.Archiver.test_archiver_mode_patched": {
    "duration": 12.682,
    "status": "PASSED"
   },
   "archiver.Archiver.test_archiver_mode_recipe": {
    "duration": 38.787,
    "status": "PASSED"
   },
   "archiver.Archiver.test_archiver_multiconfig_shared_unpack_and_patch": {
    "duration": 165.249,
    "status": "PASSED"
   },
   "barebox.BareboxTest.test_boot_barebox": {
    "duration": 0.002829,
    "log": "Test skipped on x86_64\n",
    "oetags": [
     "runqemu"
    ],
    "status": "SKIPPED"
   },
   "baremetal.BaremetalTest.test_baremetal": {
    "duration": 8017.364,
    "status": "PASSED"
   },
   "bbclasses.Systemd.test_systemd_in_distro": {
    "duration": 70.95,
    "status": "PASSED"
   },
   "bbclasses.Systemd.test_sysvinit_in_distro": {
    "duration": 41.981,
    "status": "PASSED"
   },
   "bblayers.BitbakeConfigBuild.test_enable_disable_builtin_fragments": {
    "duration": 20.58,
    "status": "PASSED"
   },
   "bblayers.BitbakeConfigBuild.test_enable_disable_fragments": {
    "duration": 17.157,
    "status": "PASSED"
   },
   "bblayers.BitbakeConfigBuild.test_show_fragment": {
    "duration": 2.939,
    "status": "PASSED"
   },
   "bblayers.BitbakeLayers.test_bitbakelayers_add_remove": {
    "duration": 9.418,
    "status": "PASSED"
   },
   "bblayers.BitbakeLayers.test_bitbakelayers_createlayer": {
    "duration": 8.069,
    "status": "PASSED"
   },
   "bblayers.BitbakeLayers.test_bitbakelayers_flatten": {
    "duration": 50.398,
    "status": "PASSED"
   },
   "bblayers.BitbakeLayers.test_bitbakelayers_layerindexshowdepends": {
    "duration": 1.374,
    "status": "PASSED"
   },
   "bblayers.BitbakeLayers.test_bitbakelayers_setup": {
    "duration": 32.066,
    "status": "PASSED"
   },
   "bblayers.BitbakeLayers.test_bitbakelayers_showappends": {
    "duration": 8.606,
    "status": "PASSED"
   },
   "bblayers.BitbakeLayers.test_bitbakelayers_showcrossdepends": {
    "duration": 23.93,
    "status": "PASSED"
   },
   "bblayers.BitbakeLayers.test_bitbakelayers_showlayers": {
    "duration": 0.5494,
    "status": "PASSED"
   },
   "bblayers.BitbakeLayers.test_bitbakelayers_showoverlayed": {
    "duration": 4.268,
    "status": "PASSED"
   },
   "bblayers.BitbakeLayers.test_bitbakelayers_showrecipes": {
    "duration": 25.346,
    "status": "PASSED"
   },
   "bblayers.BitbakeLayers.test_bitbakelayers_updatelayer": {
    "duration": 6.535,
    "status": "PASSED"
   },
   "bblayers.BitbakeLayers.test_validate_bitbake_setup_default_registry": {
    "duration": 3.04,
    "status": "PASSED"
   },
   "bblayers.BitbakeLayers.test_validate_examplelayersjson": {
    "duration": 0.3219,
    "status": "PASSED"
   },
   "bblock.BBLock.test_lock_architecture_specific": {
    "duration": 104.171,
    "status": "PASSED"
   },
   "bblock.BBLock.test_lock_multiple_recipe_single_task": {
    "duration": 1290.533,
    "status": "PASSED"
   },
   "bblock.BBLock.test_lock_single_recipe_all_tasks": {
    "duration": 833.763,
    "status": "PASSED"
   },
   "bblock.BBLock.test_lock_single_recipe_multiple_tasks": {
    "duration": 806.72,
    "status": "PASSED"
   },
   "bblock.BBLock.test_lock_single_recipe_single_task": {
    "duration": 821.779,
    "status": "PASSED"
   },
   "bblogging.BitBakeLogging.test_python_exec_func_python_loggingA": {
    "duration": 41.842,
    "status": "PASSED"
   },
   "bblogging.BitBakeLogging.test_python_exec_func_python_loggingB": {
    "duration": 30.891,
    "status": "PASSED"
   },
   "bblogging.BitBakeLogging.test_python_exec_func_python_loggingC": {
    "duration": 34.168,
    "status": "PASSED"
   },
   "bblogging.BitBakeLogging.test_python_exec_func_python_loggingD": {
    "duration": 13.119,
    "status": "PASSED"
   },
   "bblogging.BitBakeLogging.test_python_exec_func_shell_loggingA": {
    "duration": 13.27,
    "status": "PASSED"
   },
   "bblogging.BitBakeLogging.test_python_exec_func_shell_loggingB": {
    "duration": 14.819,
    "status": "PASSED"
   },
   "bblogging.BitBakeLogging.test_python_exec_func_shell_loggingC": {
    "duration": 13.962,
    "status": "PASSED"
   },
   "bblogging.BitBakeLogging.test_python_exec_func_shell_loggingD": {
    "duration": 13.548,
    "status": "PASSED"
   },
   "bblogging.BitBakeLogging.test_python_exit_loggingA": {
    "duration": 14.442,
    "status": "PASSED"
   },
   "bblogging.BitBakeLogging.test_python_exit_loggingB": {
    "duration": 14.192,
    "status": "PASSED"
   },
   "bblogging.BitBakeLogging.test_python_exit_loggingC": {
    "duration": 14.518,
    "status": "PASSED"
   },
   "bblogging.BitBakeLogging.test_python_exit_loggingD": {
    "duration": 15.197,
    "status": "PASSED"
   },
   "bblogging.BitBakeLogging.test_python_fatal_loggingA": {
    "duration": 13.213,
    "status": "PASSED"
   },
   "bblogging.BitBakeLogging.test_python_fatal_loggingB": {
    "duration": 13.649,
    "status": "PASSED"
   },
   "bblogging.BitBakeLogging.test_python_fatal_loggingC": {
    "duration": 18.793,
    "status": "PASSED"
   },
   "bblogging.BitBakeLogging.test_python_fatal_loggingD": {
    "duration": 19.121,
    "status": "PASSED"
   },
   "bblogging.BitBakeLogging.test_shell_loggingA": {
    "duration": 19.0,
    "status": "PASSED"
   },
   "bblogging.BitBakeLogging.test_shell_loggingB": {
    "duration": 15.517,
    "status": "PASSED"
   },
   "bblogging.BitBakeLogging.test_shell_loggingC": {
    "duration": 17.479,
    "status": "PASSED"
   },
   "bblogging.BitBakeLogging.test_shell_loggingD": {
    "duration": 15.453,
    "status": "PASSED"
   },
   "bbtests.BitbakeTests.test_bb_env_bb_getvar_equality": {
    "duration": 3.22,
    "status": "PASSED"
   },
   "bbtests.BitbakeTests.test_bbappend_order": {
    "duration": 34.786,
    "status": "PASSED"
   },
   "bbtests.BitbakeTests.test_bitbake_g": {
    "duration": 6.435,
    "status": "PASSED"
   },
   "bbtests.BitbakeTests.test_bitbake_invalid_recipe": {
    "duration": 1.881,
    "status": "PASSED"
   },
   "bbtests.BitbakeTests.test_bitbake_invalid_target": {
    "duration": 5.707,
    "status": "PASSED"
   },
   "bbtests.BitbakeTests.test_checkuri": {
    "duration": 18.925,
    "status": "PASSED"
   },
   "bbtests.BitbakeTests.test_continue": {
    "duration": 47.046,
    "status": "PASSED"
   },
   "bbtests.BitbakeTests.test_dry_run": {
    "duration": 8.775,
    "status": "PASSED"
   },
   "bbtests.BitbakeTests.test_environment": {
    "duration": 2.166,
    "status": "PASSED"
   },
   "bbtests.BitbakeTests.test_event_handler": {
    "duration": 30.153,
    "status": "PASSED"
   },
   "bbtests.BitbakeTests.test_force_task_1": {
    "duration": 91.127,
    "status": "PASSED"
   },
   "bbtests.BitbakeTests.test_force_task_2": {
    "duration": 67.049,
    "status": "PASSED"
   },
   "bbtests.BitbakeTests.test_git_patchtool": {
    "duration": 33.364,
    "status": "PASSED"
   },
   "bbtests.BitbakeTests.test_git_patchtool2": {
    "duration": 26.589,
    "status": "PASSED"
   },
   "bbtests.BitbakeTests.test_git_unpack_nonetwork": {
    "duration": 41.856,
    "status": "PASSED"
   },
   "bbtests.BitbakeTests.test_git_unpack_nonetwork_fail": {
    "duration": 15.325,
    "status": "PASSED"
   },
   "bbtests.BitbakeTests.test_image_manifest": {
    "duration": 7331.855,
    "status": "PASSED"
   },
   "bbtests.BitbakeTests.test_invalid_patch": {
    "duration": 40.463,
    "status": "PASSED"
   },
   "bbtests.BitbakeTests.test_invalid_recipe_src_uri": {
    "duration": 4.65,
    "status": "PASSED"
   },
   "bbtests.BitbakeTests.test_just_parse": {
    "duration": 4.626,
    "status": "PASSED"
   },
   "bbtests.BitbakeTests.test_local_sstate": {
    "duration": 20.804,
    "status": "PASSED"
   },
   "bbtests.BitbakeTests.test_non_gplv3": {
    "duration": 334.654,
    "status": "PASSED"
   },
   "bbtests.BitbakeTests.test_postfile": {
    "duration": 3.769,
    "status": "PASSED"
   },
   "bbtests.BitbakeTests.test_prefile": {
    "duration": 9.804,
    "status": "PASSED"
   },
   "bbtests.BitbakeTests.test_rename_downloaded_file": {
    "duration": 22.874,
    "status": "PASSED"
   },
   "bbtests.BitbakeTests.test_run_bitbake_from_dir_1": {
    "duration": 2.918,
    "status": "PASSED"
   },
   "bbtests.BitbakeTests.test_run_bitbake_from_dir_2": {
    "duration": 3.257,
    "status": "PASSED"
   },
   "bbtests.BitbakeTests.test_run_bitbake_from_dir_3": {
    "duration": 2.053,
    "status": "PASSED"
   },
   "bbtests.BitbakeTests.test_setscene_only": {
    "duration": 18.858,
    "status": "PASSED"
   },
   "bbtests.BitbakeTests.test_skip_setscene": {
    "duration": 44.476,
    "status": "PASSED"
   },
   "bbtests.BitbakeTests.test_unexpanded_variable_in_path": {
    "duration": 28.845,
    "status": "PASSED"
   },
   "bbtests.BitbakeTests.test_version": {
    "duration": 5.012,
    "status": "PASSED"
   },
   "bbtests.BitbakeTests.test_warnings_errors": {
    "duration": 0.936,
    "status": "PASSED"
   },
   "buildhistory.BuildhistoryTests.test_buildhistory_basic": {
    "duration": 71.238,
    "status": "PASSED"
   },
   "buildhistory.BuildhistoryTests.test_buildhistory_buildtime_pr_backwards": {
    "duration": 76.722,
    "status": "PASSED"
   },
   "buildhistory.BuildhistoryTests.test_buildhistory_diff": {
    "duration": 76.295,
    "status": "PASSED"
   },
   "buildhistory.BuildhistoryTests.test_fileinfo": {
    "duration": 21.576,
    "status": "PASSED"
   },
   "buildoptions.ArchiverTest.test_arch_work_dir_and_export_source": {
    "duration": 49.666,
    "status": "PASSED"
   },
   "buildoptions.DiskMonTest.test_stoptask_behavior": {
    "duration": 105.362,
    "status": "PASSED"
   },
   "buildoptions.ImageOptionsTests.test_ccache_tool": {
    "duration": 187.592,
    "status": "PASSED"
   },
   "buildoptions.ImageOptionsTests.test_incremental_image_generation": {
    "duration": 7465.004,
    "status": "PASSED"
   },
   "buildoptions.ImageOptionsTests.test_read_only_image": {
    "duration": 195.28,
    "status": "PASSED"
   },
   "buildoptions.Poisoning.test_poisoning": {
    "duration": 41.928,
    "status": "PASSED"
   },
   "buildoptions.SanityOptionsTest.test_layer_without_git_dir": {
    "duration": 40.196,
    "status": "PASSED"
   },
   "buildoptions.SanityOptionsTest.test_options_warnqa_errorqa_switch": {
    "duration": 94.808,
    "status": "PASSED"
   },
   "buildoptions.ToolchainOptions.test_toolchain_fortran": {
    "duration": 3065.113,
    "status": "PASSED"
   },
   "c_cpp.CMakeTests.test_cmake_qemu": {
    "duration": 68.068,
    "status": "PASSED"
   },
   "c_cpp.CMakeTests.test_cmake_qemu_failing": {
    "duration": 46.679,
    "status": "PASSED"
   },
   "c_cpp.MesonTests.test_meson_qemu": {
    "duration": 46.176,
    "status": "PASSED"
   },
   "c_cpp.MesonTests.test_meson_qemu_failing": {
    "duration": 36.231,
    "status": "PASSED"
   },
   "containerimage.ContainerImageTests.test_expected_files": {
    "duration": 5729.7,
    "status": "PASSED"
   },
   "cve_check.CVECheck.test_convert_cve_version": {
    "duration": 0.007804,
    "status": "PASSED"
   },
   "cve_check.CVECheck.test_parse_cve_from_patch_contents": {
    "duration": 0.006629,
    "status": "PASSED"
   },
   "cve_check.CVECheck.test_parse_cve_from_patch_filename": {
    "duration": 0.006166,
    "status": "PASSED"
   },
   "cve_check.CVECheck.test_product_match": {
    "duration": 0.005947,
    "status": "PASSED"
   },
   "cve_check.CVECheck.test_version_compare": {
    "duration": 0.007844,
    "status": "PASSED"
   },
   "debuginfod.Debuginfod.test_debuginfod_native": {
    "duration": 67.249,
    "status": "PASSED"
   },
   "debuginfod.Debuginfod.test_debuginfod_qemu": {
    "duration": 162.425,
    "oetags": [
     "runqemu"
    ],
    "status": "PASSED"
   },
   "devtool.DevtoolAddTests.test_devtool_add": {
    "duration": 103.08,
    "status": "PASSED"
   },
   "devtool.DevtoolAddTests.test_devtool_add_binary": {
    "duration": 74.987,
    "status": "PASSED"
   },
   "devtool.DevtoolAddTests.test_devtool_add_build_finish": {
    "duration": 122.525,
    "status": "PASSED"
   },
   "devtool.DevtoolAddTests.test_devtool_add_build_finish_force": {
    "duration": 119.696,
    "status": "PASSED"
   },
   "devtool.DevtoolAddTests.test_devtool_add_fetch": {
    "duration": 99.092,
    "status": "PASSED"
   },
   "devtool.DevtoolAddTests.test_devtool_add_fetch_git": {
    "duration": 85.961,
    "status": "PASSED"
   },
   "devtool.DevtoolAddTests.test_devtool_add_fetch_simple": {
    "duration": 40.08,
    "status": "PASSED"
   },
   "devtool.DevtoolAddTests.test_devtool_add_git_local": {
    "duration": 59.047,
    "status": "PASSED"
   },
   "devtool.DevtoolAddTests.test_devtool_add_git_style1": {
    "duration": 47.508,
    "status": "PASSED"
   },
   "devtool.DevtoolAddTests.test_devtool_add_git_style2": {
    "duration": 44.653,
    "status": "PASSED"
   },
   "devtool.DevtoolAddTests.test_devtool_add_library": {
    "duration": 69.211,
    "status": "PASSED"
   },
   "devtool.DevtoolAddTests.test_devtool_add_npm": {
    "duration": 1.874,
    "log": "Test needs meta-oe for nodejs\n",
    "status": "SKIPPED"
   },
   "devtool.DevtoolAddTests.test_devtool_add_python_egg_requires": {
    "duration": 37.466,
    "status": "PASSED"
   },
   "devtool.DevtoolBuildImageTests.test_devtool_build_image": {
    "duration": 7257.416,
    "status": "PASSED"
   },
   "devtool.DevtoolDeployTargetTests.test_devtool_deploy_target": {
    "duration": 426.523,
    "oetags": [
     "runqemu"
    ],
    "status": "PASSED"
   },
   "devtool.DevtoolDeployTargetTests.test_devtool_deploy_target_path": {
    "duration": 337.581,
    "oetags": [
     "runqemu"
    ],
    "status": "PASSED"
   },
   "devtool.DevtoolExtractTests.test_devtool_extract": {
    "duration": 65.855,
    "status": "PASSED"
   },
   "devtool.DevtoolExtractTests.test_devtool_extract_virtual": {
    "duration": 40.926,
    "status": "PASSED"
   },
   "devtool.DevtoolIdeSdkClangTests.test_code_and_none_qemu": {
    "duration": 8234.208,
    "oetags": [
     "runqemu"
    ],
    "status": "PASSED"
   },
   "devtool.DevtoolIdeSdkClangTests.test_sdk_code_nfs_debug_rootfs": {
    "duration": 304.951,
    "status": "PASSED"
   },
   "devtool.DevtoolIdeSdkClangTests.test_sdk_none_nfs_qemu": {
    "duration": 577.187,
    "oetags": [
     "runqemu"
    ],
    "status": "PASSED"
   },
   "devtool.DevtoolIdeSdkClangTests.test_sdk_none_nfs_qemu_slirp": {
    "duration": 495.855,
    "oetags": [
     "runqemu"
    ],
    "status": "PASSED"
   },
   "devtool.DevtoolIdeSdkClangTests.test_sdk_none_qemu_slirp": {
    "duration": 499.2,
    "oetags": [
     "runqemu"
    ],
    "status": "PASSED"
   },
   "devtool.DevtoolIdeSdkGccTests.test_code_and_none_nfs_qemu": {
    "duration": 7943.239,
    "oetags": [
     "runqemu"
    ],
    "status": "PASSED"
   },
   "devtool.DevtoolIdeSdkGccTests.test_code_and_none_nfs_qemu_slirp": {
    "duration": 468.554,
    "oetags": [
     "runqemu"
    ],
    "status": "PASSED"
   },
   "devtool.DevtoolIdeSdkGccTests.test_code_and_none_qemu": {
    "duration": 444.622,
    "oetags": [
     "runqemu"
    ],
    "status": "PASSED"
   },
   "devtool.DevtoolIdeSdkGccTests.test_code_and_none_qemu_slirp": {
    "duration": 430.432,
    "oetags": [
     "runqemu"
    ],
    "status": "PASSED"
   },
   "devtool.DevtoolIdeSdkGccTests.test_code_nfs_debug_rootfs": {
    "duration": 174.497,
    "status": "PASSED"
   },
   "devtool.DevtoolIdeSdkKernelTests.test_code_kernel_module": {
    "duration": 270.04,
    "oetags": [
     "runqemu"
    ],
    "status": "PASSED"
   },
   "devtool.DevtoolIdeSdkMiscTests.test_plugins": {
    "duration": 101.975,
    "status": "PASSED"
   },
   "devtool.DevtoolIdeSdkSharedTests.test_shared_sysroots": {
    "duration": 7548.018,
    "status": "PASSED"
   },
   "devtool.DevtoolModifyTests.test_devtool_buildclean": {
    "duration": 491.429,
    "status": "PASSED"
   },
   "devtool.DevtoolModifyTests.test_devtool_modify": {
    "duration": 203.149,
    "status": "PASSED"
   },
   "devtool.DevtoolModifyTests.test_devtool_modify_git": {
    "duration": 109.443,
    "status": "PASSED"
   },
   "devtool.DevtoolModifyTests.test_devtool_modify_git_crates_subpath": {
    "duration": 122.234,
    "status": "PASSED"
   },
   "devtool.DevtoolModifyTests.test_devtool_modify_git_no_extract": {
    "duration": 41.047,
    "status": "PASSED"
   },
   "devtool.DevtoolModifyTests.test_devtool_modify_go": {
    "duration": 63.49,
    "status": "PASSED"
   },
   "devtool.DevtoolModifyTests.test_devtool_modify_invalid": {
    "duration": 169.131,
    "status": "PASSED"
   },
   "devtool.DevtoolModifyTests.test_devtool_modify_kernel_cfg_subdirs": {
    "duration": 606.123,
    "status": "PASSED"
   },
   "devtool.DevtoolModifyTests.test_devtool_modify_localfiles": {
    "duration": 137.877,
    "status": "PASSED"
   },
   "devtool.DevtoolModifyTests.test_devtool_modify_localfiles_only": {
    "duration": 91.638,
    "status": "PASSED"
   },
   "devtool.DevtoolModifyTests.test_devtool_modify_multiple_sources": {
    "duration": 1701.456,
    "status": "PASSED"
   },
   "devtool.DevtoolModifyTests.test_devtool_modify_native": {
    "duration": 482.368,
    "status": "PASSED"
   },
   "devtool.DevtoolModifyTests.test_devtool_modify_nested_gitsm": {
    "duration": 47.919,
    "status": "PASSED"
   },
   "devtool.DevtoolModifyTests.test_devtool_modify_overrides": {
    "duration": 36.568,
    "status": "PASSED"
   },
   "devtool.DevtoolModifyTests.test_devtool_modify_virtual": {
    "duration": 39.861,
    "status": "PASSED"
   },
   "devtool.DevtoolResetTests.test_devtool_reset_all": {
    "duration": 261.531,
    "status": "PASSED"
   },
   "devtool.DevtoolResetTests.test_devtool_reset_re_plus_plus": {
    "duration": 41.934,
    "status": "PASSED"
   },
   "devtool.DevtoolTests.test_create_workspace": {
    "duration": 7.816,
    "status": "PASSED"
   },
   "devtool.DevtoolUpdateTests.test_devtool_finish_modify_git_subdir": {
    "duration": 128.946,
    "status": "PASSED"
   },
   "devtool.DevtoolUpdateTests.test_devtool_git_submodules": {
    "duration": 183.145,
    "status": "PASSED"
   },
   "devtool.DevtoolUpdateTests.test_devtool_update_recipe": {
    "duration": 65.413,
    "status": "PASSED"
   },
   "devtool.DevtoolUpdateTests.test_devtool_update_recipe_append": {
    "duration": 128.348,
    "status": "PASSED"
   },
   "devtool.DevtoolUpdateTests.test_devtool_update_recipe_append_git": {
    "duration": 117.547,
    "status": "PASSED"
   },
   "devtool.DevtoolUpdateTests.test_devtool_update_recipe_git": {
    "duration": 53.498,
    "status": "PASSED"
   },
   "devtool.DevtoolUpdateTests.test_devtool_update_recipe_gitsm": {
    "duration": 52.482,
    "status": "PASSED"
   },
   "devtool.DevtoolUpdateTests.test_devtool_update_recipe_local_files": {
    "duration": 125.618,
    "status": "PASSED"
   },
   "devtool.DevtoolUpdateTests.test_devtool_update_recipe_local_files_3": {
    "duration": 47.24,
    "status": "PASSED"
   },
   "devtool.DevtoolUpdateTests.test_devtool_update_recipe_local_files_subdir": {
    "duration": 44.239,
    "status": "PASSED"
   },
   "devtool.DevtoolUpdateTests.test_devtool_update_recipe_local_patch_gz": {
    "duration": 47.111,
    "status": "PASSED"
   },
   "devtool.DevtoolUpdateTests.test_devtool_update_recipe_long_filename": {
    "duration": 53.511,
    "status": "PASSED"
   },
   "devtool.DevtoolUpdateTests.test_devtool_update_recipe_with_gitignore": {
    "duration": 51.406,
    "status": "PASSED"
   },
   "devtool.DevtoolUpgradeTests.test_devtool_finish_modify_origlayer": {
    "duration": 107.977,
    "status": "PASSED"
   },
   "devtool.DevtoolUpgradeTests.test_devtool_finish_modify_otherlayer": {
    "duration": 62.857,
    "status": "PASSED"
   },
   "devtool.DevtoolUpgradeTests.test_devtool_finish_update_patch": {
    "duration": 76.086,
    "status": "PASSED"
   },
   "devtool.DevtoolUpgradeTests.test_devtool_finish_upgrade_origlayer": {
    "duration": 86.526,
    "status": "PASSED"
   },
   "devtool.DevtoolUpgradeTests.test_devtool_finish_upgrade_otherlayer": {
    "duration": 91.035,
    "status": "PASSED"
   },
   "devtool.DevtoolUpgradeTests.test_devtool_layer_plugins": {
    "duration": 5.345,
    "status": "PASSED"
   },
   "devtool.DevtoolUpgradeTests.test_devtool_load_plugin": {
    "duration": 15.452,
    "status": "PASSED"
   },
   "devtool.DevtoolUpgradeTests.test_devtool_rename": {
    "duration": 121.688,
    "status": "PASSED"
   },
   "devtool.DevtoolUpgradeTests.test_devtool_upgrade": {
    "duration": 88.989,
    "status": "PASSED"
   },
   "devtool.DevtoolUpgradeTests.test_devtool_upgrade_all_checksums": {
    "duration": 73.931,
    "status": "PASSED"
   },
   "devtool.DevtoolUpgradeTests.test_devtool_upgrade_drop_md5sum": {
    "duration": 74.271,
    "status": "PASSED"
   },
   "devtool.DevtoolUpgradeTests.test_devtool_upgrade_git": {
    "duration": 48.959,
    "status": "PASSED"
   },
   "devtool.DevtoolUpgradeTests.test_devtool_upgrade_gitsm": {
    "duration": 60.887,
    "status": "PASSED"
   },
   "devtool.DevtoolUpgradeTests.test_devtool_upgrade_recipe_upgrade_extra_tasks": {
    "duration": 85.317,
    "status": "PASSED"
   },
   "devtool.DevtoolUpgradeTests.test_devtool_virtual_kernel_modify": {
    "duration": 5837.738,
    "status": "PASSED"
   },
   "distrodata.Distrodata.test_checkpkg": {
    "duration": 0.000663,
    "log": "Skip by the command line argument \"distrodata.Distrodata.test_checkpkg\"\n",
    "status": "SKIPPED"
   },
   "distrodata.Distrodata.test_common_include_recipes": {
    "duration": 66.347,
    "status": "PASSED"
   },
   "distrodata.Distrodata.test_maintainers": {
    "duration": 98.385,
    "status": "PASSED"
   },
   "efibootpartition.GenericEFITest.test_boot_efi": {
    "duration": 850.817,
    "status": "PASSED"
   },
   "esdk.oeSDKExtSelfTest.test_image_generation_binary_feeds": {
    "duration": 94.541,
    "status": "PASSED"
   },
   "esdk.oeSDKExtSelfTest.test_install_libraries_headers": {
    "duration": 36.023,
    "status": "PASSED"
   },
   "esdk.oeSDKExtSelfTest.test_sdk_install_assembles_the_shared_sysroot": {
    "duration": 88.47,
    "status": "PASSED"
   },
   "externalsrc.ExternalSrc.test_externalsrc_srctree_hash_files": {
    "duration": 33.971,
    "status": "PASSED"
   },
   "fetch.Dependencies.test_dependencies": {
    "duration": 26.457,
    "status": "PASSED"
   },
   "fetch.Fetch.test_git_mirrors": {
    "duration": 86.049,
    "status": "PASSED"
   },
   "fitimage.FitImagePyTests.test_fitimage_py_conf_extra_mappings_unused_error": {
    "duration": 0.02166,
    "status": "PASSED"
   },
   "fitimage.FitImagePyTests.test_fitimage_py_conf_loadables": {
    "duration": 0.006153,
    "status": "PASSED"
   },
   "fitimage.FitImagePyTests.test_fitimage_py_conf_mappings": {
    "duration": 0.005918,
    "status": "PASSED"
   },
   "fitimage.FitImagePyTests.test_fitimage_py_conf_mappings_unused_error": {
    "duration": 0.005268,
    "status": "PASSED"
   },
   "fitimage.FitImagePyTests.test_fitimage_py_conf_mappings_with_alias": {
    "duration": 0.005644,
    "status": "PASSED"
   },
   "fitimage.FitImagePyTests.test_fitimage_py_conf_os": {
    "duration": 0.00552,
    "status": "PASSED"
   },
   "fitimage.FitImagePyTests.test_fitimage_py_default": {
    "duration": 0.005682,
    "status": "PASSED"
   },
   "fitimage.FitImagePyTests.test_fitimage_py_default_dtb": {
    "duration": 0.005777,
    "status": "PASSED"
   },
   "fitimage.KernelFitImageRecipeTests.test_fit_image": {
    "duration": 167.797,
    "status": "PASSED"
   },
   "fitimage.KernelFitImageRecipeTests.test_fit_image_ext_dtb_dtbo": {
    "duration": 194.636,
    "status": "PASSED"
   },
   "fitimage.KernelFitImageRecipeTests.test_fit_image_sign_initramfs": {
    "duration": 212.358,
    "status": "PASSED"
   },
   "fitimage.KernelFitImageRecipeTests.test_fit_image_sign_initramfs_bundle": {
    "duration": 284.985,
    "status": "PASSED"
   },
   "fitimage.KernelFitImageRecipeTests.test_get_compatible_from_dtb": {
    "duration": 66.412,
    "status": "PASSED"
   },
   "fitimage.KernelFitImageRecipeTests.test_sign_fit_image_configurations": {
    "duration": 62.137,
    "status": "PASSED"
   },
   "fitimage.KernelFitImageRecipeTests.test_sign_fit_image_individual": {
    "duration": 58.146,
    "status": "PASSED"
   },
   "fitimage.KernelFitImageRecipeTests.test_vendored_dtb_with_kernel_dtbvendored": {
    "duration": 217.41,
    "status": "PASSED"
   },
   "fitimage.KernelFitImageRecipeTests.test_vendored_dtb_without_kernel_dtbvendored": {
    "duration": 49.089,
    "status": "PASSED"
   },
   "fitimage.UBootFitImageTests.test_sign_cascaded_uboot_fit_image": {
    "duration": 0.8651,
    "log": "MACHINE=qemux86-64 does not provide capability _cap_spl_dtb\n",
    "status": "SKIPPED"
   },
   "fitimage.UBootFitImageTests.test_sign_standalone_uboot_atf_tee_fit_image": {
    "duration": 0.7825,
    "log": "MACHINE=qemux86-64 does not provide capability _cap_spl_dtb\n",
    "status": "SKIPPED"
   },
   "fitimage.UBootFitImageTests.test_sign_standalone_uboot_fit_image": {
    "duration": 1.016,
    "log": "MACHINE=qemux86-64 does not provide capability _cap_spl_dtb\n",
    "status": "SKIPPED"
   },
   "fitimage.UBootFitImageTests.test_sign_uboot_fit_image_without_spl": {
    "duration": 317.99,
    "status": "PASSED"
   },
   "fitimage.UBootFitImageTests.test_sign_uboot_kernel_individual": {
    "duration": 104.017,
    "status": "PASSED"
   },
   "fitimage.UBootFitImageTests.test_uboot_atf_tee_fit_image": {
    "duration": 0.971,
    "log": "MACHINE=qemux86-64 does not provide capability _cap_atf_tee\n",
    "status": "SKIPPED"
   },
   "fitimage.UBootFitImageTests.test_uboot_fit_image": {
    "duration": 56.944,
    "status": "PASSED"
   },
   "gdbserver.GdbServerTest.test_gdb_server": {
    "duration": 152.226,
    "status": "PASSED"
   },
   "gitarchivetests.GitArchiveTests.test_create_first_test_tag": {
    "duration": 1.231,
    "status": "PASSED"
   },
   "gitarchivetests.GitArchiveTests.test_create_second_test_tag": {
    "duration": 1.531,
    "status": "PASSED"
   },
   "gitarchivetests.GitArchiveTests.test_get_revs_on_branch": {
    "duration": 0.6499,
    "status": "PASSED"
   },
   "gitarchivetests.GitArchiveTests.test_get_tags_with_only_local_tag": {
    "duration": 0.6364,
    "status": "PASSED"
   },
   "gitarchivetests.GitArchiveTests.test_get_tags_without_valid_remote": {
    "duration": 0.4317,
    "status": "PASSED"
   },
   "gitarchivetests.GitArchiveTests.test_get_tags_without_valid_remote_and_wrong_url": {
    "duration": 0.4267,
    "status": "PASSED"
   },
   "gotoolchain.oeGoToolchainSelfTest.test_go_dep_build": {
    "duration": 3.775,
    "status": "PASSED"
   },
   "govendor.GoVendorSrcUriTests.test_basic": {
    "duration": 0.004693,
    "status": "PASSED"
   },
   "govendor.GoVendorSrcUriTests.test_non_git_vcs": {
    "duration": 0.009284,
    "status": "PASSED"
   },
   "govendor.GoVendorSrcUriTests.test_path_override": {
    "duration": 0.009845,
    "status": "PASSED"
   },
   "govendor.GoVendorSrcUriTests.test_pathmajor": {
    "duration": 0.009901,
    "status": "PASSED"
   },
   "govendor.GoVendorSrcUriTests.test_replaces": {
    "duration": 0.009623,
    "status": "PASSED"
   },
   "govendor.GoVendorSrcUriTests.test_subdir": {
    "duration": 0.007853,
    "status": "PASSED"
   },
   "govendor.GoVendorTaskTests.test_do_compile_succeeds": {
    "duration": 19.863,
    "status": "PASSED"
   },
   "govendor.GoVendorTaskTests.test_external_dep_copied_to_vendor": {
    "duration": 0.005949,
    "status": "PASSED"
   },
   "govendor.GoVendorTaskTests.test_go_import_vendor_symlink": {
    "duration": 0.006491,
    "status": "PASSED"
   },
   "govendor.GoVendorTaskTests.test_local_replacement_symlink": {
    "duration": 0.006399,
    "status": "PASSED"
   },
   "govendor.GoVendorTaskTests.test_modules_txt_in_vendor": {
    "duration": 0.005902,
    "status": "PASSED"
   },
   "govendor.GoVendorTaskTests.test_pathmajor_falls_back_to_root": {
    "duration": 0.005909,
    "status": "PASSED"
   },
   "govendor.GoVendorTaskTests.test_test_files_excluded_from_vendor": {
    "duration": 0.005287,
    "status": "PASSED"
   },
   "image_typedep.ImageTypeDepTests.test_conversion_typedep_added": {
    "duration": 28.239,
    "status": "PASSED"
   },
   "imagefeatures.ImageFeatures.test_all_users_can_connect_via_ssh_without_password": {
    "duration": 281.496,
    "oetags": [
     "runqemu"
    ],
    "status": "PASSED"
   },
   "imagefeatures.ImageFeatures.test_bmap": {
    "duration": 84.775,
    "status": "PASSED"
   },
   "imagefeatures.ImageFeatures.test_empty_image": {
    "duration": 32.907,
    "status": "PASSED"
   },
   "imagefeatures.ImageFeatures.test_hypervisor_fmts": {
    "duration": 91.628,
    "status": "PASSED"
   },
   "imagefeatures.ImageFeatures.test_image_fstypes": {
    "duration": 412.128,
    "status": "PASSED"
   },
   "imagefeatures.ImageFeatures.test_image_gen_debugfs": {
    "duration": 130.443,
    "status": "PASSED"
   },
   "imagefeatures.ImageFeatures.test_long_chain_conversion": {
    "duration": 84.729,
    "status": "PASSED"
   },
   "imagefeatures.ImageFeatures.test_mandb": {
    "duration": 3171.193,
    "status": "PASSED"
   },
   "imagefeatures.ImageFeatures.test_no_busybox_base_utils": {
    "duration": 29.787,
    "status": "PASSED"
   },
   "imagefeatures.ImageFeatures.test_non_root_user_can_connect_via_ssh_without_password": {
    "duration": 90.416,
    "oetags": [
     "runqemu"
    ],
    "status": "PASSED"
   },
   "imagefeatures.ImageFeatures.test_useradd_static": {
    "duration": 277.059,
    "status": "PASSED"
   },
   "imagefeatures.ImageFeatures.test_wayland_support_in_image": {
    "duration": 127.681,
    "status": "PASSED"
   },
   "incompatible_lic.IncompatibleLicensePerImageTests.test_bash_and_license": {
    "duration": 60.35,
    "status": "PASSED"
   },
   "incompatible_lic.IncompatibleLicensePerImageTests.test_bash_default": {
    "duration": 62.594,
    "status": "PASSED"
   },
   "incompatible_lic.IncompatibleLicensePerImageTests.test_bash_license_exceptions": {
    "duration": 72.214,
    "status": "PASSED"
   },
   "incompatible_lic.IncompatibleLicensePerImageTests.test_bash_or_license": {
    "duration": 61.014,
    "status": "PASSED"
   },
   "incompatible_lic.IncompatibleLicensePerImageTests.test_spdx_exception": {
    "duration": 141.658,
    "status": "PASSED"
   },
   "incompatible_lic.IncompatibleLicenseTestObsolete.test_incompatible_alias_spdx_license": {
    "duration": 6.984,
    "status": "PASSED"
   },
   "incompatible_lic.IncompatibleLicenseTestObsolete.test_incompatible_alias_spdx_license_alias": {
    "duration": 6.43,
    "status": "PASSED"
   },
   "incompatible_lic.IncompatibleLicenseTestObsolete.test_incompatible_alias_spdx_license_alias_wildcard": {
    "duration": 6.427,
    "status": "PASSED"
   },
   "incompatible_lic.IncompatibleLicenseTestObsolete.test_incompatible_alias_spdx_license_wildcard": {
    "duration": 7.544,
    "status": "PASSED"
   },
   "incompatible_lic.IncompatibleLicenseTestObsolete.test_incompatible_all_licenses_wildcard": {
    "duration": 7.068,
    "status": "PASSED"
   },
   "incompatible_lic.IncompatibleLicenseTestObsolete.test_incompatible_spdx_license_alias_wildcard": {
    "duration": 7.117,
    "status": "PASSED"
   },
   "incompatible_lic.IncompatibleLicenseTestObsolete.test_incompatible_spdx_licenses_wildcard": {
    "duration": 6.651,
    "status": "PASSED"
   },
   "incompatible_lic.IncompatibleLicenseTests.test_incompatible_nonspdx_license": {
    "duration": 24.892,
    "status": "PASSED"
   },
   "incompatible_lic.IncompatibleLicenseTests.test_incompatible_spdx_license": {
    "duration": 25.992,
    "status": "PASSED"
   },
   "incompatible_lic.IncompatibleLicenseTests.test_incompatible_spdx_license_alias": {
    "duration": 4.55,
    "status": "PASSED"
   },
   "incompatible_lic.IncompatibleLicenseTests.test_incompatible_spdx_license_wildcard": {
    "duration": 26.922,
    "status": "PASSED"
   },
   "incompatible_lic.IncompatibleLicenseTests.test_incompatible_spdx_licenses": {
    "duration": 24.171,
    "status": "PASSED"
   },
   "incompatible_lic.NoGPL3InImagesTests.test_core_image_full_cmdline_weston": {
    "duration": 7420.625,
    "log": "testtools.testresult.real._StringException: Traceback (most recent call last):\n  File \"/srv/pokybuild/yocto-worker/oe-selftest-debian/build/layers/openembedded-core/meta/lib/oeqa/core/decorator/__init__.py\", line 35, in wrapped_f\n    return func(*args, **kwargs)\n           ^^^^^^^^^^^^^^^^^^^^^\n  File \"/srv/pokybuild/yocto-worker/oe-selftest-debian/build/layers/openembedded-core/meta/lib/oeqa/selftest/cases/incompatible_lic.py\", line 181, in test_core_image_full_cmdline_weston\n    bitbake('-c testimage core-image-full-cmdline core-image-weston')\n  File \"/srv/pokybuild/yocto-worker/oe-selftest-debian/build/layers/openembedded-core/meta/lib/oeqa/utils/commands.py\", line 236, in bitbake\n    return runCmd(cmd, ignore_status, timeout, output_log=output_log, **options)\n           ^^^^^^^^^^^^^^^^^^^^^^^^^^^^^^^^^^^^^^^^^^^^^^^^^^^^^^^^^^^^^^^^^^^^^\n  File \"/srv/pokybuild/yocto-worker/oe-selftest-debian/build/layers/openembedded-core/meta/lib/oeqa/utils/commands.py\", line 214, in runCmd\n    raise AssertionError(\"Command '%s' returned non-zero exit status %d:\\n%s\" % (command, result.status, exc_output))\nAssertionError: Command 'bitbake  -c testimage core-image-full-cmdline core-image-weston' returned non-zero exit status 1:\nNOTE: Reconnecting to bitbake server...\nLoading cache...done.\nLoaded 2099 entries from dependency cache.\nNOTE: Resolving any missing task queue dependencies\n\nBuild Configuration:\nBB_VERSION           = \"2.19.1\"\nBUILD_SYS            = \"x86_64-linux\"\nNATIVELSBSTRING      = \"universal\"\nTARGET_SYS           = \"x86_64-poky-linux\"\nMACHINE              = \"qemux86-64\"\nSDKMACHINE           = \"x86_64\"\nDISTRO               = \"poky\"\nDISTRO_VERSION       = \"6.0.99+snapshot-eb9d909c16b2ad65a9c41a848a7190b6dd26a430\"\nTUNE_FEATURES        = \"m64 x86-64-v3\"\nmeta                 = \"master-next:eb9d909c16b2ad65a9c41a848a7190b6dd26a430\"\nmeta-yocto-bsp       \nmeta-poky            = \"master:d36c827e02ab138b446386792fd7588b5a041507\"\nmeta-selftest        = \"master:30d30b0bdf7862f297d4365f7a27bed806b47f7e\"\n\nInitialising tasks...Sstate summary: Wanted 145 Local 145 Mirrors 0 Missed 0 Current 306 (100% match, 100% complete)\ndone.\nNOTE: Executing Tasks\nNOTE: Setscene tasks completed\nNOTE: Running task 1547 of 1548 (/srv/pokybuild/yocto-worker/oe-selftest-debian/build/layers/openembedded-core/meta/recipes-graphics/images/core-image-weston.bb:do_testimage)\nNOTE: Running task 1548 of 1548 (/srv/pokybuild/yocto-worker/oe-selftest-debian/build/layers/openembedded-core/meta/recipes-extended/images/core-image-full-cmdline.bb:do_testimage)\nNOTE: recipe core-image-weston-1.0-r0: task do_testimage: Started\nNOTE: recipe core-image-full-cmdline-1.0-r0: task do_testimage: Started\nQMP Available for connection at /srv/pokybuild/yocto-worker/oe-selftest-debian/build/build-st-3916371/tmp/.vtcp_bvu\nQMP Available for connection at /srv/pokybuild/yocto-worker/oe-selftest-debian/build/build-st-3916371/tmp/.sf8_4kxv\nQMP connected to QEMU at 09/26/26 08:15:31 and took 0.65 seconds\nQMP released QEMU at 09/26/26 08:15:31 and took 0.10 seconds from connect\nQMP connected to QEMU at 09/26/26 08:15:32 and took 1.59 seconds\nQMP released QEMU at 09/26/26 08:15:32 and took 0.08 seconds from connect\nTest requires apt to be installed\nTest requires apt to be installed\nTest requires autoconf to be installed\nTest requires gtk+3 to be installed\nTest requires autoconf to be installed\nTest requires connman to be installed\nTest case connman.ConnmanTest.test_connmand_running depends on connman.ConnmanTest.test_connmand_help but it didn't pass/run.\nTest requires autoconf to be installed\nTest requires gtk+3 to be installed\nTest requires autoconf to be installed\nTest requires connman to be installed\nTest case connman.ConnmanTest.test_connmand_running depends on connman.ConnmanTest.test_connmand_help but it didn't pass/run.\nTest requires dnf to be installed\nTest case dnf.DnfBasicTest.test_dnf_history depends on dnf.DnfBasicTest.test_dnf_help but it didn't pass/run.\nTest case dnf.DnfBasicTest.test_dnf_info depends on dnf.DnfBasicTest.test_dnf_help but it didn't pass/run.\nTest case dnf.DnfBasicTest.test_dnf_search depends on dnf.DnfBasicTest.test_dnf_help but it didn't pass/run.\nTest case dnf.DnfBasicTest.test_dnf_version depends on dnf.DnfBasicTest.test_dnf_help but it didn't pass/run.\nTest case dnf.DnfRepoTest.test_dnf_makecache depends on dnf.DnfBasicTest.test_dnf_help but it didn't pass/run.\nTest case dnf.DnfRepoTest.test_dnf_exclude depends on dnf.DnfRepoTest.test_dnf_makecache but it didn't pass/run.\nTest case dnf.DnfRepoTest.test_dnf_install depends on dnf.DnfRepoTest.test_dnf_makecache but it didn't pass/run.\nTest case dnf.DnfRepoTest.test_dnf_install_dependency depends on dnf.DnfRepoTest.test_dnf_install but it didn't pass/run.\nTest case dnf.DnfRepoTest.test_dnf_install_from_disk depends on dnf.DnfRepoTest.test_dnf_install_dependency but it didn't pass/run.\nTest case dnf.DnfRepoTest.test_dnf_install_from_http depends on dnf.DnfRepoTest.test_dnf_install_from_disk but it didn't pass/run.\nTest case dnf.DnfRepoTest.test_dnf_installroot depends on dnf.DnfRepoTest.test_dnf_makecache but it didn't pass/run.\nTest run when enable usrmerge\nTest case dnf.DnfRepoTest.test_dnf_reinstall depends on dnf.DnfRepoTest.test_dnf_install but it didn't pass/run.\nTest case dnf.DnfRepoTest.test_dnf_repoinfo depends on dnf.DnfRepoTest.test_dnf_makecache but it didn't pass/run.\nTest requires gcc to be installed\nTest requires g++ to be installed\nTest requires g++ to be installed\nTest requires make to be installed\nTest requires python3-pygobject to be installed\nTest requires cgo-helloworld to be installed\nTest requires go-runtime-dev to be installed\nTest requires go-runtime-dev to be installed\nTest requires go-helloworld to be installed\nTest requires gcc to be installed\nTest requires ldd to be installed\nTest requires dnf to be installed\nTest case dnf.DnfBasicTest.test_dnf_history depends on dnf.DnfBasicTest.test_dnf_help but it didn't pass/run.\nTest case dnf.DnfBasicTest.test_dnf_info depends on dnf.DnfBasicTest.test_dnf_help but it didn't pass/run.\nTest case dnf.DnfBasicTest.test_dnf_search depends on dnf.DnfBasicTest.test_dnf_help but it didn't pass/run.\nTest case dnf.DnfBasicTest.test_dnf_version depends on dnf.DnfBasicTest.test_dnf_help but it didn't pass/run.\nTest case dnf.DnfRepoTest.test_dnf_makecache depends on dnf.DnfBasicTest.test_dnf_help but it didn't pass/run.\nTest case dnf.DnfRepoTest.test_dnf_exclude depends on dnf.DnfRepoTest.test_dnf_makecache but it didn't pass/run.\nTest case dnf.DnfRepoTest.test_dnf_install depends on dnf.DnfRepoTest.test_dnf_makecache but it didn't pass/run.\nTest case dnf.DnfRepoTest.test_dnf_install_dependency depends on dnf.DnfRepoTest.test_dnf_install but it didn't pass/run.\nTest case dnf.DnfRepoTest.test_dnf_install_from_disk depends on dnf.DnfRepoTest.test_dnf_install_dependency but it didn't pass/run.\nTest case dnf.DnfRepoTest.test_dnf_install_from_http depends on dnf.DnfRepoTest.test_dnf_install_from_disk but it didn't pass/run.\nTest case dnf.DnfRepoTest.test_dnf_installroot depends on dnf.DnfRepoTest.test_dnf_makecache but it didn't pass/run.\nTest run when enable usrmerge\nTest case dnf.DnfRepoTest.test_dnf_reinstall depends on dnf.DnfRepoTest.test_dnf_install but it didn't pass/run.\nTest case dnf.DnfRepoTest.test_dnf_repoinfo depends on dnf.DnfRepoTest.test_dnf_makecache but it didn't pass/run.\nTest requires gcc to be installed\nTest requires g++ to be installed\nTest requires g++ to be installed\nTest requires make to be installed\nTest requires python3-pygobject to be installed\nTest requires cgo-helloworld to be installed\nTest requires go-runtime-dev to be installed\nTest requires go-runtime-dev to be installed\nTest requires go-helloworld to be installed\nTest requires gcc to be installed\nTest requires ldd to be installed\nTest requires logrotate to be installed\nTest case logrotate.LogrotateTest.test_logrotate_newlog depends on logrotate.LogrotateTest.test_logrotate_wtmp but it didn't pass/run.\nNo syslog found to restart, ignoring\nTest requires busybox-syslog to be installed\nTest requires opkg to be installed\nTest requires pam to be in DISTRO_FEATURES\nTest requires perl to be installed\nTest requires ptest-runner to be installed\nTest requires ptest-runner to be installed\nTest requires python3-core to be installed\nNo /var/lib/rpm on target\nTest case rpm.RpmBasicTest.test_rpm_query_nonroot depends on rpm.RpmBasicTest.test_rpm_query but it didn't pass/run.\nTest case rpm.RpmInstallRemoveTest.test_rpm_install depends on rpm.RpmBasicTest.test_rpm_query but it didn't pass/run.\nTest case rpm.RpmInstallRemoveTest.test_rpm_remove depends on rpm.RpmInstallRemoveTest.test_rpm_install but it didn't pass/run.\nTest case rpm.RpmInstallRemoveTest.test_check_rpm_install_removal_log_file_size depends on rpm.RpmInstallRemoveTest.test_rpm_remove but it didn't pass/run.\nTest requires rust-c-lib-example-bin to be installed\nTest requires cargo to be installed\nTest requires rust to be installed\nTest requires kernel-devsrc to be installed\nsystemd is not the init manager for this image\nTest case systemd.SystemdBasicTests.test_systemd_failed depends on systemd.SystemdBasicTests.test_systemd_basic but it didn't pass/run.\nTest case systemd.SystemdBasicTests.test_systemd_list depends on systemd.SystemdBasicTests.test_systemd_basic but it didn't pass/run.\nTest case systemd.SystemdJournalTests.test_systemd_boot_time depends on systemd.SystemdBasicTests.test_systemd_basic but it didn't pass/run.\nTest case systemd.SystemdJournalTests.test_systemd_journal depends on systemd.SystemdBasicTests.test_systemd_basic but it didn't pass/run.\nTest requires minidebuginfo to be in DISTRO_FEATURES\nTest case systemd.SystemdServiceTests.test_systemd_status depends on systemd.SystemdBasicTests.test_systemd_basic but it didn't pass/run.\nTest case systemd.SystemdServiceTests.test_systemd_disable_enable depends on systemd.SystemdServiceTests.test_systemd_status but it didn't pass/run.\nTest is only meant to run with read-only-rootfs in IMAGE_FEATURES\nTest case systemd.SystemdServiceTests.test_systemd_stop_start depends on systemd.SystemdServiceTests.test_systemd_status but it didn't pass/run.\nTest requires wayland-utils to be installed\nTest requires weston to be installed\nTest requires weston to be installed\nTest requires weston to be installed\nTest requires xserver-nodm-init to be installed\nTest requires opkg to be installed\nTest requires pam to be in DISTRO_FEATURES\nTraceback (most recent call last):\n  File \"/srv/pokybuild/yocto-worker/oe-selftest-debian/build/layers/openembedded-core/meta/lib/oeqa/core/decorator/__init__.py\", line 35, in wrapped_f\n    return func(*args, **kwargs)\n           ^^^^^^^^^^^^^^^^^^^^^\n  File \"/srv/pokybuild/yocto-worker/oe-selftest-debian/build/layers/openembedded-core/meta/lib/oeqa/runtime/cases/parselogs.py\", line 185, in test_parselogs\n    self.assertEqual(errcount, 0, msg=self.msg)\nAssertionError: 1 != 0 : Log: /srv/pokybuild/yocto-worker/oe-selftest-debian/build/build-st-3916371/tmp/work/qemux86_64-poky-linux/core-image-weston/1.0/target_logs/dmesg_output.log\n-----------------------\nCentral error: [    8.113613] ------------[ cut here ]------------\n***********************\n[    2.340270]     TERM=linux\n[    2.399562] usb 2-2: new high-speed USB device number 3 using ehci-pci\n[    2.489458] udevd[158]: starting version 3.2.14\n[    2.496184] udevd[159]: starting eudev-3.2.14\n[    2.757429] input: QEMU QEMU USB Keyboard as /devices/pci0000:00/0000:00:1d.7/usb2/2-2/2-2:1.0/0003:0627:0001.0002/input/input2\n[    2.813953] hid-generic 0003:0627:0001.0002: input: USB HID v1.11 Keyboard [QEMU QEMU USB Keyboard] on usb-0000:00:1d.7-2/input0\n[    2.890159] EXT4-fs (vda): re-mounted e7a7f330-16e2-4e3e-a9b4-e69f1d05186e.\n[    3.560458] Bluetooth: BNEP (Ethernet Emulation) ver 1.3\n[    3.560463] Bluetooth: BNEP filters: protocol multicast\n[    3.560469] Bluetooth: BNEP socket layer initialized\n[    8.113613] ------------[ cut here ]------------\n[    8.115549] [CRTC:37:crtc-0] vblank wait timed out\n[    8.118088] WARNING: /usr/src/kernel/drivers/gpu/drm/drm_atomic_helper.c:1921 at drm_atomic_helper_wait_for_vblanks.part.0+0x215/0x240, CPU#0: kworker/0:1/10\n[    8.125013] Modules linked in: bnep\n[    8.126356] CPU: 0 UID: 0 PID: 10 Comm: kworker/0:1 Not tainted 7.2.6-yocto-standard #1 PREEMPT(full) \n[    8.130663] Hardware name: QEMU Standard PC (Q35 + ICH9, 2009), BIOS rel-1.17.0-0-gb52ca86e094d-prebuilt.qemu.org 04/01/2014\n[    8.134855] Workqueue: events drm_fb_helper_damage_work\n[    8.136693] RIP: 0010:drm_atomic_helper_wait_for_vblanks.part.0+0x21d/0x240\n[    8.139663] Code: ff 84 c0 74 88 48 8b 7d 98 48 8d 75 a8 e8 5b 18 5a ff 45 85 ed 0f 85 f0 fe ff ff 48 8d 3d cb 7a 2b 01 49 8b 57 20 41 8b 77 58 <67> 48 0f b9 3a e9 d7 fe ff ff 48 89 5d d8 4c 89 65 e0 4c 89 6d e8\n[    8.145104] RSP: 0018:ffffae8cc005bb88 EFLAGS: 00010246\n[    8.146296] RAX: ffff986501dece38 RBX: 0000000000000000 RCX: 0000000000000202\n\n***********************\n1 errors found in logs.\n\nTest requires perl to be installed\nTest requires ptest-runner to be installed\nTest requires ptest-runner to be installed\nTest requires python3-core to be installed\nOutput from runqemu:\nrunqemu - INFO - Received signal: 15\nrunqemu - INFO - Cleaning up\nrunqemu - INFO - Host uptime: 399320.02\n\nrunqemu - INFO - Removing /srv/pokybuild/yocto-worker/oe-selftest-debian/build/build-st-3916371/tmp/deploy/images/qemux86-64/core-image-full-cmdline-qemux86-64.rootfs-20260926061320.ext4\nrunqemu - INFO - Removing /home/pokybuild/tmp/core-image-full-cmdline-qemux86-64.rootfs-20260926061320.ext4.586064\ntput: No value for $TERM and no -T specified\n\nNo /var/lib/rpm on target\nTest case rpm.RpmBasicTest.test_rpm_query_nonroot depends on rpm.RpmBasicTest.test_rpm_query but it didn't pass/run.\nTest case rpm.RpmInstallRemoveTest.test_rpm_install depends on rpm.RpmBasicTest.test_rpm_query but it didn't pass/run.\nTest case rpm.RpmInstallRemoveTest.test_rpm_remove depends on rpm.RpmInstallRemoveTest.test_rpm_install but it didn't pass/run.\nTest case rpm.RpmInstallRemoveTest.test_check_rpm_install_removal_log_file_size depends on rpm.RpmInstallRemoveTest.test_rpm_remove but it didn't pass/run.\nTest requires rust-c-lib-example-bin to be installed\nTest requires openssh-scp to be installed\nTest requires openssh-scp to be installed\nRESULTS:\nRESULTS - date.DateTest.test_date: PASSED (2.31s)\nRESULTS - df.DfTest.test_df: PASSED (0.56s)\nRESULTS - logrotate.LogrotateTest.test_logrotate_newlog: PASSED (3.89s)\nRESULTS - logrotate.LogrotateTest.test_logrotate_wtmp: PASSED (2.63s)\nRESULTS - oe_syslog.SyslogTest.test_syslog_running: PASSED (0.55s)\nRESULTS - oe_syslog.SyslogTestConfig.test_syslog_logger: PASSED (1.89s)\nRESULTS - oe_syslog.SyslogTestConfig.test_syslog_restart: PASSED (1.63s)\nRESULTS - parselogs.ParseLogsTest.test_get_context: PASSED (0.00s)\nRESULTS - parselogs.ParseLogsTest.test_parselogs: PASSED (3.12s)\nRESULTS - ping.PingTest.test_ping: PASSED (0.02s)\nRESULTS - rpm.RpmBasicTest.test_rpm_help: PASSED (0.59s)\nRESULTS - scp.ScpTest.test_scp_file: PASSED (1.34s)\nRESULTS - ssh.SSHTest.test_ssh: PASSED (0.68s)\nRESULTS - apt.AptRepoTest.test_apt_install_from_repo: SKIPPED (0.00s)\nRESULTS - buildcpio.BuildCpioTest.test_cpio: SKIPPED (0.00s)\nRESULTS - buildgalculator.GalculatorTest.test_galculator: SKIPPED (0.00s)\nRESULTS - buildlzip.BuildLzipTest.test_lzip: SKIPPED (0.00s)\nRESULTS - connman.ConnmanTest.test_connmand_help: SKIPPED (0.00s)\nRESULTS - connman.ConnmanTest.test_connmand_running: SKIPPED (0.00s)\nRESULTS - dnf.DnfBasicTest.test_dnf_help: SKIPPED (0.00s)\nRESULTS - dnf.DnfBasicTest.test_dnf_history: SKIPPED (0.00s)\nRESULTS - dnf.DnfBasicTest.test_dnf_info: SKIPPED (0.00s)\nRESULTS - dnf.DnfBasicTest.test_dnf_search: SKIPPED (0.00s)\nRESULTS - dnf.DnfBasicTest.test_dnf_version: SKIPPED (0.00s)\nRESULTS - dnf.DnfRepoTest.test_dnf_exclude: SKIPPED (0.00s)\nRESULTS - dnf.DnfRepoTest.test_dnf_install: SKIPPED (0.00s)\nRESULTS - dnf.DnfRepoTest.test_dnf_install_dependency: SKIPPED (0.00s)\nRESULTS - dnf.DnfRepoTest.test_dnf_install_from_disk: SKIPPED (0.00s)\nRESULTS - dnf.DnfRepoTest.test_dnf_install_from_http: SKIPPED (0.00s)\nRESULTS - dnf.DnfRepoTest.test_dnf_installroot: SKIPPED (0.00s)\nRESULTS - dnf.DnfRepoTest.test_dnf_installroot_usrmerge: SKIPPED (0.00s)\nRESULTS - dnf.DnfRepoTest.test_dnf_makecache: SKIPPED (0.00s)\nRESULTS - dnf.DnfRepoTest.test_dnf_reinstall: SKIPPED (0.00s)\nRESULTS - dnf.DnfRepoTest.test_dnf_repoinfo: SKIPPED (0.00s)\nRESULTS - gcc.GccCompileTest.test_gcc_compile: SKIPPED (0.00s)\nRESULTS - gcc.GccCompileTest.test_gpp2_compile: SKIPPED (0.00s)\nRESULTS - gcc.GccCompileTest.test_gpp_compile: SKIPPED (0.00s)\nRESULTS - gcc.GccCompileTest.test_make: SKIPPED (0.00s)\nRESULTS - gi.GObjectIntrospectionTest.test_python: SKIPPED (0.00s)\nRESULTS - go.CgoHelloworldTest.test_cgohelloworld: SKIPPED (0.00s)\nRESULTS - go.GoCompileTest.test_go_compile: SKIPPED (0.00s)\nRESULTS - go.GoCompileTest.test_go_module: SKIPPED (0.00s)\nRESULTS - go.GoHelloworldTest.test_gohelloworld: SKIPPED (0.00s)\nRESULTS - kernelmodule.KernelModuleTest.test_kernel_module: SKIPPED (0.00s)\nRESULTS - ldd.LddTest.test_ldd: SKIPPED (0.00s)\nRESULTS - oe_syslog.SyslogTestConfig.test_syslog_startup_config: SKIPPED (0.00s)\nRESULTS - opkg.OpkgRepoTest.test_opkg_install_from_repo: SKIPPED (0.00s)\nRESULTS - pam.PamBasicTest.test_pam: SKIPPED (0.00s)\nRESULTS - perl.PerlTest.test_perl_works: SKIPPED (0.00s)\nRESULTS - ptest.PtestRunnerTest.test_ptestrunner_expectfail: SKIPPED (0.00s)\nRESULTS - ptest.PtestRunnerTest.test_ptestrunner_expectsuccess: SKIPPED (0.00s)\nRESULTS - python.PythonTest.test_python3: SKIPPED (0.00s)\nRESULTS - rpm.RpmBasicTest.test_rpm_query: SKIPPED (0.62s)\nRESULTS - rpm.RpmBasicTest.test_rpm_query_nonroot: SKIPPED (0.00s)\nRESULTS - rpm.RpmInstallRemoveTest.test_check_rpm_install_removal_log_file_size: SKIPPED (0.00s)\nRESULTS - rpm.RpmInstallRemoveTest.test_rpm_install: SKIPPED (0.00s)\nRESULTS - rpm.RpmInstallRemoveTest.test_rpm_remove: SKIPPED (0.00s)\nRESULTS - rust.RustCLibExampleTest.test_rust_c_lib_example: SKIPPED (0.00s)\nRESULTS - rust.RustCompileTest.test_cargo_compile: SKIPPED (0.00s)\nRESULTS - rust.RustCompileTest.test_rust_compile: SKIPPED (0.00s)\nRESULTS - stap.StapTest.test_stap: SKIPPED (0.00s)\nRESULTS - systemd.SystemdBasicTests.test_systemd_basic: SKIPPED (0.00s)\nRESULTS - systemd.SystemdBasicTests.test_systemd_failed: SKIPPED (0.00s)\nRESULTS - systemd.SystemdBasicTests.test_systemd_list: SKIPPED (0.00s)\nRESULTS - systemd.SystemdJournalTests.test_systemd_boot_time: SKIPPED (0.00s)\nRESULTS - systemd.SystemdJournalTests.test_systemd_journal: SKIPPED (0.00s)\nRESULTS - systemd.SystemdServiceTests.test_systemd_coredump_minidebuginfo: SKIPPED (0.00s)\nRESULTS - systemd.SystemdServiceTests.test_systemd_disable_enable: SKIPPED (0.00s)\nRESULTS - systemd.SystemdServiceTests.test_systemd_disable_enable_ro: SKIPPED (0.00s)\nRESULTS - systemd.SystemdServiceTests.test_systemd_status: SKIPPED (0.00s)\nRESULTS - systemd.SystemdServiceTests.test_systemd_stop_start: SKIPPED (0.00s)\nRESULTS - weston.WestonTest.test_wayland_info: SKIPPED (0.00s)\nRESULTS - weston.WestonTest.test_weston_can_initialize_new_wayland_compositor: SKIPPED (0.00s)\nRESULTS - weston.WestonTest.test_weston_running: SKIPPED (0.00s)\nRESULTS - weston.WestonTest.test_weston_supports_xwayland: SKIPPED (0.00s)\nRESULTS - xorg.XorgTest.test_xorg_running: SKIPPED (0.00s)\nSUMMARY:\ncore-image-full-cmdline () - Ran 76 tests in 19.883s\ncore-image-full-cmdline - OK - All required tests passed (successes=13, skipped=63, failures=0, errors=0)\nNOTE: recipe core-image-full-cmdline-1.0-r0: task do_testimage: Succeeded\nTest requires kernel-devsrc to be installed\nsystemd is not the init manager for this image\nTest case systemd.SystemdBasicTests.test_systemd_failed depends on systemd.SystemdBasicTests.test_systemd_basic but it didn't pass/run.\nTest case systemd.SystemdBasicTests.test_systemd_list depends on systemd.SystemdBasicTests.test_systemd_basic but it didn't pass/run.\nTest case systemd.SystemdJournalTests.test_systemd_boot_time depends on systemd.SystemdBasicTests.test_systemd_basic but it didn't pass/run.\nTest case systemd.SystemdJournalTests.test_systemd_journal depends on systemd.SystemdBasicTests.test_systemd_basic but it didn't pass/run.\nTest requires minidebuginfo to be in DISTRO_FEATURES\nTest case systemd.SystemdServiceTests.test_systemd_status depends on systemd.SystemdBasicTests.test_systemd_basic but it didn't pass/run.\nTest case systemd.SystemdServiceTests.test_systemd_disable_enable depends on systemd.SystemdServiceTests.test_systemd_status but it didn't pass/run.\nTest is only meant to run with read-only-rootfs in IMAGE_FEATURES\nTest case systemd.SystemdServiceTests.test_systemd_stop_start depends on systemd.SystemdServiceTests.test_systemd_status but it didn't pass/run.\nTest requires xserver-nodm-init to be installed\nWARNING: core-image-weston-1.0-r0 do_testimage: Can not retrieve artifacts from test target: Error while fetching compressed artifacts\nOutput from runqemu:\nrunqemu - INFO - Received signal: 15\nrunqemu - INFO - Cleaning up\nrunqemu - INFO - Host uptime: 399341.97\n\nrunqemu - INFO - Removing /srv/pokybuild/yocto-worker/oe-selftest-debian/build/build-st-3916371/tmp/deploy/images/qemux86-64/core-image-weston-qemux86-64.rootfs-20260926061320.ext4\nrunqemu - INFO - Removing /home/pokybuild/tmp/core-image-weston-qemux86-64.rootfs-20260926061320.ext4.585966\ntput: No value for $TERM and no -T specified\n\nRESULTS:\nRESULTS - date.DateTest.test_date: PASSED (2.29s)\nRESULTS - df.DfTest.test_df: PASSED (0.56s)\nRESULTS - oe_syslog.SyslogTest.test_syslog_running: PASSED (0.58s)\nRESULTS - oe_syslog.SyslogTestConfig.test_syslog_logger: PASSED (1.90s)\nRESULTS - oe_syslog.SyslogTestConfig.test_syslog_restart: PASSED (4.52s)\nRESULTS - oe_syslog.SyslogTestConfig.test_syslog_startup_config: PASSED (10.75s)\nRESULTS - parselogs.ParseLogsTest.test_get_context: PASSED (0.00s)\nRESULTS - ping.PingTest.test_ping: PASSED (0.44s)\nRESULTS - rpm.RpmBasicTest.test_rpm_help: PASSED (0.60s)\nRESULTS - scp.ScpTest.test_scp_file: PASSED (1.15s)\nRESULTS - ssh.SSHTest.test_ssh: PASSED (0.67s)\nRESULTS - weston.WestonTest.test_wayland_info: PASSED (0.55s)\nRESULTS - weston.WestonTest.test_weston_can_initialize_new_wayland_compositor: PASSED (8.47s)\nRESULTS - weston.WestonTest.test_weston_running: PASSED (1.11s)\nRESULTS - weston.WestonTest.test_weston_supports_xwayland: PASSED (0.88s)\nRESULTS - apt.AptRepoTest.test_apt_install_from_repo: SKIPPED (0.00s)\nRESULTS - buildcpio.BuildCpioTest.test_cpio: SKIPPED (0.00s)\nRESULTS - buildgalculator.GalculatorTest.test_galculator: SKIPPED (0.00s)\nRESULTS - buildlzip.BuildLzipTest.test_lzip: SKIPPED (0.00s)\nRESULTS - connman.ConnmanTest.test_connmand_help: SKIPPED (0.00s)\nRESULTS - connman.ConnmanTest.test_connmand_running: SKIPPED (0.00s)\nRESULTS - dnf.DnfBasicTest.test_dnf_help: SKIPPED (0.00s)\nRESULTS - dnf.DnfBasicTest.test_dnf_history: SKIPPED (0.00s)\nRESULTS - dnf.DnfBasicTest.test_dnf_info: SKIPPED (0.00s)\nRESULTS - dnf.DnfBasicTest.test_dnf_search: SKIPPED (0.00s)\nRESULTS - dnf.DnfBasicTest.test_dnf_version: SKIPPED (0.00s)\nRESULTS - dnf.DnfRepoTest.test_dnf_exclude: SKIPPED (0.00s)\nRESULTS - dnf.DnfRepoTest.test_dnf_install: SKIPPED (0.00s)\nRESULTS - dnf.DnfRepoTest.test_dnf_install_dependency: SKIPPED (0.00s)\nRESULTS - dnf.DnfRepoTest.test_dnf_install_from_disk: SKIPPED (0.00s)\nRESULTS - dnf.DnfRepoTest.test_dnf_install_from_http: SKIPPED (0.00s)\nRESULTS - dnf.DnfRepoTest.test_dnf_installroot: SKIPPED (0.00s)\nRESULTS - dnf.DnfRepoTest.test_dnf_installroot_usrmerge: SKIPPED (0.00s)\nRESULTS - dnf.DnfRepoTest.test_dnf_makecache: SKIPPED (0.00s)\nRESULTS - dnf.DnfRepoTest.test_dnf_reinstall: SKIPPED (0.00s)\nRESULTS - dnf.DnfRepoTest.test_dnf_repoinfo: SKIPPED (0.00s)\nRESULTS - gcc.GccCompileTest.test_gcc_compile: SKIPPED (0.00s)\nRESULTS - gcc.GccCompileTest.test_gpp2_compile: SKIPPED (0.00s)\nRESULTS - gcc.GccCompileTest.test_gpp_compile: SKIPPED (0.00s)\nRESULTS - gcc.GccCompileTest.test_make: SKIPPED (0.00s)\nRESULTS - gi.GObjectIntrospectionTest.test_python: SKIPPED (0.00s)\nRESULTS - go.CgoHelloworldTest.test_cgohelloworld: SKIPPED (0.00s)\nRESULTS - go.GoCompileTest.test_go_compile: SKIPPED (0.00s)\nRESULTS - go.GoCompileTest.test_go_module: SKIPPED (0.00s)\nRESULTS - go.GoHelloworldTest.test_gohelloworld: SKIPPED (0.00s)\nRESULTS - kernelmodule.KernelModuleTest.test_kernel_module: SKIPPED (0.00s)\nRESULTS - ldd.LddTest.test_ldd: SKIPPED (0.00s)\nRESULTS - logrotate.LogrotateTest.test_logrotate_newlog: SKIPPED (0.00s)\nRESULTS - logrotate.LogrotateTest.test_logrotate_wtmp: SKIPPED (0.00s)\nRESULTS - opkg.OpkgRepoTest.test_opkg_install_from_repo: SKIPPED (0.00s)\nRESULTS - pam.PamBasicTest.test_pam: SKIPPED (0.00s)\nRESULTS - perl.PerlTest.test_perl_works: SKIPPED (0.00s)\nRESULTS - ptest.PtestRunnerTest.test_ptestrunner_expectfail: SKIPPED (0.00s)\nRESULTS - ptest.PtestRunnerTest.test_ptestrunner_expectsuccess: SKIPPED (0.00s)\nRESULTS - python.PythonTest.test_python3: SKIPPED (0.00s)\nRESULTS - rpm.RpmBasicTest.test_rpm_query: SKIPPED (0.55s)\nRESULTS - rpm.RpmBasicTest.test_rpm_query_nonroot: SKIPPED (0.00s)\nRESULTS - rpm.RpmInstallRemoveTest.test_check_rpm_install_removal_log_file_size: SKIPPED (0.00s)\nRESULTS - rpm.RpmInstallRemoveTest.test_rpm_install: SKIPPED (0.00s)\nRESULTS - rpm.RpmInstallRemoveTest.test_rpm_remove: SKIPPED (0.00s)\nRESULTS - rust.RustCLibExampleTest.test_rust_c_lib_example: SKIPPED (0.00s)\nRESULTS - rust.RustCompileTest.test_cargo_compile: SKIPPED (0.00s)\nRESULTS - rust.RustCompileTest.test_rust_compile: SKIPPED (0.00s)\nRESULTS - stap.StapTest.test_stap: SKIPPED (0.00s)\nRESULTS - systemd.SystemdBasicTests.test_systemd_basic: SKIPPED (0.00s)\nRESULTS - systemd.SystemdBasicTests.test_systemd_failed: SKIPPED (0.00s)\nRESULTS - systemd.SystemdBasicTests.test_systemd_list: SKIPPED (0.00s)\nRESULTS - systemd.SystemdJournalTests.test_systemd_boot_time: SKIPPED (0.00s)\nRESULTS - systemd.SystemdJournalTests.test_systemd_journal: SKIPPED (0.00s)\nRESULTS - systemd.SystemdServiceTests.test_systemd_coredump_minidebuginfo: SKIPPED (0.00s)\nRESULTS - systemd.SystemdServiceTests.test_systemd_disable_enable: SKIPPED (0.00s)\nRESULTS - systemd.SystemdServiceTests.test_systemd_disable_enable_ro: SKIPPED (0.00s)\nRESULTS - systemd.SystemdServiceTests.test_systemd_status: SKIPPED (0.00s)\nRESULTS - systemd.SystemdServiceTests.test_systemd_stop_start: SKIPPED (0.00s)\nRESULTS - xorg.XorgTest.test_xorg_running: SKIPPED (0.00s)\nRESULTS - parselogs.ParseLogsTest.test_parselogs: FAILED (2.36s)\nSUMMARY:\ncore-image-weston () - Ran 76 tests in 37.448s\ncore-image-weston - FAIL - Required tests failed (successes=15, skipped=60, failures=1, errors=0)\ncore-image-weston - FAILED - Last lines of QEMU boot logs:\n--- qemu_boot_log.20260926081523 ---\n[    8.172602]  drm_atomic_helper_commit+0x168/0x1b0\n[    8.174422]  drm_atomic_commit+0xb1/0xe0\n[    8.175911]  ? __pfx___drm_printfn_info+0x10/0x10\n[    8.177653]  drm_atomic_helper_dirtyfb+0x1e6/0x2d0\n[    8.180820]  drm_fbdev_shmem_helper_fb_dirty+0x51/0xd0\n[    8.182727]  drm_fb_helper_damage_work+0x251/0x450\n[    8.184525]  process_one_work+0x175/0x350\n[    8.186888]  worker_thread+0x1a1/0x320\n[    8.188222]  ? __pfx_worker_thread+0x10/0x10\n[    8.189771]  ? __pfx_worker_thread+0x10/0x10\n[    8.191298]  kthread+0xfc/0x140\n[    8.192412]  ? __pfx_kthread+0x10/0x10\n[    8.193736]  ret_from_fork+0x12c/0x210\n[    8.195052]  ? __pfx_kthread+0x10/0x10\n[    8.196333]  ret_from_fork_asm+0x1a/0x30\n[    8.197714]  </TASK>\n[    8.198528] ---[ end trace 0000000000000000 ]---\n00:00:33.493 \u001b[1;34m [9.3/seatd/server.c:145] New client connected (pid: 595, uid: 0, gid: 0)\u001b[0m\n00:00:33.497 \u001b[1;31m [9.3/seatd/seat.c:201] Could not add client: seat is VT-bound and has an active client\u001b[0m\n00:00:33.501 \u001b[1;31m [9.3/seatd/client.c:176] Could not add client to target seat: Device or resource busy\u001b[0m\n\n--- qemu_boot_log.20260926081523.2 ---\n\nStarting Telephony daemon\n\n00:00:00.430 \u001b[1;34m [9.3/seatd/server.c:145] New client connected (pid: 379, uid: 1000, gid: 1000)\u001b[0m\n\n00:00:00.430 \u001b[1;34m [9.3/seatd/seat.c:248] Added client 2 to seat0\u001b[0m\n\n00:00:00.430 \u001b[1;34m [9.3/seatd/seat.c:584] Opened client 2 on seat0\u001b[0m\n\n\n\nPoky (Yocto Project Reference Distro) 6.0.99+snapshot-eb9d909c16b2ad65a9c41a848a7190b6dd26a430 qemux86-64 /dev/ttyS1\n\n\n\nType 'root' to login with superuser privileges (no password will be asked).\n\n\n\nqemux86-64 login: \nERROR: core-image-weston-1.0-r0 do_testimage: core-image-weston - FAILED - also check the logs in /srv/pokybuild/yocto-worker/oe-selftest-debian/build/build-st-3916371/tmp/log\nNOTE: recipe core-image-weston-1.0-r0: task do_testimage: Succeeded\nNOTE: Tasks Summary: Attempted 1548 tasks of which 1546 didn't need to be rerun and all succeeded.\n\nSummary: There was 1 WARNING message.\nSummary: There was 1 ERROR message, returning a non-zero exit code.\n\n\nStderr:\n2026-09-26 06:06:13,405 - oe-selftest - INFO - Adding: \"include selftest.inc\" in /srv/pokybuild/yocto-worker/oe-selftest-debian/build/build-st-3916371/conf/local.conf\n2026-09-26 06:06:13,405 - oe-selftest - INFO - Adding: \"include bblayers.inc\" in bblayers.conf\n/usr/lib/python3.12/unittest/case.py:580: RuntimeWarning: TestResult has no addDuration method\n  warnings.warn(\"TestResult has no addDuration method\",\n\n/usr/lib/python3.12/unittest/case.py:580: RuntimeWarning: TestResult has no addDuration method\n  warnings.warn(\"TestResult has no addDuration method\",\n\n/usr/lib/python3.12/unittest/case.py:580: RuntimeWarning: TestResult has no addDuration method\n  warnings.warn(\"TestResult has no addDuration method\",\n\n/usr/lib/python3.12/unittest/case.py:580: RuntimeWarning: TestResult has no addDuration method\n  warnings.warn(\"TestResult has no addDuration method\",\n\n/usr/lib/python3.12/unittest/case.py:580: RuntimeWarning: TestResult has no addDuration method\n  warnings.warn(\"TestResult has no addDuration method\",\n\n/usr/lib/python3.12/unittest/case.py:580: RuntimeWarning: TestResult has no addDuration method\n  warnings.warn(\"TestResult has no addDuration method\",\n\nWARNING: test: LICENSE is using \"CLOSED\", which is deprecated. Convert to using a license ref pointing to an actual license file, e.g.\nLICENSE = \"LicenseRef-test-CLOSED\"\nWARNING: test: LICENSE is using \"CLOSED\", which is deprecated. Convert to using a license ref pointing to an actual license file, e.g.\nLICENSE = \"LicenseRef-test-CLOSED\"\nERROR: When reparsing /tmp/selftest-fetchvno751t4/test.bb:do_checkuri, the basehash value changed from cf5cbdc6dee19eec8e0ab7c147e79435436ca4f98353b070a206b72d66c2c748 to 5fc2e5d8a9cfbc8790ff18a3130b8a06335977184d22e2ff79a8f6c41b61a6b0. The metadata is not deterministic and this needs to be fixed.\nERROR: The following commands may help:\nERROR: $ bitbake test -cdo_checkuri -Snone\nERROR: Then:\nERROR: $ bitbake test -cdo_checkuri -Sprintdiff\n\nERROR: When reparsing /tmp/selftest-fetchvno751t4/test.bb:do_fetch, the basehash value changed from ff215cb1adc0a61a280c7a0a3ba5905510882f32d3fac56636234b90a88be118 to 32812182a8721ed3d8a5496e40aafb5936f3d965686e9677863926d520f0bdfc. The metadata is not deterministic and this needs to be fixed.\nERROR: The following commands may help:\nERROR: $ bitbake test -cdo_fetch -Snone\nERROR: Then:\nERROR: $ bitbake test -cdo_fetch -Sprintdiff\n\nERROR: When reparsing /tmp/selftest-fetchvno751t4/test.bb:do_unpack, the basehash value changed from b608ba599130a8bb1efb8d62d4aeeb78c9b688783051e99b8d0c0ce3a7c88916 to 8dfeb4a4688fb92ee953c89ea1db9917036ab0b3a2613ff8de764e33fafc9db5. The metadata is not deterministic and this needs to be fixed.\nERROR: The following commands may help:\nERROR: $ bitbake test -cdo_unpack -Snone\nERROR: Then:\nERROR: $ bitbake test -cdo_unpack -Sprintdiff\n\nERROR: When reparsing /tmp/selftest-fetchvno751t4/test.bb:do_cleanall, the basehash value changed from 01396410d89629f31345dd0c090b4705fd8ff9602b89a06299f867c2eb42abb5 to 7ccd4ffa6bc0d08dc152aa634becb06c88614ebec4660837b92527a8b5cc6e5c. The metadata is not deterministic and this needs to be fixed.\nERROR: The following commands may help:\nERROR: $ bitbake test -cdo_cleanall -Snone\nERROR: Then:\nERROR: $ bitbake test -cdo_cleanall -Sprintdiff\n\nERROR: When reparsing /tmp/selftest-fetchvno751t4/test.bb:do_recipe_qa, the basehash value changed from d40b0c13163b5e96ec4c4843f00692257c21a0b9190ebe4e1a7e3a82e94ea485 to 8f805b46b6656531f8255789bf5819de754cfc74c9b9bbf3d9ebe25169b2cadb. The metadata is not deterministic and this needs to be fixed.\nERROR: The following commands may help:\nERROR: $ bitbake test -cdo_recipe_qa -Snone\nERROR: Then:\nERROR: $ bitbake test -cdo_recipe_qa -Sprintdiff\n\nERROR: When reparsing /tmp/selftest-fetchvno751t4/test.bb:do_populate_lic, the basehash value changed from 3c20358af85dc0f4da44a0adb9585e4e7e535586c95ef6888d75ba8ed16af9a2 to f7fafa0af9cb923c987871db0984bac6513bd7709eec72374af06b15c62ba098. The metadata is not deterministic and this needs to be fixed.\nERROR: The following commands may help:\nERROR: $ bitbake test -cdo_populate_lic -Snone\nERROR: Then:\nERROR: $ bitbake test -cdo_populate_lic -Sprintdiff\n\nERROR: When reparsing /tmp/selftest-fetchvno751t4/test.bb:do_create_spdx, the basehash value changed from 24287b1f44ef5f77a09a1a97ac77edd9d2dcca21df881bab0ca99a5cc44ef29d to d1be9cb5c1563584ce8bc835765e9a85c9964e7bc8c19689e2c666b78bdf360f. The metadata is not deterministic and this needs to be fixed.\nERROR: The following commands may help:\nERROR: $ bitbake test -cdo_create_spdx -Snone\nERROR: Then:\nERROR: $ bitbake test -cdo_create_spdx -Sprintdiff\n\nWARNING: test: LICENSE is using \"CLOSED\", which is deprecated. Convert to using a license ref pointing to an actual license file, e.g.\nLICENSE = \"LicenseRef-test-CLOSED\"\nERROR: When reparsing /tmp/selftest-fetchvno751t4/test.bb:do_checkuri, the basehash value changed from 5fc2e5d8a9cfbc8790ff18a3130b8a06335977184d22e2ff79a8f6c41b61a6b0 to e72dac1bf99cbba0f6b792a038f71d7c07e3cc27dc2043baae03ec487f0ebdaa. The metadata is not deterministic and this needs to be fixed.\nERROR: The following commands may help:\nERROR: $ bitbake test -cdo_checkuri -Snone\nERROR: Then:\nERROR: $ bitbake test -cdo_checkuri -Sprintdiff\n\nERROR: When reparsing /tmp/selftest-fetchvno751t4/test.bb:do_fetch, the basehash value changed from 32812182a8721ed3d8a5496e40aafb5936f3d965686e9677863926d520f0bdfc to 9653a6f3415263e3c8a21ae071c51dd73592f80029c041b83aabcaae6359abf4. The metadata is not deterministic and this needs to be fixed.\nERROR: The following commands may help:\nERROR: $ bitbake test -cdo_fetch -Snone\nERROR: Then:\nERROR: $ bitbake test -cdo_fetch -Sprintdiff\n\nERROR: When reparsing /tmp/selftest-fetchvno751t4/test.bb:do_unpack, the basehash value changed from 8dfeb4a4688fb92ee953c89ea1db9917036ab0b3a2613ff8de764e33fafc9db5 to c1e9f46825023ff23c4fc466eccc386e01a74661b5a4472241d38d769f9a9c59. The metadata is not deterministic and this needs to be fixed.\nERROR: The following commands may help:\nERROR: $ bitbake test -cdo_unpack -Snone\nERROR: Then:\nERROR: $ bitbake test -cdo_unpack -Sprintdiff\n\nERROR: When reparsing /tmp/selftest-fetchvno751t4/test.bb:do_cleanall, the basehash value changed from 7ccd4ffa6bc0d08dc152aa634becb06c88614ebec4660837b92527a8b5cc6e5c to bce0ec8c074ed3641063dc215d193b50dfc1b957c022fbbbd876c012f08fc165. The metadata is not deterministic and this needs to be fixed.\nERROR: The following commands may help:\nERROR: $ bitbake test -cdo_cleanall -Snone\nERROR: Then:\nERROR: $ bitbake test -cdo_cleanall -Sprintdiff\n\nERROR: When reparsing /tmp/selftest-fetchvno751t4/test.bb:do_recipe_qa, the basehash value changed from 8f805b46b6656531f8255789bf5819de754cfc74c9b9bbf3d9ebe25169b2cadb to 91ee055ab12a24e28f18a3185c280fb2287a3d9942a675ea7ea934997ce7925a. The metadata is not deterministic and this needs to be fixed.\nERROR: The following commands may help:\nERROR: $ bitbake test -cdo_recipe_qa -Snone\nERROR: Then:\nERROR: $ bitbake test -cdo_recipe_qa -Sprintdiff\n\nERROR: When reparsing /tmp/selftest-fetchvno751t4/test.bb:do_populate_lic, the basehash value changed from f7fafa0af9cb923c987871db0984bac6513bd7709eec72374af06b15c62ba098 to 3cb62c7d6cac6e975aa9ce11d8abcb1cb6e1739d7ebed0398c8bb16f153dd866. The metadata is not deterministic and this needs to be fixed.\nERROR: The following commands may help:\nERROR: $ bitbake test -cdo_populate_lic -Snone\nERROR: Then:\nERROR: $ bitbake test -cdo_populate_lic -Sprintdiff\n\nERROR: When reparsing /tmp/selftest-fetchvno751t4/test.bb:do_create_spdx, the basehash value changed from d1be9cb5c1563584ce8bc835765e9a85c9964e7bc8c19689e2c666b78bdf360f to 62348bfca5f779ff826fcfe80a3b079cd934bb072e74533069861e273e21441f. The metadata is not deterministic and this needs to be fixed.\nERROR: The following commands may help:\nERROR: $ bitbake test -cdo_create_spdx -Snone\nERROR: Then:\nERROR: $ bitbake test -cdo_create_spdx -Sprintdiff\n\nWARNING: test: LICENSE is using \"CLOSED\", which is deprecated. Convert to using a license ref pointing to an actual license file, e.g.\nLICENSE = \"LicenseRef-test-CLOSED\"\nERROR: When reparsing /tmp/selftest-fetchvno751t4/test.bb:do_checkuri, the basehash value changed from e72dac1bf99cbba0f6b792a038f71d7c07e3cc27dc2043baae03ec487f0ebdaa to 261db4eebbd1d6d909256dfbd186d4d697f44f92401c3621d2ac3f18c4206df5. The metadata is not deterministic and this needs to be fixed.\nERROR: The following commands may help:\nERROR: $ bitbake test -cdo_checkuri -Snone\nERROR: Then:\nERROR: $ bitbake test -cdo_checkuri -Sprintdiff\n\nERROR: When reparsing /tmp/selftest-fetchvno751t4/test.bb:do_fetch, the basehash value changed from 9653a6f3415263e3c8a21ae071c51dd73592f80029c041b83aabcaae6359abf4 to 61a0644ebeeeb417de89b733a902a3b3d034ff6e44257ace9e5c62395eb1d012. The metadata is not deterministic and this needs to be fixed.\nERROR: The following commands may help:\nERROR: $ bitbake test -cdo_fetch -Snone\nERROR: Then:\nERROR: $ bitbake test -cdo_fetch -Sprintdiff\n\nERROR: When reparsing /tmp/selftest-fetchvno751t4/test.bb:do_unpack, the basehash value changed from c1e9f46825023ff23c4fc466eccc386e01a74661b5a4472241d38d769f9a9c59 to 3608b030c8c95a7784f40b86ee3d612a172fbe37ac79c5819e5522a625397139. The metadata is not deterministic and this needs to be fixed.\nERROR: The following commands may help:\nERROR: $ bitbake test -cdo_unpack -Snone\nERROR: Then:\nERROR: $ bitbake test -cdo_unpack -Sprintdiff\n\nERROR: When reparsing /tmp/selftest-fetchvno751t4/test.bb:do_cleanall, the basehash value changed from bce0ec8c074ed3641063dc215d193b50dfc1b957c022fbbbd876c012f08fc165 to dcecc6c2b1eb25d072c325b51e33b4a7d2a0d23c0df74522a6c8a6c31363b8df. The metadata is not deterministic and this needs to be fixed.\nERROR: The following commands may help:\nERROR: $ bitbake test -cdo_cleanall -Snone\nERROR: Then:\nERROR: $ bitbake test -cdo_cleanall -Sprintdiff\n\nERROR: When reparsing /tmp/selftest-fetchvno751t4/test.bb:do_recipe_qa, the basehash value changed from 91ee055ab12a24e28f18a3185c280fb2287a3d9942a675ea7ea934997ce7925a to d3d95b0cde89e42596a1ecbda004f2d114d700952a3f81ba20e0c17c09ebce8f. The metadata is not deterministic and this needs to be fixed.\nERROR: The following commands may help:\nERROR: $ bitbake test -cdo_recipe_qa -Snone\nERROR: Then:\nERROR: $ bitbake test -cdo_recipe_qa -Sprintdiff\n\nERROR: When reparsing /tmp/selftest-fetchvno751t4/test.bb:do_populate_lic, the basehash value changed from 3cb62c7d6cac6e975aa9ce11d8abcb1cb6e1739d7ebed0398c8bb16f153dd866 to 3e253d664bcd7ef54ecf8ec8dee99b95ab4ec7c9dd1536b9d954f639c7b9e960. The metadata is not deterministic and this needs to be fixed.\nERROR: The following commands may help:\nERROR: $ bitbake test -cdo_populate_lic -Snone\nERROR: Then:\nERROR: $ bitbake test -cdo_populate_lic -Sprintdiff\n\nERROR: When reparsing /tmp/selftest-fetchvno751t4/test.bb:do_create_spdx, the basehash value changed from 62348bfca5f779ff826fcfe80a3b079cd934bb072e74533069861e273e21441f to 463796edab7820f4b4cab148bd9e34c25c6c0d410d0dc4b9aa2ac27db5d68500. The metadata is not deterministic and this needs to be fixed.\nERROR: The following commands may help:\nERROR: $ bitbake test -cdo_create_spdx -Snone\nERROR: Then:\nERROR: $ bitbake test -cdo_create_spdx -Sprintdiff\n\n",
    "status": "FAILED"
   },
   "incompatible_lic.NoGPL3InImagesTests.test_core_image_minimal": {
    "duration": 62.319,
    "status": "PASSED"
   },
   "install.InstallTests.test_gstreamer_plugins": {
    "duration": 853.246,
    "status": "PASSED"
   },
   "install.InstallTests.test_linux_firmware": {
    "duration": 118.016,
    "status": "PASSED"
   },
   "install.InstallTests.test_linux_modules": {
    "duration": 52.781,
    "status": "PASSED"
   },
   "install.InstallTests.test_perl": {
    "duration": 54.083,
    "status": "PASSED"
   },
   "install.InstallTests.test_python": {
    "duration": 48.101,
    "status": "PASSED"
   },
   "intercept.GitCheck.test_git_intercept": {
    "duration": 35.445,
    "status": "PASSED"
   },
   "kerneldevelopment.KernelDev.test_apply_patches": {
    "duration": 99.333,
    "status": "PASSED"
   },
   "kernelmodulesplit.KernelModuleSplit.test_cross_recipe_module_dependency": {
    "duration": 5137.733,
    "status": "PASSED"
   },
   "layerappend.LayerAppendTests.test_layer_appends": {
    "duration": 49.641,
    "status": "PASSED"
   },
   "liboe.CopyTreeTests.test_copy_hardlink_tree_count": {
    "duration": 0.01568,
    "status": "PASSED"
   },
   "liboe.CopyTreeTests.test_copy_tree_special": {
    "duration": 0.009783,
    "status": "PASSED"
   },
   "liboe.CopyTreeTests.test_copy_tree_xattr": {
    "duration": 42.81,
    "status": "PASSED"
   },
   "liboe.PathTests.test_canonicalize_empty_string_returns_empty_string": {
    "duration": 0.009617,
    "status": "PASSED"
   },
   "liboe.PathTests.test_canonicalize_empty_token_between_paths_is_dropped": {
    "duration": 0.004995,
    "status": "PASSED"
   },
   "liboe.PathTests.test_canonicalize_multiple_variable_tokens_all_skipped": {
    "duration": 0.004821,
    "status": "PASSED"
   },
   "liboe.PathTests.test_canonicalize_none_returns_empty_string": {
    "duration": 0.004687,
    "status": "PASSED"
   },
   "liboe.PathTests.test_canonicalize_real_path_returned": {
    "duration": 0.0044,
    "status": "PASSED"
   },
   "liboe.PathTests.test_canonicalize_trailing_slash_preserved": {
    "duration": 0.004289,
    "status": "PASSED"
   },
   "liboe.PathTests.test_canonicalize_unexpanded_variable_is_skipped": {
    "duration": 0.00427,
    "status": "PASSED"
   },
   "liboe.PathTests.test_canonicalize_variable_and_trailing_slash_path": {
    "duration": 0.00437,
    "status": "PASSED"
   },
   "liboe.PathTests.test_canonicalize_variable_token_dropped_leaving_real_path": {
    "duration": 0.00437,
    "status": "PASSED"
   },
   "liboe.PathTests.test_is_path_parent_all_paths_must_be_below": {
    "duration": 0.00455,
    "status": "PASSED"
   },
   "liboe.PathTests.test_is_path_parent_child_is_not_parent_of_its_parent": {
    "duration": 0.004476,
    "status": "PASSED"
   },
   "liboe.PathTests.test_is_path_parent_direct_child": {
    "duration": 0.004246,
    "status": "PASSED"
   },
   "liboe.PathTests.test_is_path_parent_no_paths_returns_false": {
    "duration": 0.004235,
    "status": "PASSED"
   },
   "liboe.PathTests.test_is_path_parent_one_path_outside_fails": {
    "duration": 0.004237,
    "status": "PASSED"
   },
   "liboe.PathTests.test_is_path_parent_prefix_string_is_not_a_path_parent": {
    "duration": 0.004133,
    "status": "PASSED"
   },
   "liboe.PathTests.test_is_path_parent_unrelated_path": {
    "duration": 0.004144,
    "status": "PASSED"
   },
   "liboe.PathTests.test_join_absolute_rhs_is_not_special": {
    "duration": 0.004405,
    "status": "PASSED"
   },
   "liboe.PathTests.test_join_empty_leading_component_is_absolute": {
    "duration": 0.004323,
    "status": "PASSED"
   },
   "liboe.PathTests.test_join_pardir_normalised": {
    "duration": 0.00421,
    "status": "PASSED"
   },
   "liboe.PathTests.test_join_redundant_separators_normalised": {
    "duration": 0.004251,
    "status": "PASSED"
   },
   "liboe.PathTests.test_join_two_paths": {
    "duration": 0.004151,
    "status": "PASSED"
   },
   "liboe.PathTests.test_make_relative_symlink_absolute_becomes_relative_and_resolves": {
    "duration": 0.004869,
    "status": "PASSED"
   },
   "liboe.PathTests.test_make_relative_symlink_already_relative_unchanged": {
    "duration": 0.004427,
    "status": "PASSED"
   },
   "liboe.PathTests.test_make_relative_symlink_non_symlink_is_ignored": {
    "duration": 0.004587,
    "status": "PASSED"
   },
   "liboe.PathTests.test_make_relative_symlink_several_levels_deep_becomes_relative": {
    "duration": 0.004823,
    "status": "PASSED"
   },
   "liboe.PathTests.test_realpath_isdir_failure_falls_back_without_nameerror": {
    "duration": 0.005941,
    "status": "PASSED"
   },
   "liboe.PathTests.test_realpath_missing_component_raises_enoent_without_assume_dir": {
    "duration": 0.004792,
    "status": "PASSED"
   },
   "liboe.PathTests.test_realpath_missing_component_tolerated_with_assume_dir": {
    "duration": 0.004287,
    "status": "PASSED"
   },
   "liboe.PathTests.test_realpath_mutual_symlink_cycle_raises_eloop": {
    "duration": 0.005333,
    "status": "PASSED"
   },
   "liboe.PathTests.test_realpath_path_outside_root_raises": {
    "duration": 0.004511,
    "status": "PASSED"
   },
   "liboe.PathTests.test_realpath_plain_path_is_returned": {
    "duration": 0.004409,
    "status": "PASSED"
   },
   "liboe.PathTests.test_realpath_resolves_symlink_below_root": {
    "duration": 0.00433,
    "status": "PASSED"
   },
   "liboe.PathTests.test_realpath_resolves_symlink_several_components_deep": {
    "duration": 0.004539,
    "status": "PASSED"
   },
   "liboe.PathTests.test_realpath_self_referential_symlink_raises_eloop": {
    "duration": 0.005491,
    "status": "PASSED"
   },
   "liboe.PathTests.test_symlink_conflicting_existing_raises": {
    "duration": 0.004617,
    "status": "PASSED"
   },
   "liboe.PathTests.test_symlink_creates_dangling_symlink": {
    "duration": 0.004445,
    "status": "PASSED"
   },
   "liboe.PathTests.test_symlink_creates_symlink": {
    "duration": 0.004311,
    "status": "PASSED"
   },
   "liboe.PathTests.test_symlink_force_does_not_delete_glob_siblings": {
    "duration": 0.004423,
    "status": "PASSED"
   },
   "liboe.PathTests.test_symlink_force_overwrites_existing_symlink": {
    "duration": 0.004314,
    "status": "PASSED"
   },
   "liboe.PathTests.test_symlink_force_replaces_destination_with_glob_metacharacters": {
    "duration": 0.004319,
    "status": "PASSED"
   },
   "liboe.PathTests.test_symlink_force_replaces_existing_directory": {
    "duration": 0.004368,
    "status": "PASSED"
   },
   "liboe.PathTests.test_symlink_matching_existing_is_idempotent": {
    "duration": 0.004268,
    "status": "PASSED"
   },
   "liboe.PathTests.test_which_wild_explicit_search_path": {
    "duration": 0.004415,
    "status": "PASSED"
   },
   "liboe.PathTests.test_which_wild_first_match_per_name_wins": {
    "duration": 0.004585,
    "status": "PASSED"
   },
   "liboe.PathTests.test_which_wild_missing_tool_returns_empty": {
    "duration": 0.00451,
    "status": "PASSED"
   },
   "liboe.PathTests.test_which_wild_wildcard_pattern": {
    "duration": 0.004499,
    "status": "PASSED"
   },
   "liboe.SubprocessTests.test_subprocess_tweak": {
    "duration": 0.01482,
    "status": "PASSED"
   },
   "lic_checksum.LicenseTests.test_checksum_with_space": {
    "duration": 28.025,
    "status": "PASSED"
   },
   "lic_checksum.LicenseTests.test_nonmatching_checksum": {
    "duration": 22.883,
    "status": "PASSED"
   },
   "locales.LocalesTest.test_locales_off": {
    "duration": 715.392,
    "status": "PASSED"
   },
   "locales.LocalesTest.test_locales_on": {
    "duration": 129.557,
    "status": "PASSED"
   },
   "manifest.VerifyManifest.test_SDK_manifest_entries": {
    "duration": 398.594,
    "status": "PASSED"
   },
   "manifest.VerifyManifest.test_image_manifest_entries": {
    "duration": 11.449,
    "status": "PASSED"
   },
   "minidebuginfo.Minidebuginfo.test_minidebuginfo": {
    "duration": 2113.292,
    "status": "PASSED"
   },
   "minidebuginfo.Minidebuginfo.test_minidebuginfo_qemu": {
    "duration": 1263.32,
    "oetags": [
     "runqemu"
    ],
    "status": "PASSED"
   },
   "multiconfig.MultiConfig.test_multiconfig": {
    "duration": 299.908,
    "status": "PASSED"
   },
   "multiconfig.MultiConfig.test_multiconfig_inlayer": {
    "duration": 43.768,
    "status": "PASSED"
   },
   "multiconfig.MultiConfig.test_multiconfig_reparse": {
    "duration": 81.929,
    "status": "PASSED"
   },
   "newlib.NewlibTest.test_newlib": {
    "duration": 81.232,
    "status": "PASSED"
   },
   "oelib.buildhistory.TestBlobParsing.test_blob_to_dict": {
    "duration": 1.243,
    "status": "PASSED"
   },
   "oelib.buildhistory.TestBlobParsing.test_compare_dict_blobs": {
    "duration": 0.7126,
    "status": "PASSED"
   },
   "oelib.buildhistory.TestBlobParsing.test_compare_dict_blobs_default": {
    "duration": 0.9258,
    "status": "PASSED"
   },
   "oelib.buildhistory.TestFileListCompare.test_compare_file_lists": {
    "duration": 0.1102,
    "status": "PASSED"
   },
   "oelib.elf.TestElf.test_machine_name": {
    "duration": 0.000989,
    "status": "PASSED"
   },
   "oelib.fs_uuid.TestGetRootfsUuid.test_fatal_on_empty_tune2fs_output": {
    "duration": 0.00172,
    "status": "PASSED"
   },
   "oelib.fs_uuid.TestGetRootfsUuid.test_fatal_when_uuid_line_missing": {
    "duration": 0.0008926,
    "status": "PASSED"
   },
   "oelib.fs_uuid.TestGetRootfsUuid.test_first_uuid_line_wins": {
    "duration": 0.0006678,
    "status": "PASSED"
   },
   "oelib.fs_uuid.TestGetRootfsUuid.test_ignores_uuid_text_that_is_not_at_line_start": {
    "duration": 0.0006063,
    "status": "PASSED"
   },
   "oelib.fs_uuid.TestGetRootfsUuid.test_missing_tune2fs_propagates": {
    "duration": 0.0005121,
    "status": "PASSED"
   },
   "oelib.fs_uuid.TestGetRootfsUuid.test_notes_path_and_uuid": {
    "duration": 0.0004437,
    "status": "PASSED"
   },
   "oelib.fs_uuid.TestGetRootfsUuid.test_parses_typical_tune2fs_output": {
    "duration": 0.0006762,
    "status": "PASSED"
   },
   "oelib.fs_uuid.TestGetRootfsUuid.test_tune2fs_failure_propagates": {
    "duration": 0.0009336,
    "status": "PASSED"
   },
   "oelib.fs_uuid.TestGetRootfsUuid.test_uses_rootfs_variable": {
    "duration": 0.0007119,
    "status": "PASSED"
   },
   "oelib.fs_uuid.TestGetRootfsUuid.test_uuid_is_last_token_on_the_line": {
    "duration": 0.0007339,
    "status": "PASSED"
   },
   "oelib.fs_uuid.TestGetRootfsUuidLive.test_reads_uuid_from_real_ext_image": {
    "duration": 0.02365,
    "status": "PASSED"
   },
   "oelib.fs_uuid.TestReplaceRootfsUuid.test_empty_string_is_noop": {
    "duration": 0.004023,
    "status": "PASSED"
   },
   "oelib.fs_uuid.TestReplaceRootfsUuid.test_near_miss_placeholders_are_left_alone": {
    "duration": 0.000829,
    "status": "PASSED"
   },
   "oelib.fs_uuid.TestReplaceRootfsUuid.test_no_placeholder_is_noop": {
    "duration": 0.0003998,
    "status": "PASSED"
   },
   "oelib.fs_uuid.TestReplaceRootfsUuid.test_placeholder_as_substring_is_replaced": {
    "duration": 0.00108,
    "status": "PASSED"
   },
   "oelib.fs_uuid.TestReplaceRootfsUuid.test_placeholder_only": {
    "duration": 0.0008063,
    "status": "PASSED"
   },
   "oelib.fs_uuid.TestReplaceRootfsUuid.test_replacement_failure_when_uuid_cannot_be_read": {
    "duration": 0.0008986,
    "status": "PASSED"
   },
   "oelib.fs_uuid.TestReplaceRootfsUuid.test_replaces_every_placeholder": {
    "duration": 0.0008729,
    "status": "PASSED"
   },
   "oelib.fs_uuid.TestReplaceRootfsUuid.test_replaces_grub_style_root_argument": {
    "duration": 0.001128,
    "status": "PASSED"
   },
   "oelib.fs_uuid.TestReplaceRootfsUuid.test_replaces_syslinux_style_append": {
    "duration": 0.001168,
    "status": "PASSED"
   },
   "oelib.fs_uuid.TestReplaceRootfsUuid.test_replaces_systemd_boot_options_line": {
    "duration": 0.001366,
    "status": "PASSED"
   },
   "oelib.license.TestComplexCombinations.test_tests": {
    "duration": 0.002557,
    "status": "PASSED"
   },
   "oelib.license.TestIsIncluded.test_tests": {
    "duration": 0.003363,
    "status": "PASSED"
   },
   "oelib.license.TestSimpleCombinations.test_tests": {
    "duration": 0.001172,
    "status": "PASSED"
   },
   "oelib.license.TestSingleLicense.test_invalid_licenses": {
    "duration": 0.0006418,
    "status": "PASSED"
   },
   "oelib.license.TestSingleLicense.test_single_licenses": {
    "duration": 0.0005035,
    "status": "PASSED"
   },
   "oelib.license.TestSort.test_sort": {
    "duration": 0.01286,
    "status": "PASSED"
   },
   "oelib.package.TestCopyDebugSources.test_copydebugsources_copies_files_and_dereferences_links": {
    "duration": 0.01038,
    "status": "PASSED"
   },
   "oelib.package.TestCopyDebugSources.test_copydebugsources_ignores_copy_failure": {
    "duration": 0.003634,
    "status": "PASSED"
   },
   "oelib.package.TestCopyDebugSources.test_copydebugsources_ignores_empty_externalsrc_relocation": {
    "duration": 0.00501,
    "status": "PASSED"
   },
   "oelib.package.TestCopyDebugSources.test_copydebugsources_moves_externalsrc_relocation": {
    "duration": 0.005675,
    "status": "PASSED"
   },
   "oelib.package.TestCopyDebugSources.test_copydebugsources_recovers_kernel_source_files": {
    "duration": 0.005632,
    "status": "PASSED"
   },
   "oelib.patch.TestGitApplyTree.test_dirty_push_run_false_returns_argv": {
    "duration": 0.2676,
    "status": "PASSED"
   },
   "oelib.patch.TestGitApplyTree.test_fallback_preserves_original_patch_name": {
    "duration": 0.6589,
    "status": "PASSED"
   },
   "oelib.patch.TestGitApplyTree.test_git_am_preserves_original_patch_name": {
    "duration": 0.5321,
    "status": "PASSED"
   },
   "oelib.patch.TestGitApplyTree.test_push_run_false_returns_argv": {
    "duration": 0.3885,
    "status": "PASSED"
   },
   "oelib.patch.TestPatchTree.test_push_run_false_returns_argv": {
    "duration": 0.00466,
    "status": "PASSED"
   },
   "oelib.patch.TestRunCmd.test_runcmd_allows_explicit_shell": {
    "duration": 0.001609,
    "status": "PASSED"
   },
   "oelib.patch.TestRunCmd.test_runcmd_preserves_argv_elements": {
    "duration": 0.01892,
    "status": "PASSED"
   },
   "oelib.patch.TestRunCmd.test_runcmd_reports_exit_status": {
    "duration": 0.01733,
    "status": "PASSED"
   },
   "oelib.patch.TestRunCmd.test_runcmd_wraps_exec_failure": {
    "duration": 0.0006275,
    "status": "PASSED"
   },
   "oelib.path.TestRealPath.test_loop": {
    "duration": 0.005887,
    "status": "PASSED"
   },
   "oelib.path.TestRealPath.test_norm": {
    "duration": 0.003978,
    "status": "PASSED"
   },
   "oelib.path.TestRealPath.test_phys": {
    "duration": 0.002119,
    "status": "PASSED"
   },
   "oelib.types.TestBooleanType.test_bool_equality": {
    "duration": 0.0005827,
    "status": "PASSED"
   },
   "oelib.types.TestBooleanType.test_false": {
    "duration": 0.0005922,
    "status": "PASSED"
   },
   "oelib.types.TestBooleanType.test_invalid": {
    "duration": 0.0007861,
    "status": "PASSED"
   },
   "oelib.types.TestBooleanType.test_true": {
    "duration": 0.000885,
    "status": "PASSED"
   },
   "oelib.types.TestList.test_list_nosep": {
    "duration": 0.0007801,
    "status": "PASSED"
   },
   "oelib.types.TestList.test_list_usersep": {
    "duration": 0.0007932,
    "status": "PASSED"
   },
   "oelib.utils.TestDefaultFeatures.test_filter_default_features": {
    "duration": 0.0004649,
    "status": "PASSED"
   },
   "oelib.utils.TestMultiprocessLaunch.test_multiprocesslaunch": {
    "duration": 0.06573,
    "status": "PASSED"
   },
   "oelib.utils.TestPackagesFilterOutSystem.test_filter": {
    "duration": 0.001649,
    "status": "PASSED"
   },
   "oelib.utils.TestTrimVersion.test_num_exception": {
    "duration": 0.0003161,
    "status": "PASSED"
   },
   "oelib.utils.TestTrimVersion.test_valid": {
    "duration": 0.0003247,
    "status": "PASSED"
   },
   "oelib.utils.TestTrimVersion.test_version_exception": {
    "duration": 0.0003433,
    "status": "PASSED"
   },
   "oescripts.OEGitproxyTests.test_oegitproxy_help": {
    "duration": 0.5592,
    "status": "PASSED"
   },
   "oescripts.OEGitproxyTests.test_oegitproxy_proxy": {
    "duration": 0.1616,
    "status": "PASSED"
   },
   "oescripts.OEGitproxyTests.test_oegitproxy_proxy_dash": {
    "duration": 0.2021,
    "status": "PASSED"
   },
   "oescripts.OEListPackageconfigTests.test_packageconfig_flags_default": {
    "duration": 214.928,
    "status": "PASSED"
   },
   "oescripts.OEListPackageconfigTests.test_packageconfig_flags_help": {
    "duration": 0.2318,
    "status": "PASSED"
   },
   "oescripts.OEListPackageconfigTests.test_packageconfig_flags_option_all": {
    "duration": 249.437,
    "status": "PASSED"
   },
   "oescripts.OEListPackageconfigTests.test_packageconfig_flags_option_flags": {
    "duration": 276.257,
    "status": "PASSED"
   },
   "oescripts.OEListPackageconfigTests.test_packageconfig_flags_options_preferred_only": {
    "duration": 296.823,
    "status": "PASSED"
   },
   "oescripts.OEPybootchartguyTests.test_pybootchartguy_help": {
    "duration": 0.2506,
    "status": "PASSED"
   },
   "oescripts.OEPybootchartguyTests.test_pybootchartguy_to_generate_build_pdf_output": {
    "duration": 0.2962,
    "status": "PASSED"
   },
   "oescripts.OEPybootchartguyTests.test_pybootchartguy_to_generate_build_png_output": {
    "duration": 0.478,
    "status": "PASSED"
   },
   "oescripts.OEPybootchartguyTests.test_pybootchartguy_to_generate_build_svg_output": {
    "duration": 0.2101,
    "status": "PASSED"
   },
   "oescripts.OeRunNativeTest.test_oe_run_native": {
    "duration": 14.498,
    "status": "PASSED"
   },
   "overlayfs.OverlayFSEtcRunTimeTests.test_all_required_variables_set": {
    "duration": 935.656,
    "oetags": [
     "runqemu"
    ],
    "status": "PASSED"
   },
   "overlayfs.OverlayFSEtcRunTimeTests.test_image_feature_conflict": {
    "duration": 37.429,
    "oetags": [
     "runqemu"
    ],
    "status": "PASSED"
   },
   "overlayfs.OverlayFSEtcRunTimeTests.test_image_feature_is_missing": {
    "duration": 107.316,
    "oetags": [
     "runqemu"
    ],
    "status": "PASSED"
   },
   "overlayfs.OverlayFSEtcRunTimeTests.test_lower_layer_access": {
    "duration": 265.995,
    "oetags": [
     "runqemu"
    ],
    "status": "PASSED"
   },
   "overlayfs.OverlayFSEtcRunTimeTests.test_postinst_on_target_for_read_only_rootfs": {
    "duration": 106.797,
    "oetags": [
     "runqemu"
    ],
    "status": "PASSED"
   },
   "overlayfs.OverlayFSEtcRunTimeTests.test_sbin_init_original": {
    "duration": 115.935,
    "oetags": [
     "runqemu"
    ],
    "status": "PASSED"
   },
   "overlayfs.OverlayFSEtcRunTimeTests.test_sbin_init_preinit": {
    "duration": 123.346,
    "oetags": [
     "runqemu"
    ],
    "status": "PASSED"
   },
   "overlayfs.OverlayFSEtcRunTimeTests.test_sbin_init_read_only": {
    "duration": 127.425,
    "oetags": [
     "runqemu"
    ],
    "status": "PASSED"
   },
   "overlayfs.OverlayFSTests.test_correct_image_fstab": {
    "duration": 96.164,
    "oetags": [
     "runqemu"
    ],
    "status": "PASSED"
   },
   "overlayfs.OverlayFSTests.test_correct_image_unit": {
    "duration": 67.016,
    "oetags": [
     "runqemu"
    ],
    "status": "PASSED"
   },
   "overlayfs.OverlayFSTests.test_distro_features_missing": {
    "duration": 22.861,
    "status": "PASSED"
   },
   "overlayfs.OverlayFSTests.test_mount_unit_not_set": {
    "duration": 15.171,
    "status": "PASSED"
   },
   "overlayfs.OverlayFSTests.test_not_all_units_installed": {
    "duration": 64.015,
    "status": "PASSED"
   },
   "overlayfs.OverlayFSTests.test_not_all_units_installed_but_qa_skipped": {
    "duration": 71.846,
    "status": "PASSED"
   },
   "overlayfs.OverlayFSTests.test_wrong_mount_unit_set": {
    "duration": 16.437,
    "status": "PASSED"
   },
   "package.PackageKeepSections.test_package_keep_sections": {
    "duration": 248.229,
    "status": "PASSED"
   },
   "package.PackageTests.test_gdb_hardlink_debug": {
    "duration": 87.066,
    "status": "PASSED"
   },
   "package.PackageTests.test_package_name_conflict": {
    "duration": 18.572,
    "status": "PASSED"
   },
   "package.PackageTests.test_preserve_ownership": {
    "duration": 72.03,
    "status": "PASSED"
   },
   "package.PackageTests.test_preserve_sparse_hardlinks": {
    "duration": 36.148,
    "status": "PASSED"
   },
   "package.VersionOrdering.test_dpkg": {
    "duration": 0.03591,
    "status": "PASSED"
   },
   "package.VersionOrdering.test_opkg": {
    "duration": 0.04481,
    "status": "PASSED"
   },
   "package.VersionOrdering.test_rpm": {
    "duration": 0.2742,
    "status": "PASSED"
   },
   "picolibc.PicolibcTest.test_picolibc": {
    "duration": 0.6822,
    "log": "This test only works with machines : qemuarm qemuarm64 qemuriscv32 qemuriscv64\n",
    "status": "SKIPPED"
   },
   "pkgdata.OePkgdataUtilTests.test_find_path": {
    "duration": 2.079,
    "status": "PASSED"
   },
   "pkgdata.OePkgdataUtilTests.test_glob": {
    "duration": 2.873,
    "status": "PASSED"
   },
   "pkgdata.OePkgdataUtilTests.test_list_pkg_files": {
    "duration": 8.084,
    "status": "PASSED"
   },
   "pkgdata.OePkgdataUtilTests.test_list_pkgs": {
    "duration": 8.24,
    "status": "PASSED"
   },
   "pkgdata.OePkgdataUtilTests.test_lookup_pkg": {
    "duration": 5.857,
    "status": "PASSED"
   },
   "pkgdata.OePkgdataUtilTests.test_lookup_recipe": {
    "duration": 2.996,
    "status": "PASSED"
   },
   "pkgdata.OePkgdataUtilTests.test_multilib_variables": {
    "duration": 1500.687,
    "status": "PASSED"
   },
   "pkgdata.OePkgdataUtilTests.test_no_param": {
    "duration": 0.04821,
    "status": "PASSED"
   },
   "pkgdata.OePkgdataUtilTests.test_read_value": {
    "duration": 2.807,
    "status": "PASSED"
   },
   "pkgdata.OePkgdataUtilTests.test_specify_pkgdatadir": {
    "duration": 1.22,
    "status": "PASSED"
   },
   "pokybleeding.PokyBleeding.test_poky_bleeding_autorev": {
    "duration": 69.688,
    "status": "PASSED"
   },
   "prservice.BitbakePrTests.test_import_export_override_db": {
    "duration": 711.402,
    "status": "PASSED"
   },
   "prservice.BitbakePrTests.test_import_export_replace_db": {
    "duration": 124.25,
    "status": "PASSED"
   },
   "prservice.BitbakePrTests.test_pr_service_deb_arch_dep": {
    "duration": 98.456,
    "status": "PASSED"
   },
   "prservice.BitbakePrTests.test_pr_service_deb_arch_indep": {
    "duration": 37.0,
    "status": "PASSED"
   },
   "prservice.BitbakePrTests.test_pr_service_ipk_arch_dep": {
    "duration": 105.89,
    "status": "PASSED"
   },
   "prservice.BitbakePrTests.test_pr_service_ipk_arch_indep": {
    "duration": 31.891,
    "status": "PASSED"
   },
   "prservice.BitbakePrTests.test_pr_service_rpm_arch_dep": {
    "duration": 69.467,
    "status": "PASSED"
   },
   "prservice.BitbakePrTests.test_pr_service_rpm_arch_indep": {
    "duration": 34.192,
    "status": "PASSED"
   },
   "prservice.BitbakePrTests.test_stopping_prservice_message": {
    "duration": 0.7387,
    "status": "PASSED"
   },
   "pseudo.Pseudo.test_pseudo_pyc_creation": {
    "duration": 11.4,
    "status": "PASSED"
   },
   "recipetool.RecipetoolAppendTests.test_recipetool_appendfile_add": {
    "duration": 75.741,
    "status": "PASSED"
   },
   "recipetool.RecipetoolAppendTests.test_recipetool_appendfile_add_bindir": {
    "duration": 28.515,
    "status": "PASSED"
   },
   "recipetool.RecipetoolAppendTests.test_recipetool_appendfile_add_machine": {
    "duration": 24.245,
    "status": "PASSED"
   },
   "recipetool.RecipetoolAppendTests.test_recipetool_appendfile_alternatives": {
    "duration": 29.691,
    "status": "PASSED"
   },
   "recipetool.RecipetoolAppendTests.test_recipetool_appendfile_basic": {
    "duration": 27.551,
    "status": "PASSED"
   },
   "recipetool.RecipetoolAppendTests.test_recipetool_appendfile_binary": {
    "duration": 16.336,
    "status": "PASSED"
   },
   "recipetool.RecipetoolAppendTests.test_recipetool_appendfile_extlayer": {
    "duration": 6.419,
    "status": "PASSED"
   },
   "recipetool.RecipetoolAppendTests.test_recipetool_appendfile_inst_func": {
    "duration": 28.613,
    "status": "PASSED"
   },
   "recipetool.RecipetoolAppendTests.test_recipetool_appendfile_inst_glob": {
    "duration": 33.021,
    "status": "PASSED"
   },
   "recipetool.RecipetoolAppendTests.test_recipetool_appendfile_inst_todir_glob": {
    "duration": 32.471,
    "status": "PASSED"
   },
   "recipetool.RecipetoolAppendTests.test_recipetool_appendfile_invalid": {
    "duration": 31.071,
    "status": "PASSED"
   },
   "recipetool.RecipetoolAppendTests.test_recipetool_appendfile_orig": {
    "duration": 33.062,
    "status": "PASSED"
   },
   "recipetool.RecipetoolAppendTests.test_recipetool_appendfile_patch": {
    "duration": 32.086,
    "status": "PASSED"
   },
   "recipetool.RecipetoolAppendTests.test_recipetool_appendfile_postinstall": {
    "duration": 35.436,
    "status": "PASSED"
   },
   "recipetool.RecipetoolAppendTests.test_recipetool_appendfile_renamed": {
    "duration": 29.528,
    "status": "PASSED"
   },
   "recipetool.RecipetoolAppendTests.test_recipetool_appendfile_script": {
    "duration": 32.691,
    "status": "PASSED"
   },
   "recipetool.RecipetoolAppendTests.test_recipetool_appendfile_subdir": {
    "duration": 28.702,
    "status": "PASSED"
   },
   "recipetool.RecipetoolAppendTests.test_recipetool_appendfile_todir": {
    "duration": 31.325,
    "status": "PASSED"
   },
   "recipetool.RecipetoolAppendTests.test_recipetool_appendfile_wildcard": {
    "duration": 13.845,
    "status": "PASSED"
   },
   "recipetool.RecipetoolAppendsrcTests.test_recipetool_appendsrcfile_basic": {
    "duration": 76.922,
    "status": "PASSED"
   },
   "recipetool.RecipetoolAppendsrcTests.test_recipetool_appendsrcfile_basic_wildcard": {
    "duration": 50.774,
    "status": "PASSED"
   },
   "recipetool.RecipetoolAppendsrcTests.test_recipetool_appendsrcfile_existing_in_src_uri": {
    "duration": 22.168,
    "status": "PASSED"
   },
   "recipetool.RecipetoolAppendsrcTests.test_recipetool_appendsrcfile_existing_in_src_uri_diff_params": {
    "duration": 22.125,
    "status": "PASSED"
   },
   "recipetool.RecipetoolAppendsrcTests.test_recipetool_appendsrcfile_machine": {
    "duration": 58.861,
    "status": "PASSED"
   },
   "recipetool.RecipetoolAppendsrcTests.test_recipetool_appendsrcfile_replace_file_srcdir": {
    "duration": 37.914,
    "status": "PASSED"
   },
   "recipetool.RecipetoolAppendsrcTests.test_recipetool_appendsrcfile_srcdir_basic": {
    "duration": 25.187,
    "status": "PASSED"
   },
   "recipetool.RecipetoolAppendsrcTests.test_recipetool_appendsrcfile_subdir_basic": {
    "duration": 37.238,
    "status": "PASSED"
   },
   "recipetool.RecipetoolAppendsrcTests.test_recipetool_appendsrcfile_subdir_basic_dirdest": {
    "duration": 37.113,
    "status": "PASSED"
   },
   "recipetool.RecipetoolAppendsrcTests.test_recipetool_appendsrcfile_update_recipe_basic": {
    "duration": 10.23,
    "status": "PASSED"
   },
   "recipetool.RecipetoolAppendsrcTests.test_recipetool_appendsrcfiles_basic": {
    "duration": 51.527,
    "status": "PASSED"
   },
   "recipetool.RecipetoolAppendsrcTests.test_recipetool_appendsrcfiles_basic_subdir": {
    "duration": 49.806,
    "status": "PASSED"
   },
   "recipetool.RecipetoolCreateTests.test_recipetool_create": {
    "duration": 31.281,
    "status": "PASSED"
   },
   "recipetool.RecipetoolCreateTests.test_recipetool_create_autotools": {
    "duration": 69.145,
    "status": "PASSED"
   },
   "recipetool.RecipetoolCreateTests.test_recipetool_create_cmake": {
    "duration": 27.987,
    "status": "PASSED"
   },
   "recipetool.RecipetoolCreateTests.test_recipetool_create_git_http": {
    "duration": 27.92,
    "status": "PASSED"
   },
   "recipetool.RecipetoolCreateTests.test_recipetool_create_git_srcbranch": {
    "duration": 27.731,
    "status": "PASSED"
   },
   "recipetool.RecipetoolCreateTests.test_recipetool_create_git_srcuri_branch": {
    "duration": 28.531,
    "status": "PASSED"
   },
   "recipetool.RecipetoolCreateTests.test_recipetool_create_git_srcuri_master": {
    "duration": 28.705,
    "status": "PASSED"
   },
   "recipetool.RecipetoolCreateTests.test_recipetool_create_github": {
    "duration": 32.77,
    "status": "PASSED"
   },
   "recipetool.RecipetoolCreateTests.test_recipetool_create_github_tarball": {
    "duration": 32.534,
    "status": "PASSED"
   },
   "recipetool.RecipetoolCreateTests.test_recipetool_create_go": {
    "duration": 43.639,
    "status": "PASSED"
   },
   "recipetool.RecipetoolCreateTests.test_recipetool_create_npm": {
    "duration": 1.534,
    "log": "Test needs meta-oe for nodejs\n",
    "status": "SKIPPED"
   },
   "recipetool.RecipetoolCreateTests.test_recipetool_create_python3_pep517_flit_core_buildapi": {
    "duration": 30.695,
    "status": "PASSED"
   },
   "recipetool.RecipetoolCreateTests.test_recipetool_create_python3_pep517_hatchling": {
    "duration": 33.612,
    "status": "PASSED"
   },
   "recipetool.RecipetoolCreateTests.test_recipetool_create_python3_pep517_maturin": {
    "duration": 30.178,
    "status": "PASSED"
   },
   "recipetool.RecipetoolCreateTests.test_recipetool_create_python3_pep517_mesonpy": {
    "duration": 30.009,
    "status": "PASSED"
   },
   "recipetool.RecipetoolCreateTests.test_recipetool_create_python3_pep517_poetry_core_masonry_api": {
    "duration": 30.559,
    "status": "PASSED"
   },
   "recipetool.RecipetoolCreateTests.test_recipetool_create_python3_pep517_setuptools_build_meta": {
    "duration": 28.248,
    "status": "PASSED"
   },
   "recipetool.RecipetoolCreateTests.test_recipetool_create_python3_pep517_setuptools_build_meta_license_pep639": {
    "duration": 28.411,
    "status": "PASSED"
   },
   "recipetool.RecipetoolCreateTests.test_recipetool_create_python3_pep517_setuptools_build_meta_license_prepep639": {
    "duration": 30.601,
    "status": "PASSED"
   },
   "recipetool.RecipetoolCreateTests.test_recipetool_create_python3_setuptools": {
    "duration": 27.034,
    "status": "PASSED"
   },
   "recipetool.RecipetoolCreateTests.test_recipetool_create_python3_setuptools_pypi": {
    "duration": 53.359,
    "status": "PASSED"
   },
   "recipetool.RecipetoolCreateTests.test_recipetool_create_python3_setuptools_pypi_tarball": {
    "duration": 30.741,
    "status": "PASSED"
   },
   "recipetool.RecipetoolCreateTests.test_recipetool_create_simple": {
    "duration": 29.226,
    "status": "PASSED"
   },
   "recipetool.RecipetoolTests.test_recipetool_handle_license_vars": {
    "duration": 1.7,
    "status": "PASSED"
   },
   "recipetool.RecipetoolTests.test_recipetool_load_plugin": {
    "duration": 9.844,
    "status": "PASSED"
   },
   "recipetool.RecipetoolTests.test_recipetool_split_pkg_licenses": {
    "duration": 0.01076,
    "status": "PASSED"
   },
   "recipeutils.RecipeUtilsTests.test_patch_recipe_appends": {
    "duration": 0.06783,
    "status": "PASSED"
   },
   "recipeutils.RecipeUtilsTests.test_patch_recipe_singleappend": {
    "duration": 0.05755,
    "status": "PASSED"
   },
   "recipeutils.RecipeUtilsTests.test_patch_recipe_varflag": {
    "duration": 0.06689,
    "status": "PASSED"
   },
   "recipeutils.RecipeUtilsTests.test_split_var_value": {
    "duration": 0.006619,
    "status": "PASSED"
   },
   "recipeutils.RecipeUtilsTests.test_validate_pn": {
    "duration": 0.006523,
    "status": "PASSED"
   },
   "reproducible.DiffoscopeTests.test_diffoscope": {
    "log": "Skip by the command line argument \"reproducible\"\n",
    "status": "SKIPPED"
   },
   "reproducible.ReproducibleTests.test_reproducible_builds": {
    "log": "Skip by the command line argument \"reproducible\"\n",
    "status": "SKIPPED"
   },
   "resulttooltests.ResultToolTests.test_can_compare_ltp_tests": {
    "duration": 0.009581,
    "status": "PASSED"
   },
   "resulttooltests.ResultToolTests.test_can_match_non_static_ptest_names": {
    "duration": 0.007114,
    "status": "PASSED"
   },
   "resulttooltests.ResultToolTests.test_can_not_compare_non_ltp_tests": {
    "duration": 0.008716,
    "status": "PASSED"
   },
   "resulttooltests.ResultToolTests.test_durations_build_rows_computes_consecutive_pairs_only": {
    "duration": 0.007111,
    "status": "PASSED"
   },
   "resulttooltests.ResultToolTests.test_durations_build_rows_suppresses_pct_when_both_runs_round_to_zero": {
    "duration": 0.006453,
    "status": "PASSED"
   },
   "resulttooltests.ResultToolTests.test_durations_build_tables_hides_short_tests_by_default": {
    "duration": 0.007319,
    "status": "PASSED"
   },
   "resulttooltests.ResultToolTests.test_durations_build_tables_orders_short_tables_after_all_main_tables": {
    "duration": 0.006952,
    "status": "PASSED"
   },
   "resulttooltests.ResultToolTests.test_durations_filter_sort_rows_limit_applies_after_sort": {
    "duration": 0.00631,
    "status": "PASSED"
   },
   "resulttooltests.ResultToolTests.test_durations_filter_sort_rows_sort_by_delta_orders_by_largest_change": {
    "duration": 0.006182,
    "status": "PASSED"
   },
   "resulttooltests.ResultToolTests.test_durations_filter_sort_rows_threshold_checks_every_pair_not_just_first": {
    "duration": 0.006172,
    "status": "PASSED"
   },
   "resulttooltests.ResultToolTests.test_durations_filter_sort_rows_threshold_ignores_suppressed_none_pct": {
    "duration": 0.006224,
    "status": "PASSED"
   },
   "resulttooltests.ResultToolTests.test_durations_filter_sort_rows_threshold_keeps_rows_above_it": {
    "duration": 0.006124,
    "status": "PASSED"
   },
   "resulttooltests.ResultToolTests.test_durations_filter_sort_rows_threshold_zero_disables_filtering": {
    "duration": 0.0061,
    "status": "PASSED"
   },
   "resulttooltests.ResultToolTests.test_durations_get_durations_extracts_testcase_and_suite_durations": {
    "duration": 0.006181,
    "status": "PASSED"
   },
   "resulttooltests.ResultToolTests.test_durations_parse_report_log_extracts_time_column": {
    "duration": 0.006602,
    "status": "PASSED"
   },
   "resulttooltests.ResultToolTests.test_junit_empty_testresults": {
    "duration": 0.007001,
    "status": "PASSED"
   },
   "resulttooltests.ResultToolTests.test_junit_log_attached": {
    "duration": 0.009999,
    "status": "PASSED"
   },
   "resulttooltests.ResultToolTests.test_junit_log_inline": {
    "duration": 0.006499,
    "status": "PASSED"
   },
   "resulttooltests.ResultToolTests.test_junit_missing_image_tests": {
    "duration": 0.006261,
    "status": "PASSED"
   },
   "resulttooltests.ResultToolTests.test_junit_missing_ptests": {
    "duration": 0.006298,
    "status": "PASSED"
   },
   "resulttooltests.ResultToolTests.test_machine_matches": {
    "duration": 0.006063,
    "status": "PASSED"
   },
   "resulttooltests.ResultToolTests.test_machine_mismatches": {
    "duration": 0.006111,
    "status": "PASSED"
   },
   "resulttooltests.ResultToolTests.test_merge_can_merged_results": {
    "duration": 0.006165,
    "status": "PASSED"
   },
   "resulttooltests.ResultToolTests.test_metadata_matching_is_only_checked_for_relevant_test_type": {
    "duration": 0.006069,
    "status": "PASSED"
   },
   "resulttooltests.ResultToolTests.test_regression_can_get_regression_base_target_pair": {
    "duration": 0.006075,
    "status": "PASSED"
   },
   "resulttooltests.ResultToolTests.test_regression_can_get_regression_result": {
    "duration": 0.006274,
    "status": "PASSED"
   },
   "resulttooltests.ResultToolTests.test_report_can_aggregate_test_result": {
    "duration": 0.006285,
    "status": "PASSED"
   },
   "resulttooltests.ResultToolTests.test_results_with_matching_metadata_can_be_compared": {
    "duration": 0.007303,
    "status": "PASSED"
   },
   "resulttooltests.ResultToolTests.test_results_with_mismatching_metadata_can_not_be_compared": {
    "duration": 0.006094,
    "status": "PASSED"
   },
   "resulttooltests.ResultToolTests.test_results_without_metadata_can_be_compared": {
    "duration": 0.006216,
    "status": "PASSED"
   },
   "resulttooltests.ResultToolTests.test_target_result_with_missing_metadata_can_not_be_compared": {
    "duration": 0.006028,
    "status": "PASSED"
   },
   "retain.Retain.test_retain_always": {
    "duration": 35.172,
    "status": "PASSED"
   },
   "retain.Retain.test_retain_failure": {
    "duration": 45.924,
    "status": "PASSED"
   },
   "retain.Retain.test_retain_global": {
    "duration": 72.941,
    "status": "PASSED"
   },
   "retain.Retain.test_retain_misc": {
    "duration": 79.649,
    "status": "PASSED"
   },
   "rootfspostcommandstests.ShadowUtilsTidyFiles.test_shadowutils_backup_files": {
    "duration": 18.014,
    "log": "Testcase skipped as 'tidy_shadowutils_files' rootfs post process command is not the set SORT_PASSWD_POSTPROCESS_COMMAND.\n",
    "status": "SKIPPED"
   },
   "rootfspostcommandstests.ShadowUtilsTidyFiles.test_shadowutils_sorted_files": {
    "duration": 5.206,
    "log": "Testcase skipped as 'tidy_shadowutils_files' rootfs post process command is not the set SORT_PASSWD_POSTPROCESS_COMMAND.\n",
    "status": "SKIPPED"
   },
   "rpmtests.BitbakeTests.test_rpm_filenames": {
    "duration": 8.581,
    "status": "PASSED"
   },
   "runcmd.RunCmdTests.test_list_not_found": {
    "duration": 0.004674,
    "status": "PASSED"
   },
   "runcmd.RunCmdTests.test_list_okay": {
    "duration": 0.5595,
    "status": "PASSED"
   },
   "runcmd.RunCmdTests.test_log": {
    "duration": 0.006724,
    "status": "PASSED"
   },
   "runcmd.RunCmdTests.test_log_split": {
    "duration": 0.006209,
    "status": "PASSED"
   },
   "runcmd.RunCmdTests.test_no_shell": {
    "duration": 0.005841,
    "status": "PASSED"
   },
   "runcmd.RunCmdTests.test_output": {
    "duration": 0.006785,
    "status": "PASSED"
   },
   "runcmd.RunCmdTests.test_output_split": {
    "duration": 0.006426,
    "status": "PASSED"
   },
   "runcmd.RunCmdTests.test_result_assertion": {
    "duration": 0.01018,
    "status": "PASSED"
   },
   "runcmd.RunCmdTests.test_result_exception": {
    "duration": 0.007928,
    "status": "PASSED"
   },
   "runcmd.RunCmdTests.test_result_false": {
    "duration": 0.006407,
    "status": "PASSED"
   },
   "runcmd.RunCmdTests.test_result_okay": {
    "duration": 0.005573,
    "status": "PASSED"
   },
   "runcmd.RunCmdTests.test_shell": {
    "duration": 0.005588,
    "status": "PASSED"
   },
   "runcmd.RunCmdTests.test_stdin": {
    "duration": 0.005108,
    "status": "PASSED"
   },
   "runcmd.RunCmdTests.test_stdin_timeout": {
    "duration": 10.005,
    "status": "PASSED"
   },
   "runcmd.RunCmdTests.test_timeout": {
    "duration": 10.006,
    "status": "PASSED"
   },
   "runcmd.RunCmdTests.test_timeout_split": {
    "duration": 10.011,
    "status": "PASSED"
   },
   "runqemu.RunqemuTests.test_boot_compressed_wic_by_path": {
    "duration": 124.248,
    "oetags": [
     "runqemu"
    ],
    "status": "PASSED"
   },
   "runqemu.RunqemuTests.test_boot_compressed_wic_by_recipe": {
    "duration": 24.364,
    "oetags": [
     "runqemu"
    ],
    "status": "PASSED"
   },
   "runqemu.RunqemuTests.test_boot_deploy": {
    "duration": 21.264,
    "oetags": [
     "runqemu"
    ],
    "status": "PASSED"
   },
   "runqemu.RunqemuTests.test_boot_deploy_hddimg": {
    "duration": 20.916,
    "oetags": [
     "runqemu"
    ],
    "status": "PASSED"
   },
   "runqemu.RunqemuTests.test_boot_machine": {
    "duration": 22.534,
    "oetags": [
     "runqemu"
    ],
    "status": "PASSED"
   },
   "runqemu.RunqemuTests.test_boot_machine_ext4": {
    "duration": 21.698,
    "oetags": [
     "runqemu"
    ],
    "status": "PASSED"
   },
   "runqemu.RunqemuTests.test_boot_machine_iso": {
    "duration": 22.101,
    "oetags": [
     "runqemu"
    ],
    "status": "PASSED"
   },
   "runqemu.RunqemuTests.test_boot_machine_slirp": {
    "duration": 21.341,
    "oetags": [
     "runqemu"
    ],
    "status": "PASSED"
   },
   "runqemu.RunqemuTests.test_boot_machine_slirp_qcow2": {
    "duration": 21.887,
    "oetags": [
     "runqemu"
    ],
    "status": "PASSED"
   },
   "runqemu.RunqemuTests.test_boot_qemu_boot": {
    "duration": 19.742,
    "oetags": [
     "runqemu"
    ],
    "status": "PASSED"
   },
   "runqemu.RunqemuTests.test_boot_recipe_image": {
    "duration": 26.26,
    "oetags": [
     "runqemu"
    ],
    "status": "PASSED"
   },
   "runqemu.RunqemuTests.test_boot_recipe_image_vdi": {
    "duration": 24.817,
    "oetags": [
     "runqemu"
    ],
    "status": "PASSED"
   },
   "runqemu.RunqemuTests.test_boot_recipe_image_vmdk": {
    "duration": 24.186,
    "oetags": [
     "runqemu"
    ],
    "status": "PASSED"
   },
   "runqemu.RunqemuTests.test_boot_rootfs": {
    "duration": 19.214,
    "oetags": [
     "runqemu"
    ],
    "status": "PASSED"
   },
   "runtime_test.Postinst.test_failing_postinst": {
    "duration": 204.426,
    "oetags": [
     "runqemu"
    ],
    "status": "PASSED"
   },
   "runtime_test.Postinst.test_postinst_rootfs_and_boot_systemd": {
    "duration": 325.343,
    "oetags": [
     "runqemu"
    ],
    "status": "PASSED"
   },
   "runtime_test.Postinst.test_postinst_rootfs_and_boot_sysvinit": {
    "duration": 209.238,
    "oetags": [
     "runqemu"
    ],
    "status": "PASSED"
   },
   "runtime_test.RustKernel.test_kernel_rust_sample": {
    "duration": 621.561,
    "oetags": [
     "runqemu"
    ],
    "status": "PASSED"
   },
   "runtime_test.SystemTap.test_crosstap_helloworld": {
    "duration": 426.067,
    "oetags": [
     "runqemu"
    ],
    "status": "PASSED"
   },
   "runtime_test.SystemTap.test_crosstap_pstree": {
    "duration": 46.109,
    "oetags": [
     "runqemu"
    ],
    "status": "PASSED"
   },
   "runtime_test.SystemTap.test_crosstap_syscalls_by_pid": {
    "duration": 44.645,
    "oetags": [
     "runqemu"
    ],
    "status": "PASSED"
   },
   "runtime_test.SystemTap.test_crosstap_syscalls_by_proc": {
    "duration": 50.763,
    "oetags": [
     "runqemu"
    ],
    "status": "PASSED"
   },
   "runtime_test.TestExport.test_testexport_basic": {
    "duration": 137.48,
    "oetags": [
     "runqemu"
    ],
    "status": "PASSED"
   },
   "runtime_test.TestExport.test_testexport_sdk": {
    "duration": 135.167,
    "status": "PASSED"
   },
   "runtime_test.TestImage.test_testimage_apt": {
    "duration": 179.198,
    "oetags": [
     "runqemu"
    ],
    "status": "PASSED"
   },
   "runtime_test.TestImage.test_testimage_dnf": {
    "duration": 131.524,
    "oetags": [
     "runqemu"
    ],
    "status": "PASSED"
   },
   "runtime_test.TestImage.test_testimage_install": {
    "duration": 128.409,
    "oetags": [
     "runqemu"
    ],
    "status": "PASSED"
   },
   "runtime_test.TestImage.test_testimage_slirp": {
    "duration": 102.432,
    "oetags": [
     "runqemu"
    ],
    "status": "PASSED"
   },
   "runtime_test.TestImage.test_testimage_virgl_gtk_sdl": {
    "duration": 572.9,
    "oetags": [
     "runqemu"
    ],
    "status": "PASSED"
   },
   "runtime_test.TestImage.test_testimage_virgl_headless": {
    "duration": 79.366,
    "oetags": [
     "runqemu"
    ],
    "status": "PASSED"
   },
   "rust.RustStaticMuslTest.test_static_musl_linking": {
    "duration": 74.414,
    "status": "PASSED"
   },
   "sdk.SDKTests.test_sdk_manifests": {
    "duration": 442.1,
    "status": "PASSED"
   },
   "sdk.SDKTests.test_sdk_runqemu": {
    "duration": 475.976,
    "status": "PASSED"
   },
   "selftest.ExternalLayer.test_list_imported": {
    "duration": 0.01384,
    "status": "PASSED"
   },
   "signing.LockedSignatures.test_locked_signatures": {
    "duration": 112.443,
    "status": "PASSED"
   },
   "signing.Signing.test_signing_packages": {
    "duration": 1567.254,
    "status": "PASSED"
   },
   "signing.Signing.test_signing_sstate_archive": {
    "duration": 124.959,
    "status": "PASSED"
   },
   "spdx.SPDX30Check.test_baremetal_helloworld": {
    "duration": 60.896,
    "status": "PASSED"
   },
   "spdx.SPDX30Check.test_base_files": {
    "duration": 44.736,
    "status": "PASSED"
   },
   "spdx.SPDX30Check.test_core_image_minimal": {
    "duration": 59.263,
    "status": "PASSED"
   },
   "spdx.SPDX30Check.test_core_image_minimal_sdk": {
    "duration": 361.705,
    "status": "PASSED"
   },
   "spdx.SPDX30Check.test_custom_annotation_vars": {
    "duration": 34.603,
    "status": "PASSED"
   },
   "spdx.SPDX30Check.test_download_location_defensive_handling": {
    "duration": 15.108,
    "status": "PASSED"
   },
   "spdx.SPDX30Check.test_extra_opts": {
    "duration": 249.047,
    "status": "PASSED"
   },
   "spdx.SPDX30Check.test_gcc_include_source": {
    "duration": 2345.092,
    "status": "PASSED"
   },
   "spdx.SPDX30Check.test_kernel_config_spdx": {
    "duration": 40.241,
    "status": "PASSED"
   },
   "spdx.SPDX30Check.test_packageconfig_spdx": {
    "duration": 47.446,
    "status": "PASSED"
   },
   "spdx.SPDX30Check.test_version_extraction_patterns": {
    "duration": 11.049,
    "status": "PASSED"
   },
   "spdx.SPDX30Check.test_world_sbom": {
    "duration": 26.512,
    "status": "PASSED"
   },
   "sstatetests.SStateCacheManagement.test_sstate_cache_management_script_using_machine": {
    "duration": 133.6,
    "status": "PASSED"
   },
   "sstatetests.SStateCacheManagement.test_sstate_cache_management_script_using_pr_1": {
    "duration": 128.425,
    "status": "PASSED"
   },
   "sstatetests.SStateCacheManagement.test_sstate_cache_management_script_using_pr_2": {
    "duration": 202.971,
    "status": "PASSED"
   },
   "sstatetests.SStateCacheManagement.test_sstate_cache_management_script_using_pr_3": {
    "duration": 254.557,
    "status": "PASSED"
   },
   "sstatetests.SStateCleanup.test_cleansstate_task_distro_nonspecific": {
    "duration": 43.687,
    "status": "PASSED"
   },
   "sstatetests.SStateCleanup.test_cleansstate_task_distro_specific": {
    "duration": 49.098,
    "status": "PASSED"
   },
   "sstatetests.SStateCleanup.test_cleansstate_task_distro_specific_nonspecific": {
    "duration": 50.697,
    "status": "PASSED"
   },
   "sstatetests.SStateCreation.test_sstate_creation_distro_nonspecific": {
    "duration": 29.658,
    "status": "PASSED"
   },
   "sstatetests.SStateCreation.test_sstate_creation_distro_specific": {
    "duration": 35.67,
    "status": "PASSED"
   },
   "sstatetests.SStateDistroTests.test_rebuild_distro_specific_sstate_cross_native_targets": {
    "duration": 42.525,
    "status": "PASSED"
   },
   "sstatetests.SStateDistroTests.test_rebuild_distro_specific_sstate_cross_target": {
    "duration": 42.472,
    "status": "PASSED"
   },
   "sstatetests.SStateDistroTests.test_rebuild_distro_specific_sstate_native_target": {
    "duration": 44.654,
    "status": "PASSED"
   },
   "sstatetests.SStateFindSiginfo.test_sstate_compare_sigfiles_and_find_siginfo": {
    "duration": 358.198,
    "status": "PASSED"
   },
   "sstatetests.SStateHashSameSigs.test_sstate_32_64_same_hash": {
    "duration": 100.594,
    "status": "PASSED"
   },
   "sstatetests.SStateHashSameSigs.test_sstate_nativelsbstring_same_hash": {
    "duration": 104.845,
    "status": "PASSED"
   },
   "sstatetests.SStateHashSameSigs.test_sstate_sdk_arch_same_hash": {
    "duration": 111.376,
    "status": "PASSED"
   },
   "sstatetests.SStateHashSameSigs2.test_sstate_allarch_samesigs": {
    "duration": 141.373,
    "status": "PASSED"
   },
   "sstatetests.SStateHashSameSigs2.test_sstate_nativesdk_samesigs_multilib": {
    "duration": 149.624,
    "status": "PASSED"
   },
   "sstatetests.SStateHashSameSigs3.test_sstate_multilib_or_not_native_samesigs": {
    "duration": 95.167,
    "status": "PASSED"
   },
   "sstatetests.SStateHashSameSigs3.test_sstate_sametune_samesigs": {
    "duration": 218.214,
    "status": "PASSED"
   },
   "sstatetests.SStateHashSameSigs4.test_sstate_movelayer_samesigs": {
    "duration": 83.978,
    "status": "PASSED"
   },
   "sstatetests.SStateHashSameSigs4.test_sstate_noop_samesigs": {
    "duration": 148.568,
    "status": "PASSED"
   },
   "sstatetests.SStatePrintdiff.test_gcc_runtime_vs_gcc_source": {
    "duration": 551.476,
    "status": "PASSED"
   },
   "sstatetests.SStatePrintdiff.test_image_minimal_vs_base_do_configure": {
    "duration": 667.886,
    "status": "PASSED"
   },
   "sstatetests.SStatePrintdiff.test_image_minimal_vs_perlcross": {
    "duration": 345.83,
    "status": "PASSED"
   },
   "sstatetests.SStateTests.test_autorev_sstate_works": {
    "duration": 72.939,
    "status": "PASSED"
   },
   "sysroot.SysrootTests.test_sysroot_cleanup": {
    "duration": 67.98,
    "status": "PASSED"
   },
   "sysroot.SysrootTests.test_sysroot_la": {
    "duration": 29.506,
    "status": "PASSED"
   },
   "sysroot.SysrootTests.test_sysroot_max_shebang": {
    "duration": 14.076,
    "status": "PASSED"
   },
   "sysroot.SysrootTests.test_sysroot_pkgconfig": {
    "duration": 28.59,
    "status": "PASSED"
   },
   "systemd_boot.Systemdboot.test_efi_systemdboot_images_can_be_built": {
    "duration": 254.519,
    "status": "PASSED"
   },
   "tinfoil.TinfoilTests.test_datastore_operations": {
    "duration": 1.458,
    "status": "PASSED"
   },
   "tinfoil.TinfoilTests.test_expand": {
    "duration": 0.5115,
    "status": "PASSED"
   },
   "tinfoil.TinfoilTests.test_getvar": {
    "duration": 1.02,
    "status": "PASSED"
   },
   "tinfoil.TinfoilTests.test_getvar_bb_origenv": {
    "duration": 1.014,
    "status": "PASSED"
   },
   "tinfoil.TinfoilTests.test_list_recipes": {
    "duration": 4.222,
    "status": "PASSED"
   },
   "tinfoil.TinfoilTests.test_parse_recipe": {
    "duration": 3.851,
    "status": "PASSED"
   },
   "tinfoil.TinfoilTests.test_parse_recipe_copy_expand": {
    "duration": 4.493,
    "status": "PASSED"
   },
   "tinfoil.TinfoilTests.test_parse_recipe_custom_data": {
    "duration": 3.904,
    "status": "PASSED"
   },
   "tinfoil.TinfoilTests.test_parse_virtual_recipe": {
    "duration": 4.859,
    "status": "PASSED"
   },
   "tinfoil.TinfoilTests.test_parse_virtual_recipe_custom_data": {
    "duration": 4.314,
    "status": "PASSED"
   },
   "tinfoil.TinfoilTests.test_run_prepared_task": {
    "duration": 56.148,
    "status": "PASSED"
   },
   "tinfoil.TinfoilTests.test_setvariable_clean": {
    "duration": 3.024,
    "status": "PASSED"
   },
   "tinfoil.TinfoilTests.test_variable_history": {
    "duration": 4.097,
    "status": "PASSED"
   },
   "tinfoil.TinfoilTests.test_wait_event": {
    "duration": 2.007,
    "status": "PASSED"
   },
   "toolchain.ToolchainTests.test_toolchain_switching": {
    "duration": 86.043,
    "status": "PASSED"
   },
   "uboot.UBootConfigTest.test_uboot_config_extract": {
    "duration": 18.846,
    "status": "PASSED"
   },
   "uboot.UBootConfigTest.test_uboot_config_extract_error_missing_config": {
    "duration": 15.333,
    "status": "PASSED"
   },
   "uboot.UBootConfigTest.test_uboot_config_extract_error_nothing_set": {
    "duration": 19.436,
    "status": "PASSED"
   },
   "uboot.UBootConfigTest.test_uboot_config_extract_error_set_both_config_and_machine": {
    "duration": 15.297,
    "status": "PASSED"
   },
   "uboot.UBootConfigTest.test_uboot_config_extract_error_set_uboot_config_binary": {
    "duration": 16.531,
    "status": "PASSED"
   },
   "uboot.UBootConfigTest.test_uboot_config_extract_error_set_uboot_config_fragments": {
    "duration": 16.393,
    "status": "PASSED"
   },
   "uboot.UBootConfigTest.test_uboot_config_extract_error_set_uboot_config_image_fstypes": {
    "duration": 16.795,
    "status": "PASSED"
   },
   "uboot.UBootConfigTest.test_uboot_config_extract_error_set_uboot_config_make_opts": {
    "duration": 16.691,
    "status": "PASSED"
   },
   "uboot.UBootConfigTest.test_uboot_config_extract_legacy": {
    "duration": 19.372,
    "status": "PASSED"
   },
   "uboot.UBootConfigTest.test_uboot_config_extract_single_config": {
    "duration": 19.687,
    "status": "PASSED"
   },
   "uboot.UBootTest.test_boot_uboot": {
    "duration": 0.001132,
    "log": "Test skipped on x86_64\n",
    "oetags": [
     "runqemu"
    ],
    "status": "SKIPPED"
   },
   "uboot.UBootTest.test_boot_uboot_kvm_to_full_target": {
    "duration": 0.001301,
    "log": "Test skipped on x86_64\n",
    "oetags": [
     "runqemu"
    ],
    "status": "SKIPPED"
   },
   "uboot.UBootTest.test_uboot_config_initial_env_binary": {
    "duration": 116.96,
    "status": "PASSED"
   },
   "uboot.UBootTest.test_uboot_initial_env_binary": {
    "duration": 126.509,
    "status": "PASSED"
   },
   "uki.UkiTest.test_uki_boot_systemd": {
    "duration": 820.469,
    "oetags": [
     "runqemu"
    ],
    "status": "PASSED"
   },
   "uki.UkiTest.test_uki_sysvinit": {
    "duration": 688.066,
    "oetags": [
     "runqemu"
    ],
    "status": "PASSED"
   },
   "usergrouptests.UserGroupTests.test_add_task_between_p_sysroot_and_package": {
    "duration": 25.426,
    "status": "PASSED"
   },
   "usergrouptests.UserGroupTests.test_group_from_dep_package": {
    "duration": 26.698,
    "status": "PASSED"
   },
   "usergrouptests.UserGroupTests.test_postinst_order": {
    "duration": 14.765,
    "status": "PASSED"
   },
   "usergrouptests.UserGroupTests.test_static_useradd_from_dynamic": {
    "duration": 81.989,
    "status": "PASSED"
   },
   "usergrouptests.UserGroupTests.test_useradd_depends_only": {
    "duration": 10.593,
    "status": "PASSED"
   },
   "wic.CLITests.test_createhelp": {
    "duration": 42.202,
    "status": "PASSED"
   },
   "wic.CLITests.test_help": {
    "duration": 3.312,
    "status": "PASSED"
   },
   "wic.CLITests.test_help_create": {
    "duration": 2.773,
    "status": "PASSED"
   },
   "wic.CLITests.test_help_kickstart": {
    "duration": 3.495,
    "status": "PASSED"
   },
   "wic.CLITests.test_help_list": {
    "duration": 3.5,
    "status": "PASSED"
   },
   "wic.CLITests.test_help_overview": {
    "duration": 3.541,
    "status": "PASSED"
   },
   "wic.CLITests.test_help_plugins": {
    "duration": 3.552,
    "status": "PASSED"
   },
   "wic.CLITests.test_list_images": {
    "duration": 6.589,
    "status": "PASSED"
   },
   "wic.CLITests.test_list_source_plugins": {
    "duration": 5.334,
    "status": "PASSED"
   },
   "wic.CLITests.test_listed_images_help": {
    "duration": 50.285,
    "status": "PASSED"
   },
   "wic.CLITests.test_listhelp": {
    "duration": 2.862,
    "status": "PASSED"
   },
   "wic.CLITests.test_no_command": {
    "duration": 3.476,
    "status": "PASSED"
   },
   "wic.CLITests.test_unsupported_subcommand": {
    "duration": 3.379,
    "status": "PASSED"
   },
   "wic.CLITests.test_version": {
    "duration": 3.513,
    "status": "PASSED"
   },
   "wic.ModifyTests.test_wic_cp": {
    "duration": 83.665,
    "status": "PASSED"
   },
   "wic.ModifyTests.test_wic_cp_ext": {
    "duration": 46.408,
    "status": "PASSED"
   },
   "wic.ModifyTests.test_wic_ls": {
    "duration": 27.901,
    "status": "PASSED"
   },
   "wic.ModifyTests.test_wic_ls_ext": {
    "duration": 26.916,
    "status": "PASSED"
   },
   "wic.ModifyTests.test_wic_rm": {
    "duration": 37.963,
    "status": "PASSED"
   },
   "wic.ModifyTests.test_wic_rm_ext": {
    "duration": 38.166,
    "status": "PASSED"
   },
   "wic.Wic.test_bootloader_config": {
    "duration": 181.917,
    "status": "PASSED"
   },
   "wic.Wic.test_build_artifacts": {
    "duration": 34.958,
    "status": "PASSED"
   },
   "wic.Wic.test_build_image_name": {
    "duration": 25.484,
    "status": "PASSED"
   },
   "wic.Wic.test_build_rootfs_long": {
    "duration": 68.963,
    "status": "PASSED"
   },
   "wic.Wic.test_build_rootfs_short": {
    "duration": 47.488,
    "status": "PASSED"
   },
   "wic.Wic.test_change_directory": {
    "duration": 24.025,
    "status": "PASSED"
   },
   "wic.Wic.test_change_directory_errors": {
    "duration": 46.894,
    "status": "PASSED"
   },
   "wic.Wic.test_compress_bzip2": {
    "duration": 28.217,
    "status": "PASSED"
   },
   "wic.Wic.test_compress_gzip": {
    "duration": 27.311,
    "status": "PASSED"
   },
   "wic.Wic.test_compress_xz": {
    "duration": 31.322,
    "status": "PASSED"
   },
   "wic.Wic.test_debug_long": {
    "duration": 22.611,
    "status": "PASSED"
   },
   "wic.Wic.test_debug_short": {
    "duration": 29.873,
    "status": "PASSED"
   },
   "wic.Wic.test_default_output_dir": {
    "duration": 76.021,
    "status": "PASSED"
   },
   "wic.Wic.test_efi_bootpart": {
    "duration": 66.089,
    "status": "PASSED"
   },
   "wic.Wic.test_exclude_path": {
    "duration": 33.785,
    "status": "PASSED"
   },
   "wic.Wic.test_exclude_path_errors": {
    "duration": 43.964,
    "status": "PASSED"
   },
   "wic.Wic.test_exclude_path_with_extra_space": {
    "duration": 88.514,
    "status": "PASSED"
   },
   "wic.Wic.test_extra_space": {
    "duration": 22.979,
    "status": "PASSED"
   },
   "wic.Wic.test_gpt_image": {
    "duration": 30.924,
    "status": "PASSED"
   },
   "wic.Wic.test_grub_install_pcbios": {
    "duration": 102.247,
    "status": "PASSED"
   },
   "wic.Wic.test_include_path": {
    "duration": 30.277,
    "status": "PASSED"
   },
   "wic.Wic.test_include_path_embeded": {
    "duration": 35.738,
    "status": "PASSED"
   },
   "wic.Wic.test_include_path_errors": {
    "duration": 79.839,
    "status": "PASSED"
   },
   "wic.Wic.test_iso_image": {
    "duration": 302.944,
    "status": "PASSED"
   },
   "wic.Wic.test_kernel_install": {
    "duration": 37.563,
    "status": "PASSED"
   },
   "wic.Wic.test_mkefidisk": {
    "duration": 29.546,
    "status": "PASSED"
   },
   "wic.Wic.test_no_fstab_update": {
    "duration": 45.396,
    "status": "PASSED"
   },
   "wic.Wic.test_no_fstab_update_errors": {
    "duration": 47.489,
    "status": "PASSED"
   },
   "wic.Wic.test_no_table": {
    "duration": 26.38,
    "status": "PASSED"
   },
   "wic.Wic.test_partition_hidden_attributes": {
    "duration": 30.818,
    "status": "PASSED"
   },
   "wic.Wic.test_permissions": {
    "duration": 290.583,
    "status": "PASSED"
   },
   "wic.Wic.test_qemux86_directdisk": {
    "duration": 28.128,
    "status": "PASSED"
   },
   "wic.Wic.test_rootfs_artifacts": {
    "duration": 71.083,
    "status": "PASSED"
   },
   "wic.Wic.test_rootfs_indirect_recipes": {
    "duration": 31.744,
    "status": "PASSED"
   },
   "wic.Wic.test_sdimage_bootpart": {
    "duration": 52.848,
    "status": "PASSED"
   },
   "wic.Wic.test_skip_build_check_long": {
    "duration": 26.297,
    "status": "PASSED"
   },
   "wic.Wic.test_skip_build_check_short": {
    "duration": 26.232,
    "status": "PASSED"
   },
   "wic.Wic.test_skip_kernel_install": {
    "duration": 39.55,
    "status": "PASSED"
   },
   "wic.Wic.test_systemd_bootdisk": {
    "duration": 99.359,
    "status": "PASSED"
   },
   "wic.Wic.test_wic_sector_size_cli": {
    "duration": 82.139,
    "status": "PASSED"
   },
   "wic.Wic.test_wic_sector_size_env": {
    "duration": 77.555,
    "status": "PASSED"
   },
   "wic.Wic.test_wrong_compressor": {
    "duration": 4.81,
    "status": "PASSED"
   },
   "wic.Wic2.test_biosplusefi_plugin": {
    "duration": 170.483,
    "status": "PASSED"
   },
   "wic.Wic2.test_biosplusefi_plugin_qemu": {
    "duration": 41.71,
    "oetags": [
     "runqemu"
    ],
    "status": "PASSED"
   },
   "wic.Wic2.test_bmap_long": {
    "duration": 23.669,
    "status": "PASSED"
   },
   "wic.Wic2.test_bmap_short": {
    "duration": 24.281,
    "status": "PASSED"
   },
   "wic.Wic2.test_diskid_on_gpt_partition": {
    "duration": 30.736,
    "status": "PASSED"
   },
   "wic.Wic2.test_diskid_on_msdos_partition": {
    "duration": 32.805,
    "status": "PASSED"
   },
   "wic.Wic2.test_efi_plugin_plain_systemd_boot_qemu_aarch64": {
    "duration": 0.001222,
    "log": "Test skipped on x86_64\n",
    "oetags": [
     "runqemu"
    ],
    "status": "SKIPPED"
   },
   "wic.Wic2.test_efi_plugin_plain_systemd_boot_qemu_x86": {
    "duration": 1177.895,
    "oetags": [
     "runqemu"
    ],
    "status": "PASSED"
   },
   "wic.Wic2.test_efi_plugin_unified_kernel_image_qemu": {
    "duration": 151.743,
    "oetags": [
     "runqemu"
    ],
    "status": "PASSED"
   },
   "wic.Wic2.test_empty_plugin": {
    "duration": 75.576,
    "status": "PASSED"
   },
   "wic.Wic2.test_empty_zeroize_plugin": {
    "duration": 36.844,
    "status": "PASSED"
   },
   "wic.Wic2.test_expand_mbr_image": {
    "duration": 74.674,
    "oetags": [
     "runqemu"
    ],
    "status": "PASSED"
   },
   "wic.Wic2.test_extra_filesystem_space": {
    "duration": 25.884,
    "status": "PASSED"
   },
   "wic.Wic2.test_extra_partition_plugin": {
    "duration": 62.254,
    "status": "PASSED"
   },
   "wic.Wic2.test_extra_partition_space": {
    "duration": 27.758,
    "status": "PASSED"
   },
   "wic.Wic2.test_fixed_size": {
    "duration": 22.783,
    "status": "PASSED"
   },
   "wic.Wic2.test_fixed_size_error": {
    "duration": 21.558,
    "status": "PASSED"
   },
   "wic.Wic2.test_fs_types": {
    "duration": 23.942,
    "status": "PASSED"
   },
   "wic.Wic2.test_gpt_partition_name": {
    "duration": 65.866,
    "status": "PASSED"
   },
   "wic.Wic2.test_image_bootpart_globbed": {
    "duration": 43.232,
    "status": "PASSED"
   },
   "wic.Wic2.test_image_env": {
    "duration": 38.464,
    "status": "PASSED"
   },
   "wic.Wic2.test_image_vars_dir_long": {
    "duration": 7.682,
    "status": "PASSED"
   },
   "wic.Wic2.test_image_vars_dir_short": {
    "duration": 8.179,
    "status": "PASSED"
   },
   "wic.Wic2.test_kickstart_parser": {
    "duration": 20.598,
    "status": "PASSED"
   },
   "wic.Wic2.test_mkfs_extraopts": {
    "duration": 22.341,
    "status": "PASSED"
   },
   "wic.Wic2.test_offset": {
    "duration": 125.634,
    "status": "PASSED"
   },
   "wic.Wic2.test_qemu": {
    "duration": 95.817,
    "oetags": [
     "runqemu"
    ],
    "status": "PASSED"
   },
   "wic.Wic2.test_qemu_efi": {
    "duration": 85.365,
    "oetags": [
     "runqemu"
    ],
    "status": "PASSED"
   },
   "wic.Wic2.test_rawcopy_plugin": {
    "duration": 75.293,
    "status": "PASSED"
   },
   "wic.Wic2.test_rawcopy_plugin_qemu": {
    "duration": 90.669,
    "oetags": [
     "runqemu"
    ],
    "status": "PASSED"
   },
   "wic.Wic2.test_rawcopy_plugin_unpack": {
    "duration": 76.216,
    "status": "PASSED"
   },
   "wic.Wic2.test_uefi_kernel": {
    "duration": 73.388,
    "status": "PASSED"
   },
   "wic.Wic2.test_wic_image_type": {
    "duration": 29.541,
    "status": "PASSED"
   },
   "wrapper.WrapperTests.test_shebang_wrapper": {
    "duration": 38.444,
    "status": "PASSED"
   },
   "yoctotestresultsquerytests.TestResultsQueryTests.test_create_workdir": {
    "duration": 4.934,
    "status": "PASSED"
   },
   "yoctotestresultsquerytests.TestResultsQueryTests.test_get_sha1": {
    "duration": 0.06739,
    "status": "PASSED"
   }
  }
 }
}