{
 "oeselftest_debian-12_qemux86-64_20260914011702": {
  "configuration": {
   "HOST_DISTRO": "debian-12",
   "HOST_NAME": "debian12-vk-2",
   "LAYERS": {
    "meta": {
     "branch": "master",
     "commit": "f94ae3d6ba49aef86f497998c0e0232a5039510a",
     "commit_count": 68785,
     "commit_time": 1789288366
    },
    "meta-poky": {
     "branch": "master",
     "commit": "7e41504cd63b099b214f10d92cfdaf358ab98c5f",
     "commit_count": 1821,
     "commit_time": 1788885316
    },
    "meta-selftest": {
     "branch": "master",
     "commit": "f94ae3d6ba49aef86f497998c0e0232a5039510a",
     "commit_count": 68785,
     "commit_time": 1789288366
    },
    "meta-yocto-bsp": {
     "branch": "master",
     "commit": "7e41504cd63b099b214f10d92cfdaf358ab98c5f",
     "commit_count": 1821,
     "commit_time": 1788885316
    }
   },
   "MACHINE": "qemux86-64",
   "OESELFTEST_METADATA": {
    "exclude_tags": [
     "yocto-mirrors",
     "machine",
     "toolchain-user",
     "toolchain-system"
    ],
    "run_all_tests": true,
    "run_tests": null,
    "select_tags": null,
    "skips": [
     "distrodata.Distrodata.test_checkpkg",
     "reproducible"
    ]
   },
   "STARTTIME": "20260914011702",
   "TESTSERIES": "oeqa",
   "TEST_TYPE": "oeselftest"
  },
  "result": {
   "archiver.Archiver.test_archiver_allows_to_filter_on_recipe_name": {
    "duration": 32.589,
    "status": "PASSED"
   },
   "archiver.Archiver.test_archiver_cleanup": {
    "duration": 62.167,
    "status": "PASSED"
   },
   "archiver.Archiver.test_archiver_filters_by_type": {
    "duration": 33.174,
    "status": "PASSED"
   },
   "archiver.Archiver.test_archiver_filters_by_type_and_name": {
    "duration": 22.934,
    "status": "PASSED"
   },
   "archiver.Archiver.test_archiver_mode_configured": {
    "duration": 26.514,
    "status": "PASSED"
   },
   "archiver.Archiver.test_archiver_mode_diff": {
    "duration": 26.133,
    "status": "PASSED"
   },
   "archiver.Archiver.test_archiver_mode_dumpdata": {
    "duration": 9.196,
    "status": "PASSED"
   },
   "archiver.Archiver.test_archiver_mode_mirror": {
    "duration": 24.752,
    "status": "PASSED"
   },
   "archiver.Archiver.test_archiver_mode_mirror_combined": {
    "duration": 27.594,
    "status": "PASSED"
   },
   "archiver.Archiver.test_archiver_mode_mirror_excludes": {
    "duration": 23.964,
    "status": "PASSED"
   },
   "archiver.Archiver.test_archiver_mode_mirror_gitsm": {
    "duration": 19.707,
    "status": "PASSED"
   },
   "archiver.Archiver.test_archiver_mode_mirror_gitsm_shallow": {
    "duration": 37.348,
    "status": "PASSED"
   },
   "archiver.Archiver.test_archiver_mode_original": {
    "duration": 27.69,
    "status": "PASSED"
   },
   "archiver.Archiver.test_archiver_mode_patched": {
    "duration": 8.063,
    "status": "PASSED"
   },
   "archiver.Archiver.test_archiver_mode_recipe": {
    "duration": 21.751,
    "status": "PASSED"
   },
   "archiver.Archiver.test_archiver_multiconfig_shared_unpack_and_patch": {
    "duration": 105.289,
    "status": "PASSED"
   },
   "barebox.BareboxTest.test_boot_barebox": {
    "duration": 0.002303,
    "log": "Test skipped on x86_64\n",
    "oetags": [
     "runqemu"
    ],
    "status": "SKIPPED"
   },
   "baremetal.BaremetalTest.test_baremetal": {
    "duration": 54.422,
    "status": "PASSED"
   },
   "bbclasses.Systemd.test_systemd_in_distro": {
    "duration": 61.438,
    "status": "PASSED"
   },
   "bbclasses.Systemd.test_sysvinit_in_distro": {
    "duration": 28.835,
    "status": "PASSED"
   },
   "bblayers.BitbakeConfigBuild.test_enable_disable_builtin_fragments": {
    "duration": 17.362,
    "status": "PASSED"
   },
   "bblayers.BitbakeConfigBuild.test_enable_disable_fragments": {
    "duration": 17.185,
    "status": "PASSED"
   },
   "bblayers.BitbakeConfigBuild.test_show_fragment": {
    "duration": 2.284,
    "status": "PASSED"
   },
   "bblayers.BitbakeLayers.test_bitbakelayers_add_remove": {
    "duration": 9.65,
    "status": "PASSED"
   },
   "bblayers.BitbakeLayers.test_bitbakelayers_createlayer": {
    "duration": 6.048,
    "status": "PASSED"
   },
   "bblayers.BitbakeLayers.test_bitbakelayers_flatten": {
    "duration": 43.328,
    "status": "PASSED"
   },
   "bblayers.BitbakeLayers.test_bitbakelayers_layerindexshowdepends": {
    "duration": 4.426,
    "status": "PASSED"
   },
   "bblayers.BitbakeLayers.test_bitbakelayers_setup": {
    "duration": 24.317,
    "status": "PASSED"
   },
   "bblayers.BitbakeLayers.test_bitbakelayers_showappends": {
    "duration": 7.545,
    "status": "PASSED"
   },
   "bblayers.BitbakeLayers.test_bitbakelayers_showcrossdepends": {
    "duration": 18.024,
    "status": "PASSED"
   },
   "bblayers.BitbakeLayers.test_bitbakelayers_showlayers": {
    "duration": 0.9404,
    "status": "PASSED"
   },
   "bblayers.BitbakeLayers.test_bitbakelayers_showoverlayed": {
    "duration": 6.504,
    "status": "PASSED"
   },
   "bblayers.BitbakeLayers.test_bitbakelayers_showrecipes": {
    "duration": 21.687,
    "status": "PASSED"
   },
   "bblayers.BitbakeLayers.test_bitbakelayers_updatelayer": {
    "duration": 6.256,
    "status": "PASSED"
   },
   "bblayers.BitbakeLayers.test_validate_bitbake_setup_default_registry": {
    "duration": 2.473,
    "status": "PASSED"
   },
   "bblayers.BitbakeLayers.test_validate_examplelayersjson": {
    "duration": 0.3314,
    "status": "PASSED"
   },
   "bblock.BBLock.test_lock_architecture_specific": {
    "duration": 73.367,
    "status": "PASSED"
   },
   "bblock.BBLock.test_lock_multiple_recipe_single_task": {
    "duration": 213.947,
    "status": "PASSED"
   },
   "bblock.BBLock.test_lock_single_recipe_all_tasks": {
    "duration": 142.305,
    "status": "PASSED"
   },
   "bblock.BBLock.test_lock_single_recipe_multiple_tasks": {
    "duration": 111.075,
    "status": "PASSED"
   },
   "bblock.BBLock.test_lock_single_recipe_single_task": {
    "duration": 103.722,
    "status": "PASSED"
   },
   "bblogging.BitBakeLogging.test_python_exec_func_python_loggingA": {
    "duration": 36.315,
    "status": "PASSED"
   },
   "bblogging.BitBakeLogging.test_python_exec_func_python_loggingB": {
    "duration": 31.583,
    "status": "PASSED"
   },
   "bblogging.BitBakeLogging.test_python_exec_func_python_loggingC": {
    "duration": 24.152,
    "status": "PASSED"
   },
   "bblogging.BitBakeLogging.test_python_exec_func_python_loggingD": {
    "duration": 13.373,
    "status": "PASSED"
   },
   "bblogging.BitBakeLogging.test_python_exec_func_shell_loggingA": {
    "duration": 11.917,
    "status": "PASSED"
   },
   "bblogging.BitBakeLogging.test_python_exec_func_shell_loggingB": {
    "duration": 12.007,
    "status": "PASSED"
   },
   "bblogging.BitBakeLogging.test_python_exec_func_shell_loggingC": {
    "duration": 12.858,
    "status": "PASSED"
   },
   "bblogging.BitBakeLogging.test_python_exec_func_shell_loggingD": {
    "duration": 10.273,
    "status": "PASSED"
   },
   "bblogging.BitBakeLogging.test_python_exit_loggingA": {
    "duration": 12.727,
    "status": "PASSED"
   },
   "bblogging.BitBakeLogging.test_python_exit_loggingB": {
    "duration": 12.169,
    "status": "PASSED"
   },
   "bblogging.BitBakeLogging.test_python_exit_loggingC": {
    "duration": 16.153,
    "status": "PASSED"
   },
   "bblogging.BitBakeLogging.test_python_exit_loggingD": {
    "duration": 11.505,
    "status": "PASSED"
   },
   "bblogging.BitBakeLogging.test_python_fatal_loggingA": {
    "duration": 10.699,
    "status": "PASSED"
   },
   "bblogging.BitBakeLogging.test_python_fatal_loggingB": {
    "duration": 13.611,
    "status": "PASSED"
   },
   "bblogging.BitBakeLogging.test_python_fatal_loggingC": {
    "duration": 11.164,
    "status": "PASSED"
   },
   "bblogging.BitBakeLogging.test_python_fatal_loggingD": {
    "duration": 11.337,
    "status": "PASSED"
   },
   "bblogging.BitBakeLogging.test_shell_loggingA": {
    "duration": 11.889,
    "status": "PASSED"
   },
   "bblogging.BitBakeLogging.test_shell_loggingB": {
    "duration": 12.414,
    "status": "PASSED"
   },
   "bblogging.BitBakeLogging.test_shell_loggingC": {
    "duration": 11.911,
    "status": "PASSED"
   },
   "bblogging.BitBakeLogging.test_shell_loggingD": {
    "duration": 13.088,
    "status": "PASSED"
   },
   "bbtests.BitbakeTests.test_bb_env_bb_getvar_equality": {
    "duration": 2.462,
    "status": "PASSED"
   },
   "bbtests.BitbakeTests.test_bbappend_order": {
    "duration": 30.114,
    "status": "PASSED"
   },
   "bbtests.BitbakeTests.test_bitbake_g": {
    "duration": 5.244,
    "status": "PASSED"
   },
   "bbtests.BitbakeTests.test_bitbake_invalid_recipe": {
    "duration": 1.125,
    "status": "PASSED"
   },
   "bbtests.BitbakeTests.test_bitbake_invalid_target": {
    "duration": 6.282,
    "status": "PASSED"
   },
   "bbtests.BitbakeTests.test_checkuri": {
    "duration": 7.807,
    "status": "PASSED"
   },
   "bbtests.BitbakeTests.test_continue": {
    "duration": 34.697,
    "status": "PASSED"
   },
   "bbtests.BitbakeTests.test_dry_run": {
    "duration": 5.812,
    "status": "PASSED"
   },
   "bbtests.BitbakeTests.test_environment": {
    "duration": 2.456,
    "status": "PASSED"
   },
   "bbtests.BitbakeTests.test_event_handler": {
    "duration": 31.704,
    "status": "PASSED"
   },
   "bbtests.BitbakeTests.test_force_task_1": {
    "duration": 58.294,
    "status": "PASSED"
   },
   "bbtests.BitbakeTests.test_force_task_2": {
    "duration": 28.735,
    "status": "PASSED"
   },
   "bbtests.BitbakeTests.test_git_patchtool": {
    "duration": 20.03,
    "status": "PASSED"
   },
   "bbtests.BitbakeTests.test_git_patchtool2": {
    "duration": 19.427,
    "status": "PASSED"
   },
   "bbtests.BitbakeTests.test_git_unpack_nonetwork": {
    "duration": 28.559,
    "status": "PASSED"
   },
   "bbtests.BitbakeTests.test_git_unpack_nonetwork_fail": {
    "duration": 11.397,
    "status": "PASSED"
   },
   "bbtests.BitbakeTests.test_image_manifest": {
    "duration": 76.533,
    "status": "PASSED"
   },
   "bbtests.BitbakeTests.test_invalid_patch": {
    "duration": 31.501,
    "status": "PASSED"
   },
   "bbtests.BitbakeTests.test_invalid_recipe_src_uri": {
    "duration": 3.834,
    "status": "PASSED"
   },
   "bbtests.BitbakeTests.test_just_parse": {
    "duration": 3.016,
    "status": "PASSED"
   },
   "bbtests.BitbakeTests.test_local_sstate": {
    "duration": 21.785,
    "status": "PASSED"
   },
   "bbtests.BitbakeTests.test_non_gplv3": {
    "duration": 21.66,
    "status": "PASSED"
   },
   "bbtests.BitbakeTests.test_postfile": {
    "duration": 3.589,
    "status": "PASSED"
   },
   "bbtests.BitbakeTests.test_prefile": {
    "duration": 7.266,
    "status": "PASSED"
   },
   "bbtests.BitbakeTests.test_rename_downloaded_file": {
    "duration": 22.789,
    "status": "PASSED"
   },
   "bbtests.BitbakeTests.test_run_bitbake_from_dir_1": {
    "duration": 2.644,
    "status": "PASSED"
   },
   "bbtests.BitbakeTests.test_run_bitbake_from_dir_2": {
    "duration": 1.662,
    "status": "PASSED"
   },
   "bbtests.BitbakeTests.test_run_bitbake_from_dir_3": {
    "duration": 1.768,
    "status": "PASSED"
   },
   "bbtests.BitbakeTests.test_setscene_only": {
    "duration": 22.943,
    "status": "PASSED"
   },
   "bbtests.BitbakeTests.test_skip_setscene": {
    "duration": 37.342,
    "status": "PASSED"
   },
   "bbtests.BitbakeTests.test_unexpanded_variable_in_path": {
    "duration": 21.111,
    "status": "PASSED"
   },
   "bbtests.BitbakeTests.test_version": {
    "duration": 4.427,
    "status": "PASSED"
   },
   "bbtests.BitbakeTests.test_warnings_errors": {
    "duration": 1.436,
    "status": "PASSED"
   },
   "buildhistory.BuildhistoryTests.test_buildhistory_basic": {
    "duration": 50.723,
    "status": "PASSED"
   },
   "buildhistory.BuildhistoryTests.test_buildhistory_buildtime_pr_backwards": {
    "duration": 56.665,
    "status": "PASSED"
   },
   "buildhistory.BuildhistoryTests.test_buildhistory_diff": {
    "duration": 57.814,
    "status": "PASSED"
   },
   "buildhistory.BuildhistoryTests.test_fileinfo": {
    "duration": 15.995,
    "status": "PASSED"
   },
   "buildoptions.ArchiverTest.test_arch_work_dir_and_export_source": {
    "duration": 36.666,
    "status": "PASSED"
   },
   "buildoptions.DiskMonTest.test_stoptask_behavior": {
    "duration": 87.445,
    "status": "PASSED"
   },
   "buildoptions.ImageOptionsTests.test_ccache_tool": {
    "duration": 104.6,
    "status": "PASSED"
   },
   "buildoptions.ImageOptionsTests.test_incremental_image_generation": {
    "duration": 149.557,
    "status": "PASSED"
   },
   "buildoptions.ImageOptionsTests.test_read_only_image": {
    "duration": 184.244,
    "status": "PASSED"
   },
   "buildoptions.Poisoning.test_poisoning": {
    "duration": 32.791,
    "status": "PASSED"
   },
   "buildoptions.SanityOptionsTest.test_layer_without_git_dir": {
    "duration": 25.021,
    "status": "PASSED"
   },
   "buildoptions.SanityOptionsTest.test_options_warnqa_errorqa_switch": {
    "duration": 69.804,
    "status": "PASSED"
   },
   "buildoptions.ToolchainOptions.test_toolchain_fortran": {
    "duration": 32.4,
    "status": "PASSED"
   },
   "c_cpp.CMakeTests.test_cmake_qemu": {
    "duration": 47.461,
    "status": "PASSED"
   },
   "c_cpp.CMakeTests.test_cmake_qemu_failing": {
    "duration": 38.399,
    "status": "PASSED"
   },
   "c_cpp.MesonTests.test_meson_qemu": {
    "duration": 38.831,
    "status": "PASSED"
   },
   "c_cpp.MesonTests.test_meson_qemu_failing": {
    "duration": 42.854,
    "status": "PASSED"
   },
   "containerimage.ContainerImageTests.test_expected_files": {
    "duration": 55.568,
    "status": "PASSED"
   },
   "cve_check.CVECheck.test_convert_cve_version": {
    "duration": 0.007637,
    "status": "PASSED"
   },
   "cve_check.CVECheck.test_parse_cve_from_patch_contents": {
    "duration": 0.006907,
    "status": "PASSED"
   },
   "cve_check.CVECheck.test_parse_cve_from_patch_filename": {
    "duration": 0.00608,
    "status": "PASSED"
   },
   "cve_check.CVECheck.test_product_match": {
    "duration": 0.005765,
    "status": "PASSED"
   },
   "cve_check.CVECheck.test_version_compare": {
    "duration": 0.006844,
    "status": "PASSED"
   },
   "debuginfod.Debuginfod.test_debuginfod_native": {
    "duration": 44.185,
    "status": "PASSED"
   },
   "debuginfod.Debuginfod.test_debuginfod_qemu": {
    "duration": 117.375,
    "oetags": [
     "runqemu"
    ],
    "status": "PASSED"
   },
   "devtool.DevtoolAddTests.test_devtool_add": {
    "duration": 74.02,
    "status": "PASSED"
   },
   "devtool.DevtoolAddTests.test_devtool_add_binary": {
    "duration": 56.16,
    "status": "PASSED"
   },
   "devtool.DevtoolAddTests.test_devtool_add_build_finish": {
    "duration": 82.243,
    "status": "PASSED"
   },
   "devtool.DevtoolAddTests.test_devtool_add_build_finish_force": {
    "duration": 75.922,
    "status": "PASSED"
   },
   "devtool.DevtoolAddTests.test_devtool_add_fetch": {
    "duration": 70.673,
    "status": "PASSED"
   },
   "devtool.DevtoolAddTests.test_devtool_add_fetch_git": {
    "duration": 63.253,
    "status": "PASSED"
   },
   "devtool.DevtoolAddTests.test_devtool_add_fetch_simple": {
    "duration": 30.229,
    "status": "PASSED"
   },
   "devtool.DevtoolAddTests.test_devtool_add_git_local": {
    "duration": 33.18,
    "status": "PASSED"
   },
   "devtool.DevtoolAddTests.test_devtool_add_git_style1": {
    "duration": 33.944,
    "status": "PASSED"
   },
   "devtool.DevtoolAddTests.test_devtool_add_git_style2": {
    "duration": 34.038,
    "status": "PASSED"
   },
   "devtool.DevtoolAddTests.test_devtool_add_library": {
    "duration": 52.237,
    "status": "PASSED"
   },
   "devtool.DevtoolAddTests.test_devtool_add_npm": {
    "duration": 1.261,
    "log": "Test needs meta-oe for nodejs\n",
    "status": "SKIPPED"
   },
   "devtool.DevtoolAddTests.test_devtool_add_python_egg_requires": {
    "duration": 25.21,
    "status": "PASSED"
   },
   "devtool.DevtoolBuildImageTests.test_devtool_build_image": {
    "duration": 223.096,
    "status": "PASSED"
   },
   "devtool.DevtoolDeployTargetTests.test_devtool_deploy_target": {
    "duration": 371.889,
    "oetags": [
     "runqemu"
    ],
    "status": "PASSED"
   },
   "devtool.DevtoolDeployTargetTests.test_devtool_deploy_target_path": {
    "duration": 242.195,
    "oetags": [
     "runqemu"
    ],
    "status": "PASSED"
   },
   "devtool.DevtoolExtractTests.test_devtool_extract": {
    "duration": 43.841,
    "status": "PASSED"
   },
   "devtool.DevtoolExtractTests.test_devtool_extract_virtual": {
    "duration": 28.545,
    "status": "PASSED"
   },
   "devtool.DevtoolIdeSdkClangTests.test_devtool_ide_sdk_code_cmake": {
    "duration": 395.753,
    "oetags": [
     "runqemu"
    ],
    "status": "PASSED"
   },
   "devtool.DevtoolIdeSdkClangTests.test_devtool_ide_sdk_code_meson": {
    "duration": 325.662,
    "oetags": [
     "runqemu"
    ],
    "status": "PASSED"
   },
   "devtool.DevtoolIdeSdkClangTests.test_devtool_ide_sdk_none_cmake": {
    "duration": 257.958,
    "oetags": [
     "runqemu"
    ],
    "status": "PASSED"
   },
   "devtool.DevtoolIdeSdkClangTests.test_devtool_ide_sdk_none_meson": {
    "duration": 259.194,
    "oetags": [
     "runqemu"
    ],
    "status": "PASSED"
   },
   "devtool.DevtoolIdeSdkGccTests.test_devtool_ide_sdk_code_cmake": {
    "duration": 303.855,
    "oetags": [
     "runqemu"
    ],
    "status": "PASSED"
   },
   "devtool.DevtoolIdeSdkGccTests.test_devtool_ide_sdk_code_meson": {
    "duration": 240.574,
    "oetags": [
     "runqemu"
    ],
    "status": "PASSED"
   },
   "devtool.DevtoolIdeSdkGccTests.test_devtool_ide_sdk_code_nfs_debug_rootfs": {
    "duration": 179.335,
    "status": "PASSED"
   },
   "devtool.DevtoolIdeSdkGccTests.test_devtool_ide_sdk_none_nfs_qemu": {
    "duration": 238.171,
    "oetags": [
     "runqemu"
    ],
    "status": "PASSED"
   },
   "devtool.DevtoolIdeSdkGccTests.test_devtool_ide_sdk_none_nfs_qemu_slirp": {
    "duration": 234.938,
    "oetags": [
     "runqemu"
    ],
    "status": "PASSED"
   },
   "devtool.DevtoolIdeSdkGccTests.test_devtool_ide_sdk_none_qemu": {
    "duration": 309.923,
    "oetags": [
     "runqemu"
    ],
    "status": "PASSED"
   },
   "devtool.DevtoolIdeSdkGccTests.test_devtool_ide_sdk_none_qemu_slirp": {
    "duration": 167.297,
    "oetags": [
     "runqemu"
    ],
    "status": "PASSED"
   },
   "devtool.DevtoolIdeSdkKernelTests.test_devtool_ide_sdk_code_kernel_module": {
    "duration": 561.878,
    "oetags": [
     "runqemu"
    ],
    "status": "PASSED"
   },
   "devtool.DevtoolIdeSdkMiscTests.test_devtool_ide_sdk_plugins": {
    "duration": 85.602,
    "status": "PASSED"
   },
   "devtool.DevtoolIdeSdkSharedTests.test_devtool_ide_sdk_shared_sysroots": {
    "duration": 106.55,
    "status": "PASSED"
   },
   "devtool.DevtoolModifyTests.test_devtool_buildclean": {
    "duration": 261.073,
    "status": "PASSED"
   },
   "devtool.DevtoolModifyTests.test_devtool_modify": {
    "duration": 121.785,
    "status": "PASSED"
   },
   "devtool.DevtoolModifyTests.test_devtool_modify_git": {
    "duration": 73.855,
    "status": "PASSED"
   },
   "devtool.DevtoolModifyTests.test_devtool_modify_git_crates_subpath": {
    "duration": 83.65,
    "status": "PASSED"
   },
   "devtool.DevtoolModifyTests.test_devtool_modify_git_no_extract": {
    "duration": 29.417,
    "status": "PASSED"
   },
   "devtool.DevtoolModifyTests.test_devtool_modify_go": {
    "duration": 43.599,
    "status": "PASSED"
   },
   "devtool.DevtoolModifyTests.test_devtool_modify_invalid": {
    "duration": 125.808,
    "status": "PASSED"
   },
   "devtool.DevtoolModifyTests.test_devtool_modify_kernel_cfg_subdirs": {
    "duration": 404.458,
    "status": "PASSED"
   },
   "devtool.DevtoolModifyTests.test_devtool_modify_localfiles": {
    "duration": 73.835,
    "status": "PASSED"
   },
   "devtool.DevtoolModifyTests.test_devtool_modify_localfiles_only": {
    "duration": 69.056,
    "status": "PASSED"
   },
   "devtool.DevtoolModifyTests.test_devtool_modify_multiple_sources": {
    "duration": 648.884,
    "status": "PASSED"
   },
   "devtool.DevtoolModifyTests.test_devtool_modify_native": {
    "duration": 356.151,
    "status": "PASSED"
   },
   "devtool.DevtoolModifyTests.test_devtool_modify_nested_gitsm": {
    "duration": 37.721,
    "status": "PASSED"
   },
   "devtool.DevtoolModifyTests.test_devtool_modify_overrides": {
    "duration": 30.479,
    "status": "PASSED"
   },
   "devtool.DevtoolModifyTests.test_devtool_modify_virtual": {
    "duration": 33.025,
    "status": "PASSED"
   },
   "devtool.DevtoolResetTests.test_devtool_reset_all": {
    "duration": 156.266,
    "status": "PASSED"
   },
   "devtool.DevtoolResetTests.test_devtool_reset_re_plus_plus": {
    "duration": 31.05,
    "status": "PASSED"
   },
   "devtool.DevtoolTests.test_create_workspace": {
    "duration": 6.898,
    "status": "PASSED"
   },
   "devtool.DevtoolUpdateTests.test_devtool_finish_modify_git_subdir": {
    "duration": 103.592,
    "status": "PASSED"
   },
   "devtool.DevtoolUpdateTests.test_devtool_git_submodules": {
    "duration": 143.248,
    "status": "PASSED"
   },
   "devtool.DevtoolUpdateTests.test_devtool_update_recipe": {
    "duration": 55.509,
    "status": "PASSED"
   },
   "devtool.DevtoolUpdateTests.test_devtool_update_recipe_append": {
    "duration": 94.91,
    "status": "PASSED"
   },
   "devtool.DevtoolUpdateTests.test_devtool_update_recipe_append_git": {
    "duration": 96.895,
    "status": "PASSED"
   },
   "devtool.DevtoolUpdateTests.test_devtool_update_recipe_git": {
    "duration": 59.756,
    "status": "PASSED"
   },
   "devtool.DevtoolUpdateTests.test_devtool_update_recipe_gitsm": {
    "duration": 41.954,
    "status": "PASSED"
   },
   "devtool.DevtoolUpdateTests.test_devtool_update_recipe_local_files": {
    "duration": 99.426,
    "status": "PASSED"
   },
   "devtool.DevtoolUpdateTests.test_devtool_update_recipe_local_files_3": {
    "duration": 35.815,
    "status": "PASSED"
   },
   "devtool.DevtoolUpdateTests.test_devtool_update_recipe_local_files_subdir": {
    "duration": 34.977,
    "status": "PASSED"
   },
   "devtool.DevtoolUpdateTests.test_devtool_update_recipe_local_patch_gz": {
    "duration": 35.669,
    "status": "PASSED"
   },
   "devtool.DevtoolUpdateTests.test_devtool_update_recipe_long_filename": {
    "duration": 44.117,
    "status": "PASSED"
   },
   "devtool.DevtoolUpdateTests.test_devtool_update_recipe_with_gitignore": {
    "duration": 41.703,
    "status": "PASSED"
   },
   "devtool.DevtoolUpgradeTests.test_devtool_finish_modify_origlayer": {
    "duration": 91.94,
    "status": "PASSED"
   },
   "devtool.DevtoolUpgradeTests.test_devtool_finish_modify_otherlayer": {
    "duration": 58.691,
    "status": "PASSED"
   },
   "devtool.DevtoolUpgradeTests.test_devtool_finish_update_patch": {
    "duration": 52.881,
    "status": "PASSED"
   },
   "devtool.DevtoolUpgradeTests.test_devtool_finish_upgrade_origlayer": {
    "duration": 69.44,
    "status": "PASSED"
   },
   "devtool.DevtoolUpgradeTests.test_devtool_finish_upgrade_otherlayer": {
    "duration": 71.387,
    "status": "PASSED"
   },
   "devtool.DevtoolUpgradeTests.test_devtool_layer_plugins": {
    "duration": 3.404,
    "status": "PASSED"
   },
   "devtool.DevtoolUpgradeTests.test_devtool_load_plugin": {
    "duration": 12.874,
    "status": "PASSED"
   },
   "devtool.DevtoolUpgradeTests.test_devtool_rename": {
    "duration": 95.824,
    "status": "PASSED"
   },
   "devtool.DevtoolUpgradeTests.test_devtool_upgrade": {
    "duration": 59.524,
    "status": "PASSED"
   },
   "devtool.DevtoolUpgradeTests.test_devtool_upgrade_all_checksums": {
    "duration": 53.646,
    "status": "PASSED"
   },
   "devtool.DevtoolUpgradeTests.test_devtool_upgrade_drop_md5sum": {
    "duration": 56.403,
    "status": "PASSED"
   },
   "devtool.DevtoolUpgradeTests.test_devtool_upgrade_git": {
    "duration": 37.248,
    "status": "PASSED"
   },
   "devtool.DevtoolUpgradeTests.test_devtool_upgrade_gitsm": {
    "duration": 39.657,
    "status": "PASSED"
   },
   "devtool.DevtoolUpgradeTests.test_devtool_upgrade_recipe_upgrade_extra_tasks": {
    "duration": 59.703,
    "status": "PASSED"
   },
   "devtool.DevtoolUpgradeTests.test_devtool_virtual_kernel_modify": {
    "duration": 881.683,
    "status": "PASSED"
   },
   "distrodata.Distrodata.test_checkpkg": {
    "duration": 0.0003128,
    "log": "Skip by the command line argument \"distrodata.Distrodata.test_checkpkg\"\n",
    "status": "SKIPPED"
   },
   "distrodata.Distrodata.test_common_include_recipes": {
    "duration": 45.817,
    "status": "PASSED"
   },
   "distrodata.Distrodata.test_maintainers": {
    "duration": 69.026,
    "status": "PASSED"
   },
   "efibootpartition.GenericEFITest.test_boot_efi": {
    "duration": 131.048,
    "status": "PASSED"
   },
   "esdk.oeSDKExtSelfTest.test_image_generation_binary_feeds": {
    "duration": 89.924,
    "status": "PASSED"
   },
   "esdk.oeSDKExtSelfTest.test_install_libraries_headers": {
    "duration": 32.424,
    "status": "PASSED"
   },
   "externalsrc.ExternalSrc.test_externalsrc_srctree_hash_files": {
    "duration": 25.714,
    "status": "PASSED"
   },
   "fetch.Dependencies.test_dependencies": {
    "duration": 17.676,
    "status": "PASSED"
   },
   "fetch.Fetch.test_git_mirrors": {
    "duration": 74.018,
    "status": "PASSED"
   },
   "fitimage.FitImagePyTests.test_fitimage_py_conf_extra_mappings_unused_error": {
    "duration": 0.007999,
    "status": "PASSED"
   },
   "fitimage.FitImagePyTests.test_fitimage_py_conf_loadables": {
    "duration": 0.006174,
    "status": "PASSED"
   },
   "fitimage.FitImagePyTests.test_fitimage_py_conf_mappings": {
    "duration": 0.006079,
    "status": "PASSED"
   },
   "fitimage.FitImagePyTests.test_fitimage_py_conf_mappings_unused_error": {
    "duration": 0.005548,
    "status": "PASSED"
   },
   "fitimage.FitImagePyTests.test_fitimage_py_conf_mappings_with_alias": {
    "duration": 0.005997,
    "status": "PASSED"
   },
   "fitimage.FitImagePyTests.test_fitimage_py_conf_os": {
    "duration": 0.008067,
    "status": "PASSED"
   },
   "fitimage.FitImagePyTests.test_fitimage_py_default": {
    "duration": 0.005891,
    "status": "PASSED"
   },
   "fitimage.FitImagePyTests.test_fitimage_py_default_dtb": {
    "duration": 0.005728,
    "status": "PASSED"
   },
   "fitimage.KernelFitImageRecipeTests.test_fit_image": {
    "duration": 63.157,
    "status": "PASSED"
   },
   "fitimage.KernelFitImageRecipeTests.test_fit_image_ext_dtb_dtbo": {
    "duration": 32.988,
    "status": "PASSED"
   },
   "fitimage.KernelFitImageRecipeTests.test_fit_image_sign_initramfs": {
    "duration": 74.772,
    "status": "PASSED"
   },
   "fitimage.KernelFitImageRecipeTests.test_fit_image_sign_initramfs_bundle": {
    "duration": 163.853,
    "status": "PASSED"
   },
   "fitimage.KernelFitImageRecipeTests.test_get_compatible_from_dtb": {
    "duration": 24.121,
    "status": "PASSED"
   },
   "fitimage.KernelFitImageRecipeTests.test_sign_fit_image_configurations": {
    "duration": 51.168,
    "status": "PASSED"
   },
   "fitimage.KernelFitImageRecipeTests.test_sign_fit_image_individual": {
    "duration": 48.866,
    "status": "PASSED"
   },
   "fitimage.KernelFitImageRecipeTests.test_vendored_dtb_with_kernel_dtbvendored": {
    "duration": 36.622,
    "status": "PASSED"
   },
   "fitimage.KernelFitImageRecipeTests.test_vendored_dtb_without_kernel_dtbvendored": {
    "duration": 38.284,
    "status": "PASSED"
   },
   "fitimage.UBootFitImageTests.test_sign_cascaded_uboot_fit_image": {
    "duration": 0.7801,
    "log": "MACHINE=qemux86-64 does not provide capability _cap_spl_dtb\n",
    "status": "SKIPPED"
   },
   "fitimage.UBootFitImageTests.test_sign_standalone_uboot_atf_tee_fit_image": {
    "duration": 0.4193,
    "log": "MACHINE=qemux86-64 does not provide capability _cap_spl_dtb\n",
    "status": "SKIPPED"
   },
   "fitimage.UBootFitImageTests.test_sign_standalone_uboot_fit_image": {
    "duration": 0.9126,
    "log": "MACHINE=qemux86-64 does not provide capability _cap_spl_dtb\n",
    "status": "SKIPPED"
   },
   "fitimage.UBootFitImageTests.test_sign_uboot_fit_image_without_spl": {
    "duration": 74.357,
    "status": "PASSED"
   },
   "fitimage.UBootFitImageTests.test_sign_uboot_kernel_individual": {
    "duration": 60.759,
    "status": "PASSED"
   },
   "fitimage.UBootFitImageTests.test_uboot_atf_tee_fit_image": {
    "duration": 0.8338,
    "log": "MACHINE=qemux86-64 does not provide capability _cap_atf_tee\n",
    "status": "SKIPPED"
   },
   "fitimage.UBootFitImageTests.test_uboot_fit_image": {
    "duration": 40.054,
    "status": "PASSED"
   },
   "gdbserver.GdbServerTest.test_gdb_server": {
    "duration": 126.63,
    "status": "PASSED"
   },
   "gitarchivetests.GitArchiveTests.test_create_first_test_tag": {
    "duration": 0.4951,
    "status": "PASSED"
   },
   "gitarchivetests.GitArchiveTests.test_create_second_test_tag": {
    "duration": 0.5348,
    "status": "PASSED"
   },
   "gitarchivetests.GitArchiveTests.test_get_revs_on_branch": {
    "duration": 0.3156,
    "status": "PASSED"
   },
   "gitarchivetests.GitArchiveTests.test_get_tags_with_only_local_tag": {
    "duration": 0.3237,
    "status": "PASSED"
   },
   "gitarchivetests.GitArchiveTests.test_get_tags_without_valid_remote": {
    "duration": 0.3583,
    "status": "PASSED"
   },
   "gitarchivetests.GitArchiveTests.test_get_tags_without_valid_remote_and_wrong_url": {
    "duration": 0.242,
    "status": "PASSED"
   },
   "gotoolchain.oeGoToolchainSelfTest.test_go_dep_build": {
    "duration": 8.728,
    "status": "PASSED"
   },
   "govendor.GoVendorSrcUriTests.test_basic": {
    "duration": 0.009344,
    "status": "PASSED"
   },
   "govendor.GoVendorSrcUriTests.test_non_git_vcs": {
    "duration": 0.006424,
    "status": "PASSED"
   },
   "govendor.GoVendorSrcUriTests.test_path_override": {
    "duration": 0.006398,
    "status": "PASSED"
   },
   "govendor.GoVendorSrcUriTests.test_pathmajor": {
    "duration": 0.006304,
    "status": "PASSED"
   },
   "govendor.GoVendorSrcUriTests.test_replaces": {
    "duration": 0.006539,
    "status": "PASSED"
   },
   "govendor.GoVendorSrcUriTests.test_subdir": {
    "duration": 0.006482,
    "status": "PASSED"
   },
   "govendor.GoVendorTaskTests.test_do_compile_succeeds": {
    "duration": 12.178,
    "status": "PASSED"
   },
   "govendor.GoVendorTaskTests.test_external_dep_copied_to_vendor": {
    "duration": 0.004631,
    "status": "PASSED"
   },
   "govendor.GoVendorTaskTests.test_go_import_vendor_symlink": {
    "duration": 0.004391,
    "status": "PASSED"
   },
   "govendor.GoVendorTaskTests.test_local_replacement_symlink": {
    "duration": 0.00445,
    "status": "PASSED"
   },
   "govendor.GoVendorTaskTests.test_modules_txt_in_vendor": {
    "duration": 0.004231,
    "status": "PASSED"
   },
   "govendor.GoVendorTaskTests.test_pathmajor_falls_back_to_root": {
    "duration": 0.004249,
    "status": "PASSED"
   },
   "govendor.GoVendorTaskTests.test_test_files_excluded_from_vendor": {
    "duration": 0.004198,
    "status": "PASSED"
   },
   "image_typedep.ImageTypeDepTests.test_conversion_typedep_added": {
    "duration": 23.429,
    "status": "PASSED"
   },
   "imagefeatures.ImageFeatures.test_all_users_can_connect_via_ssh_without_password": {
    "duration": 204.385,
    "oetags": [
     "runqemu"
    ],
    "status": "PASSED"
   },
   "imagefeatures.ImageFeatures.test_bmap": {
    "duration": 49.25,
    "status": "PASSED"
   },
   "imagefeatures.ImageFeatures.test_empty_image": {
    "duration": 20.479,
    "status": "PASSED"
   },
   "imagefeatures.ImageFeatures.test_hypervisor_fmts": {
    "duration": 63.458,
    "status": "PASSED"
   },
   "imagefeatures.ImageFeatures.test_image_fstypes": {
    "duration": 95.848,
    "status": "PASSED"
   },
   "imagefeatures.ImageFeatures.test_image_gen_debugfs": {
    "duration": 62.453,
    "status": "PASSED"
   },
   "imagefeatures.ImageFeatures.test_long_chain_conversion": {
    "duration": 46.487,
    "status": "PASSED"
   },
   "imagefeatures.ImageFeatures.test_mandb": {
    "duration": 83.714,
    "status": "PASSED"
   },
   "imagefeatures.ImageFeatures.test_no_busybox_base_utils": {
    "duration": 26.306,
    "status": "PASSED"
   },
   "imagefeatures.ImageFeatures.test_non_root_user_can_connect_via_ssh_without_password": {
    "duration": 63.402,
    "oetags": [
     "runqemu"
    ],
    "status": "PASSED"
   },
   "imagefeatures.ImageFeatures.test_useradd_static": {
    "duration": 63.054,
    "status": "PASSED"
   },
   "imagefeatures.ImageFeatures.test_wayland_support_in_image": {
    "duration": 110.257,
    "status": "PASSED"
   },
   "incompatible_lic.IncompatibleLicensePerImageTests.test_bash_and_license": {
    "duration": 43.721,
    "status": "PASSED"
   },
   "incompatible_lic.IncompatibleLicensePerImageTests.test_bash_default": {
    "duration": 45.026,
    "status": "PASSED"
   },
   "incompatible_lic.IncompatibleLicensePerImageTests.test_bash_license_exceptions": {
    "duration": 46.963,
    "status": "PASSED"
   },
   "incompatible_lic.IncompatibleLicensePerImageTests.test_bash_or_license": {
    "duration": 40.08,
    "status": "PASSED"
   },
   "incompatible_lic.IncompatibleLicensePerImageTests.test_spdx_exception": {
    "duration": 86.049,
    "status": "PASSED"
   },
   "incompatible_lic.IncompatibleLicenseTestObsolete.test_incompatible_alias_spdx_license": {
    "duration": 7.069,
    "status": "PASSED"
   },
   "incompatible_lic.IncompatibleLicenseTestObsolete.test_incompatible_alias_spdx_license_alias": {
    "duration": 6.237,
    "status": "PASSED"
   },
   "incompatible_lic.IncompatibleLicenseTestObsolete.test_incompatible_alias_spdx_license_alias_wildcard": {
    "duration": 6.094,
    "status": "PASSED"
   },
   "incompatible_lic.IncompatibleLicenseTestObsolete.test_incompatible_alias_spdx_license_wildcard": {
    "duration": 6.448,
    "status": "PASSED"
   },
   "incompatible_lic.IncompatibleLicenseTestObsolete.test_incompatible_all_licenses_wildcard": {
    "duration": 6.026,
    "status": "PASSED"
   },
   "incompatible_lic.IncompatibleLicenseTestObsolete.test_incompatible_spdx_license_alias_wildcard": {
    "duration": 6.202,
    "status": "PASSED"
   },
   "incompatible_lic.IncompatibleLicenseTestObsolete.test_incompatible_spdx_licenses_wildcard": {
    "duration": 6.238,
    "status": "PASSED"
   },
   "incompatible_lic.IncompatibleLicenseTests.test_incompatible_nonspdx_license": {
    "duration": 17.539,
    "status": "PASSED"
   },
   "incompatible_lic.IncompatibleLicenseTests.test_incompatible_spdx_license": {
    "duration": 17.802,
    "status": "PASSED"
   },
   "incompatible_lic.IncompatibleLicenseTests.test_incompatible_spdx_license_alias": {
    "duration": 3.201,
    "status": "PASSED"
   },
   "incompatible_lic.IncompatibleLicenseTests.test_incompatible_spdx_license_wildcard": {
    "duration": 16.981,
    "status": "PASSED"
   },
   "incompatible_lic.IncompatibleLicenseTests.test_incompatible_spdx_licenses": {
    "duration": 22.524,
    "status": "PASSED"
   },
   "incompatible_lic.NoGPL3InImagesTests.test_core_image_full_cmdline_weston": {
    "duration": 226.41,
    "status": "PASSED"
   },
   "incompatible_lic.NoGPL3InImagesTests.test_core_image_minimal": {
    "duration": 52.306,
    "status": "PASSED"
   },
   "install.InstallTests.test_gstreamer_plugins": {
    "duration": 97.297,
    "status": "PASSED"
   },
   "install.InstallTests.test_linux_firmware": {
    "duration": 122.741,
    "status": "PASSED"
   },
   "install.InstallTests.test_linux_modules": {
    "duration": 52.724,
    "status": "PASSED"
   },
   "install.InstallTests.test_perl": {
    "duration": 54.423,
    "status": "PASSED"
   },
   "install.InstallTests.test_python": {
    "duration": 50.24,
    "status": "PASSED"
   },
   "intercept.GitCheck.test_git_intercept": {
    "duration": 32.799,
    "status": "PASSED"
   },
   "kerneldevelopment.KernelDev.test_apply_patches": {
    "duration": 85.532,
    "status": "PASSED"
   },
   "kernelmodulesplit.KernelModuleSplit.test_cross_recipe_module_dependency": {
    "duration": 27.178,
    "status": "PASSED"
   },
   "layerappend.LayerAppendTests.test_layer_appends": {
    "duration": 48.859,
    "status": "PASSED"
   },
   "liboe.CopyTreeTests.test_copy_hardlink_tree_count": {
    "duration": 0.009029,
    "status": "PASSED"
   },
   "liboe.CopyTreeTests.test_copy_tree_special": {
    "duration": 0.006587,
    "status": "PASSED"
   },
   "liboe.CopyTreeTests.test_copy_tree_xattr": {
    "duration": 29.098,
    "status": "PASSED"
   },
   "liboe.PathTests.test_canonicalize_empty_string_returns_empty_string": {
    "duration": 0.005887,
    "status": "PASSED"
   },
   "liboe.PathTests.test_canonicalize_empty_token_between_paths_is_dropped": {
    "duration": 0.005377,
    "status": "PASSED"
   },
   "liboe.PathTests.test_canonicalize_multiple_variable_tokens_all_skipped": {
    "duration": 0.005163,
    "status": "PASSED"
   },
   "liboe.PathTests.test_canonicalize_none_returns_empty_string": {
    "duration": 0.005172,
    "status": "PASSED"
   },
   "liboe.PathTests.test_canonicalize_real_path_returned": {
    "duration": 0.005364,
    "status": "PASSED"
   },
   "liboe.PathTests.test_canonicalize_trailing_slash_preserved": {
    "duration": 0.005015,
    "status": "PASSED"
   },
   "liboe.PathTests.test_canonicalize_unexpanded_variable_is_skipped": {
    "duration": 0.004953,
    "status": "PASSED"
   },
   "liboe.PathTests.test_canonicalize_variable_and_trailing_slash_path": {
    "duration": 0.004997,
    "status": "PASSED"
   },
   "liboe.PathTests.test_canonicalize_variable_token_dropped_leaving_real_path": {
    "duration": 0.004965,
    "status": "PASSED"
   },
   "liboe.PathTests.test_is_path_parent_all_paths_must_be_below": {
    "duration": 0.005107,
    "status": "PASSED"
   },
   "liboe.PathTests.test_is_path_parent_child_is_not_parent_of_its_parent": {
    "duration": 0.004896,
    "status": "PASSED"
   },
   "liboe.PathTests.test_is_path_parent_direct_child": {
    "duration": 0.004904,
    "status": "PASSED"
   },
   "liboe.PathTests.test_is_path_parent_no_paths_returns_false": {
    "duration": 0.004915,
    "status": "PASSED"
   },
   "liboe.PathTests.test_is_path_parent_one_path_outside_fails": {
    "duration": 0.005869,
    "status": "PASSED"
   },
   "liboe.PathTests.test_is_path_parent_prefix_string_is_not_a_path_parent": {
    "duration": 0.004888,
    "status": "PASSED"
   },
   "liboe.PathTests.test_is_path_parent_unrelated_path": {
    "duration": 0.00488,
    "status": "PASSED"
   },
   "liboe.PathTests.test_join_absolute_rhs_is_not_special": {
    "duration": 0.004888,
    "status": "PASSED"
   },
   "liboe.PathTests.test_join_empty_leading_component_is_absolute": {
    "duration": 0.00548,
    "status": "PASSED"
   },
   "liboe.PathTests.test_join_pardir_normalised": {
    "duration": 0.004884,
    "status": "PASSED"
   },
   "liboe.PathTests.test_join_redundant_separators_normalised": {
    "duration": 0.004818,
    "status": "PASSED"
   },
   "liboe.PathTests.test_join_two_paths": {
    "duration": 0.004874,
    "status": "PASSED"
   },
   "liboe.PathTests.test_make_relative_symlink_absolute_becomes_relative_and_resolves": {
    "duration": 0.005335,
    "status": "PASSED"
   },
   "liboe.PathTests.test_make_relative_symlink_already_relative_unchanged": {
    "duration": 0.005096,
    "status": "PASSED"
   },
   "liboe.PathTests.test_make_relative_symlink_non_symlink_is_ignored": {
    "duration": 0.005064,
    "status": "PASSED"
   },
   "liboe.PathTests.test_make_relative_symlink_several_levels_deep_becomes_relative": {
    "duration": 0.005479,
    "status": "PASSED"
   },
   "liboe.PathTests.test_realpath_isdir_failure_falls_back_without_nameerror": {
    "duration": 0.00706,
    "status": "PASSED"
   },
   "liboe.PathTests.test_realpath_missing_component_raises_enoent_without_assume_dir": {
    "duration": 0.00614,
    "status": "PASSED"
   },
   "liboe.PathTests.test_realpath_missing_component_tolerated_with_assume_dir": {
    "duration": 0.005778,
    "status": "PASSED"
   },
   "liboe.PathTests.test_realpath_mutual_symlink_cycle_raises_eloop": {
    "duration": 0.01303,
    "status": "PASSED"
   },
   "liboe.PathTests.test_realpath_path_outside_root_raises": {
    "duration": 0.006314,
    "status": "PASSED"
   },
   "liboe.PathTests.test_realpath_plain_path_is_returned": {
    "duration": 0.006232,
    "status": "PASSED"
   },
   "liboe.PathTests.test_realpath_resolves_symlink_below_root": {
    "duration": 0.006114,
    "status": "PASSED"
   },
   "liboe.PathTests.test_realpath_resolves_symlink_several_components_deep": {
    "duration": 0.005647,
    "status": "PASSED"
   },
   "liboe.PathTests.test_realpath_self_referential_symlink_raises_eloop": {
    "duration": 0.00616,
    "status": "PASSED"
   },
   "liboe.PathTests.test_symlink_conflicting_existing_raises": {
    "duration": 0.00558,
    "status": "PASSED"
   },
   "liboe.PathTests.test_symlink_creates_dangling_symlink": {
    "duration": 0.00532,
    "status": "PASSED"
   },
   "liboe.PathTests.test_symlink_creates_symlink": {
    "duration": 0.005471,
    "status": "PASSED"
   },
   "liboe.PathTests.test_symlink_force_does_not_delete_glob_siblings": {
    "duration": 0.005885,
    "status": "PASSED"
   },
   "liboe.PathTests.test_symlink_force_overwrites_existing_symlink": {
    "duration": 0.00703,
    "status": "PASSED"
   },
   "liboe.PathTests.test_symlink_force_replaces_destination_with_glob_metacharacters": {
    "duration": 0.006821,
    "status": "PASSED"
   },
   "liboe.PathTests.test_symlink_force_replaces_existing_directory": {
    "duration": 0.007249,
    "status": "PASSED"
   },
   "liboe.PathTests.test_symlink_matching_existing_is_idempotent": {
    "duration": 0.007162,
    "status": "PASSED"
   },
   "liboe.PathTests.test_which_wild_explicit_search_path": {
    "duration": 0.007065,
    "status": "PASSED"
   },
   "liboe.PathTests.test_which_wild_first_match_per_name_wins": {
    "duration": 0.006952,
    "status": "PASSED"
   },
   "liboe.PathTests.test_which_wild_missing_tool_returns_empty": {
    "duration": 0.006992,
    "status": "PASSED"
   },
   "liboe.PathTests.test_which_wild_wildcard_pattern": {
    "duration": 0.007206,
    "status": "PASSED"
   },
   "liboe.SubprocessTests.test_subprocess_tweak": {
    "duration": 0.01304,
    "status": "PASSED"
   },
   "lic_checksum.LicenseTests.test_checksum_with_space": {
    "duration": 18.512,
    "status": "PASSED"
   },
   "lic_checksum.LicenseTests.test_nonmatching_checksum": {
    "duration": 16.78,
    "status": "PASSED"
   },
   "locales.LocalesTest.test_locales_off": {
    "duration": 63.041,
    "status": "PASSED"
   },
   "locales.LocalesTest.test_locales_on": {
    "duration": 50.129,
    "status": "PASSED"
   },
   "manifest.VerifyManifest.test_SDK_manifest_entries": {
    "duration": 320.781,
    "status": "PASSED"
   },
   "manifest.VerifyManifest.test_image_manifest_entries": {
    "duration": 10.706,
    "status": "PASSED"
   },
   "minidebuginfo.Minidebuginfo.test_minidebuginfo": {
    "duration": 65.59,
    "status": "PASSED"
   },
   "minidebuginfo.Minidebuginfo.test_minidebuginfo_qemu": {
    "duration": 105.159,
    "oetags": [
     "runqemu"
    ],
    "status": "PASSED"
   },
   "multiconfig.MultiConfig.test_multiconfig": {
    "duration": 240.178,
    "status": "PASSED"
   },
   "multiconfig.MultiConfig.test_multiconfig_inlayer": {
    "duration": 36.357,
    "status": "PASSED"
   },
   "multiconfig.MultiConfig.test_multiconfig_reparse": {
    "duration": 61.813,
    "status": "PASSED"
   },
   "newlib.NewlibTest.test_newlib": {
    "duration": 30.816,
    "status": "PASSED"
   },
   "oelib.buildhistory.TestBlobParsing.test_blob_to_dict": {
    "duration": 0.7717,
    "status": "PASSED"
   },
   "oelib.buildhistory.TestBlobParsing.test_compare_dict_blobs": {
    "duration": 0.531,
    "status": "PASSED"
   },
   "oelib.buildhistory.TestBlobParsing.test_compare_dict_blobs_default": {
    "duration": 0.5221,
    "status": "PASSED"
   },
   "oelib.buildhistory.TestFileListCompare.test_compare_file_lists": {
    "duration": 0.08375,
    "status": "PASSED"
   },
   "oelib.elf.TestElf.test_machine_name": {
    "duration": 0.0004799,
    "status": "PASSED"
   },
   "oelib.license.TestComplexCombinations.test_tests": {
    "duration": 0.001809,
    "status": "PASSED"
   },
   "oelib.license.TestIsIncluded.test_tests": {
    "duration": 0.006357,
    "status": "PASSED"
   },
   "oelib.license.TestSimpleCombinations.test_tests": {
    "duration": 0.001236,
    "status": "PASSED"
   },
   "oelib.license.TestSingleLicense.test_invalid_licenses": {
    "duration": 0.0007551,
    "status": "PASSED"
   },
   "oelib.license.TestSingleLicense.test_single_licenses": {
    "duration": 0.0004213,
    "status": "PASSED"
   },
   "oelib.license.TestSort.test_sort": {
    "duration": 0.005946,
    "status": "PASSED"
   },
   "oelib.package.TestCopyDebugSources.test_copydebugsources_copies_files_and_dereferences_links": {
    "duration": 0.009731,
    "status": "PASSED"
   },
   "oelib.package.TestCopyDebugSources.test_copydebugsources_ignores_copy_failure": {
    "duration": 0.004281,
    "status": "PASSED"
   },
   "oelib.package.TestCopyDebugSources.test_copydebugsources_ignores_empty_externalsrc_relocation": {
    "duration": 0.005364,
    "status": "PASSED"
   },
   "oelib.package.TestCopyDebugSources.test_copydebugsources_moves_externalsrc_relocation": {
    "duration": 0.009834,
    "status": "PASSED"
   },
   "oelib.patch.TestGitApplyTree.test_dirty_push_run_false_returns_argv": {
    "duration": 0.178,
    "status": "PASSED"
   },
   "oelib.patch.TestGitApplyTree.test_fallback_preserves_original_patch_name": {
    "duration": 0.4386,
    "status": "PASSED"
   },
   "oelib.patch.TestGitApplyTree.test_git_am_preserves_original_patch_name": {
    "duration": 0.4184,
    "status": "PASSED"
   },
   "oelib.patch.TestGitApplyTree.test_push_run_false_returns_argv": {
    "duration": 0.3263,
    "status": "PASSED"
   },
   "oelib.patch.TestPatchTree.test_push_run_false_returns_argv": {
    "duration": 0.001149,
    "status": "PASSED"
   },
   "oelib.patch.TestRunCmd.test_runcmd_allows_explicit_shell": {
    "duration": 0.001598,
    "status": "PASSED"
   },
   "oelib.patch.TestRunCmd.test_runcmd_preserves_argv_elements": {
    "duration": 0.01373,
    "status": "PASSED"
   },
   "oelib.patch.TestRunCmd.test_runcmd_reports_exit_status": {
    "duration": 0.01384,
    "status": "PASSED"
   },
   "oelib.patch.TestRunCmd.test_runcmd_wraps_exec_failure": {
    "duration": 0.0005217,
    "status": "PASSED"
   },
   "oelib.path.TestRealPath.test_loop": {
    "duration": 0.004092,
    "status": "PASSED"
   },
   "oelib.path.TestRealPath.test_norm": {
    "duration": 0.003029,
    "status": "PASSED"
   },
   "oelib.path.TestRealPath.test_phys": {
    "duration": 0.001846,
    "status": "PASSED"
   },
   "oelib.types.TestBooleanType.test_bool_equality": {
    "duration": 0.0003462,
    "status": "PASSED"
   },
   "oelib.types.TestBooleanType.test_false": {
    "duration": 0.0003347,
    "status": "PASSED"
   },
   "oelib.types.TestBooleanType.test_invalid": {
    "duration": 0.0003984,
    "status": "PASSED"
   },
   "oelib.types.TestBooleanType.test_true": {
    "duration": 0.000366,
    "status": "PASSED"
   },
   "oelib.types.TestList.test_list_nosep": {
    "duration": 0.001577,
    "status": "PASSED"
   },
   "oelib.types.TestList.test_list_usersep": {
    "duration": 0.001687,
    "status": "PASSED"
   },
   "oelib.utils.TestDefaultFeatures.test_filter_default_features": {
    "duration": 0.0005677,
    "status": "PASSED"
   },
   "oelib.utils.TestMultiprocessLaunch.test_multiprocesslaunch": {
    "duration": 0.02834,
    "status": "PASSED"
   },
   "oelib.utils.TestPackagesFilterOutSystem.test_filter": {
    "duration": 0.000499,
    "status": "PASSED"
   },
   "oelib.utils.TestTrimVersion.test_num_exception": {
    "duration": 0.0005178,
    "status": "PASSED"
   },
   "oelib.utils.TestTrimVersion.test_valid": {
    "duration": 0.0005941,
    "status": "PASSED"
   },
   "oelib.utils.TestTrimVersion.test_version_exception": {
    "duration": 0.0007148,
    "status": "PASSED"
   },
   "oescripts.OEGitproxyTests.test_oegitproxy_help": {
    "duration": 0.3626,
    "status": "PASSED"
   },
   "oescripts.OEGitproxyTests.test_oegitproxy_proxy": {
    "duration": 0.2608,
    "status": "PASSED"
   },
   "oescripts.OEGitproxyTests.test_oegitproxy_proxy_dash": {
    "duration": 0.2044,
    "status": "PASSED"
   },
   "oescripts.OEListPackageconfigTests.test_packageconfig_flags_default": {
    "duration": 203.293,
    "status": "PASSED"
   },
   "oescripts.OEListPackageconfigTests.test_packageconfig_flags_help": {
    "duration": 0.2457,
    "status": "PASSED"
   },
   "oescripts.OEListPackageconfigTests.test_packageconfig_flags_option_all": {
    "duration": 205.335,
    "status": "PASSED"
   },
   "oescripts.OEListPackageconfigTests.test_packageconfig_flags_option_flags": {
    "duration": 183.561,
    "status": "PASSED"
   },
   "oescripts.OEListPackageconfigTests.test_packageconfig_flags_options_preferred_only": {
    "duration": 195.397,
    "status": "PASSED"
   },
   "oescripts.OEPybootchartguyTests.test_pybootchartguy_help": {
    "duration": 0.07246,
    "status": "PASSED"
   },
   "oescripts.OEPybootchartguyTests.test_pybootchartguy_to_generate_build_pdf_output": {
    "duration": 0.1211,
    "status": "PASSED"
   },
   "oescripts.OEPybootchartguyTests.test_pybootchartguy_to_generate_build_png_output": {
    "duration": 0.2455,
    "status": "PASSED"
   },
   "oescripts.OEPybootchartguyTests.test_pybootchartguy_to_generate_build_svg_output": {
    "duration": 0.09539,
    "status": "PASSED"
   },
   "oescripts.OeRunNativeTest.test_oe_run_native": {
    "duration": 22.693,
    "status": "PASSED"
   },
   "overlayfs.OverlayFSEtcRunTimeTests.test_all_required_variables_set": {
    "duration": 199.797,
    "oetags": [
     "runqemu"
    ],
    "status": "PASSED"
   },
   "overlayfs.OverlayFSEtcRunTimeTests.test_image_feature_conflict": {
    "duration": 3.966,
    "oetags": [
     "runqemu"
    ],
    "status": "PASSED"
   },
   "overlayfs.OverlayFSEtcRunTimeTests.test_image_feature_is_missing": {
    "duration": 99.055,
    "oetags": [
     "runqemu"
    ],
    "status": "PASSED"
   },
   "overlayfs.OverlayFSEtcRunTimeTests.test_lower_layer_access": {
    "duration": 88.795,
    "oetags": [
     "runqemu"
    ],
    "status": "PASSED"
   },
   "overlayfs.OverlayFSEtcRunTimeTests.test_postinst_on_target_for_read_only_rootfs": {
    "duration": 89.71,
    "oetags": [
     "runqemu"
    ],
    "status": "PASSED"
   },
   "overlayfs.OverlayFSEtcRunTimeTests.test_sbin_init_original": {
    "duration": 113.912,
    "oetags": [
     "runqemu"
    ],
    "status": "PASSED"
   },
   "overlayfs.OverlayFSEtcRunTimeTests.test_sbin_init_preinit": {
    "duration": 102.951,
    "oetags": [
     "runqemu"
    ],
    "status": "PASSED"
   },
   "overlayfs.OverlayFSEtcRunTimeTests.test_sbin_init_read_only": {
    "duration": 98.265,
    "oetags": [
     "runqemu"
    ],
    "status": "PASSED"
   },
   "overlayfs.OverlayFSTests.test_correct_image_fstab": {
    "duration": 99.375,
    "oetags": [
     "runqemu"
    ],
    "status": "PASSED"
   },
   "overlayfs.OverlayFSTests.test_correct_image_unit": {
    "duration": 63.013,
    "oetags": [
     "runqemu"
    ],
    "status": "PASSED"
   },
   "overlayfs.OverlayFSTests.test_distro_features_missing": {
    "duration": 19.735,
    "status": "PASSED"
   },
   "overlayfs.OverlayFSTests.test_mount_unit_not_set": {
    "duration": 16.819,
    "status": "PASSED"
   },
   "overlayfs.OverlayFSTests.test_not_all_units_installed": {
    "duration": 54.466,
    "status": "PASSED"
   },
   "overlayfs.OverlayFSTests.test_not_all_units_installed_but_qa_skipped": {
    "duration": 60.434,
    "status": "PASSED"
   },
   "overlayfs.OverlayFSTests.test_wrong_mount_unit_set": {
    "duration": 16.084,
    "status": "PASSED"
   },
   "package.PackageTests.test_gdb_hardlink_debug": {
    "duration": 76.606,
    "status": "PASSED"
   },
   "package.PackageTests.test_package_name_conflict": {
    "duration": 14.895,
    "status": "PASSED"
   },
   "package.PackageTests.test_preserve_ownership": {
    "duration": 63.013,
    "status": "PASSED"
   },
   "package.PackageTests.test_preserve_sparse_hardlinks": {
    "duration": 38.359,
    "status": "PASSED"
   },
   "package.VersionOrdering.test_dpkg": {
    "duration": 0.0324,
    "status": "PASSED"
   },
   "package.VersionOrdering.test_opkg": {
    "duration": 0.03338,
    "status": "PASSED"
   },
   "package.VersionOrdering.test_rpm": {
    "duration": 0.1582,
    "status": "PASSED"
   },
   "picolibc.PicolibcTest.test_picolibc": {
    "duration": 0.7394,
    "log": "This test only works with machines : qemuarm qemuarm64 qemuriscv32 qemuriscv64\n",
    "status": "SKIPPED"
   },
   "pkgdata.OePkgdataUtilTests.test_find_path": {
    "duration": 2.369,
    "status": "PASSED"
   },
   "pkgdata.OePkgdataUtilTests.test_glob": {
    "duration": 2.587,
    "status": "PASSED"
   },
   "pkgdata.OePkgdataUtilTests.test_list_pkg_files": {
    "duration": 8.055,
    "status": "PASSED"
   },
   "pkgdata.OePkgdataUtilTests.test_list_pkgs": {
    "duration": 8.048,
    "status": "PASSED"
   },
   "pkgdata.OePkgdataUtilTests.test_lookup_pkg": {
    "duration": 5.809,
    "status": "PASSED"
   },
   "pkgdata.OePkgdataUtilTests.test_lookup_recipe": {
    "duration": 3.253,
    "status": "PASSED"
   },
   "pkgdata.OePkgdataUtilTests.test_multilib_variables": {
    "duration": 41.671,
    "status": "PASSED"
   },
   "pkgdata.OePkgdataUtilTests.test_no_param": {
    "duration": 0.05229,
    "status": "PASSED"
   },
   "pkgdata.OePkgdataUtilTests.test_read_value": {
    "duration": 2.795,
    "status": "PASSED"
   },
   "pkgdata.OePkgdataUtilTests.test_specify_pkgdatadir": {
    "duration": 0.9609,
    "status": "PASSED"
   },
   "pokybleeding.PokyBleeding.test_poky_bleeding_autorev": {
    "duration": 63.432,
    "status": "PASSED"
   },
   "prservice.BitbakePrTests.test_import_export_override_db": {
    "duration": 154.946,
    "status": "PASSED"
   },
   "prservice.BitbakePrTests.test_import_export_replace_db": {
    "duration": 87.863,
    "status": "PASSED"
   },
   "prservice.BitbakePrTests.test_pr_service_deb_arch_dep": {
    "duration": 60.683,
    "status": "PASSED"
   },
   "prservice.BitbakePrTests.test_pr_service_deb_arch_indep": {
    "duration": 31.595,
    "status": "PASSED"
   },
   "prservice.BitbakePrTests.test_pr_service_ipk_arch_dep": {
    "duration": 58.436,
    "status": "PASSED"
   },
   "prservice.BitbakePrTests.test_pr_service_ipk_arch_indep": {
    "duration": 25.624,
    "status": "PASSED"
   },
   "prservice.BitbakePrTests.test_pr_service_rpm_arch_dep": {
    "duration": 50.07,
    "status": "PASSED"
   },
   "prservice.BitbakePrTests.test_pr_service_rpm_arch_indep": {
    "duration": 26.209,
    "status": "PASSED"
   },
   "prservice.BitbakePrTests.test_stopping_prservice_message": {
    "duration": 0.2804,
    "status": "PASSED"
   },
   "pseudo.Pseudo.test_pseudo_pyc_creation": {
    "duration": 9.059,
    "status": "PASSED"
   },
   "recipetool.RecipetoolAppendTests.test_recipetool_appendfile_add": {
    "duration": 69.527,
    "status": "PASSED"
   },
   "recipetool.RecipetoolAppendTests.test_recipetool_appendfile_add_bindir": {
    "duration": 26.915,
    "status": "PASSED"
   },
   "recipetool.RecipetoolAppendTests.test_recipetool_appendfile_add_machine": {
    "duration": 25.573,
    "status": "PASSED"
   },
   "recipetool.RecipetoolAppendTests.test_recipetool_appendfile_alternatives": {
    "duration": 28.821,
    "status": "PASSED"
   },
   "recipetool.RecipetoolAppendTests.test_recipetool_appendfile_basic": {
    "duration": 26.84,
    "status": "PASSED"
   },
   "recipetool.RecipetoolAppendTests.test_recipetool_appendfile_binary": {
    "duration": 17.016,
    "status": "PASSED"
   },
   "recipetool.RecipetoolAppendTests.test_recipetool_appendfile_extlayer": {
    "duration": 5.506,
    "status": "PASSED"
   },
   "recipetool.RecipetoolAppendTests.test_recipetool_appendfile_inst_func": {
    "duration": 25.76,
    "status": "PASSED"
   },
   "recipetool.RecipetoolAppendTests.test_recipetool_appendfile_inst_glob": {
    "duration": 28.775,
    "status": "PASSED"
   },
   "recipetool.RecipetoolAppendTests.test_recipetool_appendfile_inst_todir_glob": {
    "duration": 29.729,
    "status": "PASSED"
   },
   "recipetool.RecipetoolAppendTests.test_recipetool_appendfile_invalid": {
    "duration": 28.233,
    "status": "PASSED"
   },
   "recipetool.RecipetoolAppendTests.test_recipetool_appendfile_orig": {
    "duration": 27.505,
    "status": "PASSED"
   },
   "recipetool.RecipetoolAppendTests.test_recipetool_appendfile_patch": {
    "duration": 26.308,
    "status": "PASSED"
   },
   "recipetool.RecipetoolAppendTests.test_recipetool_appendfile_postinstall": {
    "duration": 30.054,
    "status": "PASSED"
   },
   "recipetool.RecipetoolAppendTests.test_recipetool_appendfile_renamed": {
    "duration": 25.584,
    "status": "PASSED"
   },
   "recipetool.RecipetoolAppendTests.test_recipetool_appendfile_script": {
    "duration": 24.899,
    "status": "PASSED"
   },
   "recipetool.RecipetoolAppendTests.test_recipetool_appendfile_subdir": {
    "duration": 24.443,
    "status": "PASSED"
   },
   "recipetool.RecipetoolAppendTests.test_recipetool_appendfile_todir": {
    "duration": 24.361,
    "status": "PASSED"
   },
   "recipetool.RecipetoolAppendTests.test_recipetool_appendfile_wildcard": {
    "duration": 12.719,
    "status": "PASSED"
   },
   "recipetool.RecipetoolAppendsrcTests.test_recipetool_appendsrcfile_basic": {
    "duration": 56.469,
    "status": "PASSED"
   },
   "recipetool.RecipetoolAppendsrcTests.test_recipetool_appendsrcfile_basic_wildcard": {
    "duration": 33.408,
    "status": "PASSED"
   },
   "recipetool.RecipetoolAppendsrcTests.test_recipetool_appendsrcfile_existing_in_src_uri": {
    "duration": 17.053,
    "status": "PASSED"
   },
   "recipetool.RecipetoolAppendsrcTests.test_recipetool_appendsrcfile_existing_in_src_uri_diff_params": {
    "duration": 18.323,
    "status": "PASSED"
   },
   "recipetool.RecipetoolAppendsrcTests.test_recipetool_appendsrcfile_machine": {
    "duration": 44.131,
    "status": "PASSED"
   },
   "recipetool.RecipetoolAppendsrcTests.test_recipetool_appendsrcfile_replace_file_srcdir": {
    "duration": 27.976,
    "status": "PASSED"
   },
   "recipetool.RecipetoolAppendsrcTests.test_recipetool_appendsrcfile_srcdir_basic": {
    "duration": 17.575,
    "status": "PASSED"
   },
   "recipetool.RecipetoolAppendsrcTests.test_recipetool_appendsrcfile_subdir_basic": {
    "duration": 30.477,
    "status": "PASSED"
   },
   "recipetool.RecipetoolAppendsrcTests.test_recipetool_appendsrcfile_subdir_basic_dirdest": {
    "duration": 28.072,
    "status": "PASSED"
   },
   "recipetool.RecipetoolAppendsrcTests.test_recipetool_appendsrcfile_update_recipe_basic": {
    "duration": 8.749,
    "status": "PASSED"
   },
   "recipetool.RecipetoolAppendsrcTests.test_recipetool_appendsrcfiles_basic": {
    "duration": 34.051,
    "status": "PASSED"
   },
   "recipetool.RecipetoolAppendsrcTests.test_recipetool_appendsrcfiles_basic_subdir": {
    "duration": 32.576,
    "status": "PASSED"
   },
   "recipetool.RecipetoolCreateTests.test_recipetool_create": {
    "duration": 26.664,
    "status": "PASSED"
   },
   "recipetool.RecipetoolCreateTests.test_recipetool_create_autotools": {
    "duration": 49.073,
    "status": "PASSED"
   },
   "recipetool.RecipetoolCreateTests.test_recipetool_create_cmake": {
    "duration": 21.667,
    "status": "PASSED"
   },
   "recipetool.RecipetoolCreateTests.test_recipetool_create_git_http": {
    "duration": 21.581,
    "status": "PASSED"
   },
   "recipetool.RecipetoolCreateTests.test_recipetool_create_git_srcbranch": {
    "duration": 20.752,
    "status": "PASSED"
   },
   "recipetool.RecipetoolCreateTests.test_recipetool_create_git_srcuri_branch": {
    "duration": 26.658,
    "status": "PASSED"
   },
   "recipetool.RecipetoolCreateTests.test_recipetool_create_git_srcuri_master": {
    "duration": 22.232,
    "status": "PASSED"
   },
   "recipetool.RecipetoolCreateTests.test_recipetool_create_github": {
    "duration": 24.126,
    "status": "PASSED"
   },
   "recipetool.RecipetoolCreateTests.test_recipetool_create_github_tarball": {
    "duration": 26.497,
    "status": "PASSED"
   },
   "recipetool.RecipetoolCreateTests.test_recipetool_create_go": {
    "duration": 32.594,
    "status": "PASSED"
   },
   "recipetool.RecipetoolCreateTests.test_recipetool_create_npm": {
    "duration": 1.151,
    "log": "Test needs meta-oe for nodejs\n",
    "status": "SKIPPED"
   },
   "recipetool.RecipetoolCreateTests.test_recipetool_create_python3_pep517_flit_core_buildapi": {
    "duration": 24.29,
    "status": "PASSED"
   },
   "recipetool.RecipetoolCreateTests.test_recipetool_create_python3_pep517_hatchling": {
    "duration": 22.381,
    "status": "PASSED"
   },
   "recipetool.RecipetoolCreateTests.test_recipetool_create_python3_pep517_maturin": {
    "duration": 22.866,
    "status": "PASSED"
   },
   "recipetool.RecipetoolCreateTests.test_recipetool_create_python3_pep517_mesonpy": {
    "duration": 24.992,
    "status": "PASSED"
   },
   "recipetool.RecipetoolCreateTests.test_recipetool_create_python3_pep517_poetry_core_masonry_api": {
    "duration": 27.702,
    "status": "PASSED"
   },
   "recipetool.RecipetoolCreateTests.test_recipetool_create_python3_pep517_setuptools_build_meta": {
    "duration": 24.165,
    "status": "PASSED"
   },
   "recipetool.RecipetoolCreateTests.test_recipetool_create_python3_pep517_setuptools_build_meta_license_pep639": {
    "duration": 26.634,
    "status": "PASSED"
   },
   "recipetool.RecipetoolCreateTests.test_recipetool_create_python3_pep517_setuptools_build_meta_license_prepep639": {
    "duration": 23.67,
    "status": "PASSED"
   },
   "recipetool.RecipetoolCreateTests.test_recipetool_create_python3_setuptools": {
    "duration": 23.838,
    "status": "PASSED"
   },
   "recipetool.RecipetoolCreateTests.test_recipetool_create_python3_setuptools_pypi": {
    "duration": 43.778,
    "status": "PASSED"
   },
   "recipetool.RecipetoolCreateTests.test_recipetool_create_python3_setuptools_pypi_tarball": {
    "duration": 21.712,
    "status": "PASSED"
   },
   "recipetool.RecipetoolCreateTests.test_recipetool_create_simple": {
    "duration": 21.791,
    "status": "PASSED"
   },
   "recipetool.RecipetoolTests.test_recipetool_handle_license_vars": {
    "duration": 2.191,
    "status": "PASSED"
   },
   "recipetool.RecipetoolTests.test_recipetool_load_plugin": {
    "duration": 9.714,
    "status": "PASSED"
   },
   "recipetool.RecipetoolTests.test_recipetool_split_pkg_licenses": {
    "duration": 0.02305,
    "status": "PASSED"
   },
   "recipeutils.RecipeUtilsTests.test_patch_recipe_appends": {
    "duration": 0.08174,
    "status": "PASSED"
   },
   "recipeutils.RecipeUtilsTests.test_patch_recipe_singleappend": {
    "duration": 0.05638,
    "status": "PASSED"
   },
   "recipeutils.RecipeUtilsTests.test_patch_recipe_varflag": {
    "duration": 0.04193,
    "status": "PASSED"
   },
   "recipeutils.RecipeUtilsTests.test_split_var_value": {
    "duration": 0.005618,
    "status": "PASSED"
   },
   "recipeutils.RecipeUtilsTests.test_validate_pn": {
    "duration": 0.005928,
    "status": "PASSED"
   },
   "reproducible.DiffoscopeTests.test_diffoscope": {
    "log": "Skip by the command line argument \"reproducible\"\n",
    "status": "SKIPPED"
   },
   "reproducible.ReproducibleTests.test_reproducible_builds": {
    "log": "Skip by the command line argument \"reproducible\"\n",
    "status": "SKIPPED"
   },
   "resulttooltests.ResultToolTests.test_can_compare_ltp_tests": {
    "duration": 0.006292,
    "status": "PASSED"
   },
   "resulttooltests.ResultToolTests.test_can_match_non_static_ptest_names": {
    "duration": 0.004386,
    "status": "PASSED"
   },
   "resulttooltests.ResultToolTests.test_can_not_compare_non_ltp_tests": {
    "duration": 0.004292,
    "status": "PASSED"
   },
   "resulttooltests.ResultToolTests.test_junit_empty_testresults": {
    "duration": 0.004448,
    "status": "PASSED"
   },
   "resulttooltests.ResultToolTests.test_junit_log_attached": {
    "duration": 0.004532,
    "status": "PASSED"
   },
   "resulttooltests.ResultToolTests.test_junit_log_inline": {
    "duration": 0.004344,
    "status": "PASSED"
   },
   "resulttooltests.ResultToolTests.test_junit_missing_image_tests": {
    "duration": 0.004286,
    "status": "PASSED"
   },
   "resulttooltests.ResultToolTests.test_junit_missing_ptests": {
    "duration": 0.00427,
    "status": "PASSED"
   },
   "resulttooltests.ResultToolTests.test_machine_matches": {
    "duration": 0.00421,
    "status": "PASSED"
   },
   "resulttooltests.ResultToolTests.test_machine_mismatches": {
    "duration": 0.004205,
    "status": "PASSED"
   },
   "resulttooltests.ResultToolTests.test_merge_can_merged_results": {
    "duration": 0.004434,
    "status": "PASSED"
   },
   "resulttooltests.ResultToolTests.test_metadata_matching_is_only_checked_for_relevant_test_type": {
    "duration": 0.004289,
    "status": "PASSED"
   },
   "resulttooltests.ResultToolTests.test_regression_can_get_regression_base_target_pair": {
    "duration": 0.004226,
    "status": "PASSED"
   },
   "resulttooltests.ResultToolTests.test_regression_can_get_regression_result": {
    "duration": 0.00436,
    "status": "PASSED"
   },
   "resulttooltests.ResultToolTests.test_report_can_aggregate_test_result": {
    "duration": 0.004287,
    "status": "PASSED"
   },
   "resulttooltests.ResultToolTests.test_results_with_matching_metadata_can_be_compared": {
    "duration": 0.004214,
    "status": "PASSED"
   },
   "resulttooltests.ResultToolTests.test_results_with_mismatching_metadata_can_not_be_compared": {
    "duration": 0.004688,
    "status": "PASSED"
   },
   "resulttooltests.ResultToolTests.test_results_without_metadata_can_be_compared": {
    "duration": 0.004262,
    "status": "PASSED"
   },
   "resulttooltests.ResultToolTests.test_target_result_with_missing_metadata_can_not_be_compared": {
    "duration": 0.004222,
    "status": "PASSED"
   },
   "retain.Retain.test_retain_always": {
    "duration": 28.65,
    "status": "PASSED"
   },
   "retain.Retain.test_retain_failure": {
    "duration": 36.703,
    "status": "PASSED"
   },
   "retain.Retain.test_retain_global": {
    "duration": 60.912,
    "status": "PASSED"
   },
   "retain.Retain.test_retain_misc": {
    "duration": 61.917,
    "status": "PASSED"
   },
   "rootfspostcommandstests.ShadowUtilsTidyFiles.test_shadowutils_backup_files": {
    "duration": 21.937,
    "log": "Testcase skipped as 'tidy_shadowutils_files' rootfs post process command is not the set SORT_PASSWD_POSTPROCESS_COMMAND.\n",
    "status": "SKIPPED"
   },
   "rootfspostcommandstests.ShadowUtilsTidyFiles.test_shadowutils_sorted_files": {
    "duration": 4.307,
    "log": "Testcase skipped as 'tidy_shadowutils_files' rootfs post process command is not the set SORT_PASSWD_POSTPROCESS_COMMAND.\n",
    "status": "SKIPPED"
   },
   "rpmtests.BitbakeTests.test_rpm_filenames": {
    "duration": 6.476,
    "status": "PASSED"
   },
   "runcmd.RunCmdTests.test_list_not_found": {
    "duration": 0.006286,
    "status": "PASSED"
   },
   "runcmd.RunCmdTests.test_list_okay": {
    "duration": 0.02761,
    "status": "PASSED"
   },
   "runcmd.RunCmdTests.test_log": {
    "duration": 0.007574,
    "status": "PASSED"
   },
   "runcmd.RunCmdTests.test_log_split": {
    "duration": 0.007262,
    "status": "PASSED"
   },
   "runcmd.RunCmdTests.test_no_shell": {
    "duration": 0.007069,
    "status": "PASSED"
   },
   "runcmd.RunCmdTests.test_output": {
    "duration": 0.007657,
    "status": "PASSED"
   },
   "runcmd.RunCmdTests.test_output_split": {
    "duration": 0.007364,
    "status": "PASSED"
   },
   "runcmd.RunCmdTests.test_result_assertion": {
    "duration": 0.01037,
    "status": "PASSED"
   },
   "runcmd.RunCmdTests.test_result_exception": {
    "duration": 0.01024,
    "status": "PASSED"
   },
   "runcmd.RunCmdTests.test_result_false": {
    "duration": 0.009553,
    "status": "PASSED"
   },
   "runcmd.RunCmdTests.test_result_okay": {
    "duration": 0.01,
    "status": "PASSED"
   },
   "runcmd.RunCmdTests.test_shell": {
    "duration": 0.009813,
    "status": "PASSED"
   },
   "runcmd.RunCmdTests.test_stdin": {
    "duration": 0.007705,
    "status": "PASSED"
   },
   "runcmd.RunCmdTests.test_stdin_timeout": {
    "duration": 10.007,
    "status": "PASSED"
   },
   "runcmd.RunCmdTests.test_timeout": {
    "duration": 10.009,
    "status": "PASSED"
   },
   "runcmd.RunCmdTests.test_timeout_split": {
    "duration": 10.01,
    "status": "PASSED"
   },
   "runqemu.RunqemuTests.test_boot_compressed_wic_by_path": {
    "duration": 92.013,
    "oetags": [
     "runqemu"
    ],
    "status": "PASSED"
   },
   "runqemu.RunqemuTests.test_boot_compressed_wic_by_recipe": {
    "duration": 26.586,
    "oetags": [
     "runqemu"
    ],
    "status": "PASSED"
   },
   "runqemu.RunqemuTests.test_boot_deploy": {
    "duration": 19.356,
    "oetags": [
     "runqemu"
    ],
    "status": "PASSED"
   },
   "runqemu.RunqemuTests.test_boot_deploy_hddimg": {
    "duration": 20.458,
    "oetags": [
     "runqemu"
    ],
    "status": "PASSED"
   },
   "runqemu.RunqemuTests.test_boot_machine": {
    "duration": 21.709,
    "oetags": [
     "runqemu"
    ],
    "status": "PASSED"
   },
   "runqemu.RunqemuTests.test_boot_machine_ext4": {
    "duration": 22.121,
    "oetags": [
     "runqemu"
    ],
    "status": "PASSED"
   },
   "runqemu.RunqemuTests.test_boot_machine_iso": {
    "duration": 22.591,
    "oetags": [
     "runqemu"
    ],
    "status": "PASSED"
   },
   "runqemu.RunqemuTests.test_boot_machine_slirp": {
    "duration": 24.438,
    "oetags": [
     "runqemu"
    ],
    "status": "PASSED"
   },
   "runqemu.RunqemuTests.test_boot_machine_slirp_qcow2": {
    "duration": 30.945,
    "oetags": [
     "runqemu"
    ],
    "status": "PASSED"
   },
   "runqemu.RunqemuTests.test_boot_qemu_boot": {
    "duration": 19.69,
    "oetags": [
     "runqemu"
    ],
    "status": "PASSED"
   },
   "runqemu.RunqemuTests.test_boot_recipe_image": {
    "duration": 28.599,
    "oetags": [
     "runqemu"
    ],
    "status": "PASSED"
   },
   "runqemu.RunqemuTests.test_boot_recipe_image_vdi": {
    "duration": 26.996,
    "oetags": [
     "runqemu"
    ],
    "status": "PASSED"
   },
   "runqemu.RunqemuTests.test_boot_recipe_image_vmdk": {
    "duration": 25.732,
    "oetags": [
     "runqemu"
    ],
    "status": "PASSED"
   },
   "runqemu.RunqemuTests.test_boot_rootfs": {
    "duration": 19.396,
    "oetags": [
     "runqemu"
    ],
    "status": "PASSED"
   },
   "runtime_test.Postinst.test_failing_postinst": {
    "duration": 153.715,
    "oetags": [
     "runqemu"
    ],
    "status": "PASSED"
   },
   "runtime_test.Postinst.test_postinst_rootfs_and_boot_systemd": {
    "duration": 285.376,
    "oetags": [
     "runqemu"
    ],
    "status": "PASSED"
   },
   "runtime_test.Postinst.test_postinst_rootfs_and_boot_sysvinit": {
    "duration": 211.931,
    "oetags": [
     "runqemu"
    ],
    "status": "PASSED"
   },
   "runtime_test.RustKernel.test_kernel_rust_sample": {
    "duration": 71.172,
    "oetags": [
     "runqemu"
    ],
    "status": "PASSED"
   },
   "runtime_test.SystemTap.test_crosstap_helloworld": {
    "duration": 124.02,
    "oetags": [
     "runqemu"
    ],
    "status": "PASSED"
   },
   "runtime_test.SystemTap.test_crosstap_pstree": {
    "duration": 40.172,
    "oetags": [
     "runqemu"
    ],
    "status": "PASSED"
   },
   "runtime_test.SystemTap.test_crosstap_syscalls_by_pid": {
    "duration": 39.379,
    "oetags": [
     "runqemu"
    ],
    "status": "PASSED"
   },
   "runtime_test.SystemTap.test_crosstap_syscalls_by_proc": {
    "duration": 40.139,
    "oetags": [
     "runqemu"
    ],
    "status": "PASSED"
   },
   "runtime_test.TestExport.test_testexport_basic": {
    "duration": 79.394,
    "oetags": [
     "runqemu"
    ],
    "status": "PASSED"
   },
   "runtime_test.TestExport.test_testexport_sdk": {
    "duration": 79.334,
    "status": "PASSED"
   },
   "runtime_test.TestImage.test_testimage_apt": {
    "duration": 149.47,
    "oetags": [
     "runqemu"
    ],
    "status": "PASSED"
   },
   "runtime_test.TestImage.test_testimage_dnf": {
    "duration": 120.617,
    "oetags": [
     "runqemu"
    ],
    "status": "PASSED"
   },
   "runtime_test.TestImage.test_testimage_install": {
    "duration": 112.625,
    "oetags": [
     "runqemu"
    ],
    "status": "PASSED"
   },
   "runtime_test.TestImage.test_testimage_slirp": {
    "duration": 87.146,
    "oetags": [
     "runqemu"
    ],
    "status": "PASSED"
   },
   "runtime_test.TestImage.test_testimage_virgl_gtk_sdl": {
    "duration": 127.296,
    "oetags": [
     "runqemu"
    ],
    "status": "PASSED"
   },
   "runtime_test.TestImage.test_testimage_virgl_headless": {
    "duration": 54.707,
    "oetags": [
     "runqemu"
    ],
    "status": "PASSED"
   },
   "rust.RustStaticMuslTest.test_static_musl_linking": {
    "duration": 40.664,
    "status": "PASSED"
   },
   "sdk.SDKTests.test_sdk_manifests": {
    "duration": 364.166,
    "status": "PASSED"
   },
   "sdk.SDKTests.test_sdk_runqemu": {
    "duration": 364.956,
    "status": "PASSED"
   },
   "selftest.ExternalLayer.test_list_imported": {
    "duration": 0.007555,
    "status": "PASSED"
   },
   "signing.LockedSignatures.test_locked_signatures": {
    "duration": 93.98,
    "status": "PASSED"
   },
   "signing.Signing.test_signing_packages": {
    "duration": 108.255,
    "status": "PASSED"
   },
   "signing.Signing.test_signing_sstate_archive": {
    "duration": 130.651,
    "status": "PASSED"
   },
   "spdx.SPDX30Check.test_baremetal_helloworld": {
    "duration": 43.923,
    "status": "PASSED"
   },
   "spdx.SPDX30Check.test_base_files": {
    "duration": 36.218,
    "status": "PASSED"
   },
   "spdx.SPDX30Check.test_core_image_minimal": {
    "duration": 48.65,
    "status": "PASSED"
   },
   "spdx.SPDX30Check.test_core_image_minimal_sdk": {
    "duration": 321.616,
    "status": "PASSED"
   },
   "spdx.SPDX30Check.test_custom_annotation_vars": {
    "duration": 24.534,
    "status": "PASSED"
   },
   "spdx.SPDX30Check.test_download_location_defensive_handling": {
    "duration": 13.635,
    "status": "PASSED"
   },
   "spdx.SPDX30Check.test_extra_opts": {
    "duration": 71.672,
    "status": "PASSED"
   },
   "spdx.SPDX30Check.test_gcc_include_source": {
    "duration": 74.315,
    "status": "PASSED"
   },
   "spdx.SPDX30Check.test_kernel_config_spdx": {
    "duration": 97.658,
    "status": "PASSED"
   },
   "spdx.SPDX30Check.test_packageconfig_spdx": {
    "duration": 25.653,
    "status": "PASSED"
   },
   "spdx.SPDX30Check.test_version_extraction_patterns": {
    "duration": 10.549,
    "status": "PASSED"
   },
   "spdx.SPDX30Check.test_world_sbom": {
    "duration": 30.142,
    "status": "PASSED"
   },
   "sstatetests.SStateCacheManagement.test_sstate_cache_management_script_using_machine": {
    "duration": 118.403,
    "status": "PASSED"
   },
   "sstatetests.SStateCacheManagement.test_sstate_cache_management_script_using_pr_1": {
    "duration": 43.882,
    "status": "PASSED"
   },
   "sstatetests.SStateCacheManagement.test_sstate_cache_management_script_using_pr_2": {
    "duration": 60.49,
    "status": "PASSED"
   },
   "sstatetests.SStateCacheManagement.test_sstate_cache_management_script_using_pr_3": {
    "duration": 102.939,
    "status": "PASSED"
   },
   "sstatetests.SStateCleanup.test_cleansstate_task_distro_nonspecific": {
    "duration": 41.444,
    "status": "PASSED"
   },
   "sstatetests.SStateCleanup.test_cleansstate_task_distro_specific": {
    "duration": 36.008,
    "status": "PASSED"
   },
   "sstatetests.SStateCleanup.test_cleansstate_task_distro_specific_nonspecific": {
    "duration": 41.539,
    "status": "PASSED"
   },
   "sstatetests.SStateCreation.test_sstate_creation_distro_nonspecific": {
    "duration": 29.075,
    "status": "PASSED"
   },
   "sstatetests.SStateCreation.test_sstate_creation_distro_specific": {
    "duration": 31.715,
    "status": "PASSED"
   },
   "sstatetests.SStateDistroTests.test_rebuild_distro_specific_sstate_cross_native_targets": {
    "duration": 45.676,
    "status": "PASSED"
   },
   "sstatetests.SStateDistroTests.test_rebuild_distro_specific_sstate_cross_target": {
    "duration": 54.324,
    "status": "PASSED"
   },
   "sstatetests.SStateDistroTests.test_rebuild_distro_specific_sstate_native_target": {
    "duration": 49.172,
    "status": "PASSED"
   },
   "sstatetests.SStateFindSiginfo.test_sstate_compare_sigfiles_and_find_siginfo": {
    "duration": 233.298,
    "status": "PASSED"
   },
   "sstatetests.SStateHashSameSigs.test_sstate_32_64_same_hash": {
    "duration": 100.526,
    "status": "PASSED"
   },
   "sstatetests.SStateHashSameSigs.test_sstate_nativelsbstring_same_hash": {
    "duration": 87.956,
    "status": "PASSED"
   },
   "sstatetests.SStateHashSameSigs.test_sstate_sdk_arch_same_hash": {
    "duration": 73.733,
    "status": "PASSED"
   },
   "sstatetests.SStateHashSameSigs2.test_sstate_allarch_samesigs": {
    "duration": 95.13,
    "status": "PASSED"
   },
   "sstatetests.SStateHashSameSigs2.test_sstate_nativesdk_samesigs_multilib": {
    "duration": 115.947,
    "status": "PASSED"
   },
   "sstatetests.SStateHashSameSigs3.test_sstate_multilib_or_not_native_samesigs": {
    "duration": 51.211,
    "status": "PASSED"
   },
   "sstatetests.SStateHashSameSigs3.test_sstate_sametune_samesigs": {
    "duration": 145.426,
    "status": "PASSED"
   },
   "sstatetests.SStateHashSameSigs4.test_sstate_movelayer_samesigs": {
    "duration": 56.53,
    "status": "PASSED"
   },
   "sstatetests.SStateHashSameSigs4.test_sstate_noop_samesigs": {
    "duration": 88.543,
    "status": "PASSED"
   },
   "sstatetests.SStatePrintdiff.test_gcc_runtime_vs_gcc_source": {
    "duration": 2065.514,
    "status": "PASSED"
   },
   "sstatetests.SStatePrintdiff.test_image_minimal_vs_base_do_configure": {
    "duration": 416.067,
    "status": "PASSED"
   },
   "sstatetests.SStatePrintdiff.test_image_minimal_vs_perlcross": {
    "duration": 196.084,
    "status": "PASSED"
   },
   "sstatetests.SStateTests.test_autorev_sstate_works": {
    "duration": 85.314,
    "status": "PASSED"
   },
   "sysroot.SysrootTests.test_sysroot_cleanup": {
    "duration": 57.041,
    "status": "PASSED"
   },
   "sysroot.SysrootTests.test_sysroot_la": {
    "duration": 28.233,
    "status": "PASSED"
   },
   "sysroot.SysrootTests.test_sysroot_max_shebang": {
    "duration": 13.635,
    "status": "PASSED"
   },
   "sysroot.SysrootTests.test_sysroot_pkgconfig": {
    "duration": 28.683,
    "status": "PASSED"
   },
   "systemd_boot.Systemdboot.test_efi_systemdboot_images_can_be_built": {
    "duration": 103.085,
    "status": "PASSED"
   },
   "tinfoil.TinfoilTests.test_datastore_operations": {
    "duration": 0.5195,
    "status": "PASSED"
   },
   "tinfoil.TinfoilTests.test_expand": {
    "duration": 0.5072,
    "status": "PASSED"
   },
   "tinfoil.TinfoilTests.test_getvar": {
    "duration": 1.008,
    "status": "PASSED"
   },
   "tinfoil.TinfoilTests.test_getvar_bb_origenv": {
    "duration": 0.7574,
    "status": "PASSED"
   },
   "tinfoil.TinfoilTests.test_list_recipes": {
    "duration": 4.692,
    "status": "PASSED"
   },
   "tinfoil.TinfoilTests.test_parse_recipe": {
    "duration": 4.272,
    "status": "PASSED"
   },
   "tinfoil.TinfoilTests.test_parse_recipe_copy_expand": {
    "duration": 3.937,
    "status": "PASSED"
   },
   "tinfoil.TinfoilTests.test_parse_recipe_custom_data": {
    "duration": 3.972,
    "status": "PASSED"
   },
   "tinfoil.TinfoilTests.test_parse_virtual_recipe": {
    "duration": 3.857,
    "status": "PASSED"
   },
   "tinfoil.TinfoilTests.test_parse_virtual_recipe_custom_data": {
    "duration": 4.602,
    "status": "PASSED"
   },
   "tinfoil.TinfoilTests.test_run_prepared_task": {
    "duration": 44.734,
    "status": "PASSED"
   },
   "tinfoil.TinfoilTests.test_setvariable_clean": {
    "duration": 3.017,
    "status": "PASSED"
   },
   "tinfoil.TinfoilTests.test_variable_history": {
    "duration": 3.842,
    "status": "PASSED"
   },
   "tinfoil.TinfoilTests.test_wait_event": {
    "duration": 2.003,
    "status": "PASSED"
   },
   "toolchain.ToolchainTests.test_toolchain_switching": {
    "duration": 82.767,
    "status": "PASSED"
   },
   "uboot.UBootConfigTest.test_uboot_config_extract": {
    "duration": 22.41,
    "status": "PASSED"
   },
   "uboot.UBootConfigTest.test_uboot_config_extract_error_missing_config": {
    "duration": 16.521,
    "status": "PASSED"
   },
   "uboot.UBootConfigTest.test_uboot_config_extract_error_nothing_set": {
    "duration": 20.678,
    "status": "PASSED"
   },
   "uboot.UBootConfigTest.test_uboot_config_extract_error_set_both_config_and_machine": {
    "duration": 21.377,
    "status": "PASSED"
   },
   "uboot.UBootConfigTest.test_uboot_config_extract_error_set_uboot_config_binary": {
    "duration": 17.81,
    "status": "PASSED"
   },
   "uboot.UBootConfigTest.test_uboot_config_extract_error_set_uboot_config_fragments": {
    "duration": 16.29,
    "status": "PASSED"
   },
   "uboot.UBootConfigTest.test_uboot_config_extract_error_set_uboot_config_image_fstypes": {
    "duration": 17.037,
    "status": "PASSED"
   },
   "uboot.UBootConfigTest.test_uboot_config_extract_error_set_uboot_config_make_opts": {
    "duration": 17.76,
    "status": "PASSED"
   },
   "uboot.UBootConfigTest.test_uboot_config_extract_legacy": {
    "duration": 19.613,
    "status": "PASSED"
   },
   "uboot.UBootConfigTest.test_uboot_config_extract_single_config": {
    "duration": 21.695,
    "status": "PASSED"
   },
   "uboot.UBootTest.test_boot_uboot": {
    "duration": 0.0004408,
    "log": "Test skipped on x86_64\n",
    "oetags": [
     "runqemu"
    ],
    "status": "SKIPPED"
   },
   "uboot.UBootTest.test_boot_uboot_kvm_to_full_target": {
    "duration": 0.0005438,
    "log": "Test skipped on x86_64\n",
    "oetags": [
     "runqemu"
    ],
    "status": "SKIPPED"
   },
   "uboot.UBootTest.test_uboot_config_initial_env_binary": {
    "duration": 28.564,
    "status": "PASSED"
   },
   "uboot.UBootTest.test_uboot_initial_env_binary": {
    "duration": 22.462,
    "status": "PASSED"
   },
   "uki.UkiTest.test_uki_boot_systemd": {
    "duration": 117.73,
    "oetags": [
     "runqemu"
    ],
    "status": "PASSED"
   },
   "uki.UkiTest.test_uki_sysvinit": {
    "duration": 114.585,
    "oetags": [
     "runqemu"
    ],
    "status": "PASSED"
   },
   "usergrouptests.UserGroupTests.test_add_task_between_p_sysroot_and_package": {
    "duration": 14.109,
    "status": "PASSED"
   },
   "usergrouptests.UserGroupTests.test_group_from_dep_package": {
    "duration": 22.102,
    "status": "PASSED"
   },
   "usergrouptests.UserGroupTests.test_postinst_order": {
    "duration": 8.183,
    "status": "PASSED"
   },
   "usergrouptests.UserGroupTests.test_static_useradd_from_dynamic": {
    "duration": 114.309,
    "status": "PASSED"
   },
   "usergrouptests.UserGroupTests.test_useradd_depends_only": {
    "duration": 7.454,
    "status": "PASSED"
   },
   "wic.CLITests.test_createhelp": {
    "duration": 44.006,
    "status": "PASSED"
   },
   "wic.CLITests.test_help": {
    "duration": 3.719,
    "status": "PASSED"
   },
   "wic.CLITests.test_help_create": {
    "duration": 3.595,
    "status": "PASSED"
   },
   "wic.CLITests.test_help_kickstart": {
    "duration": 3.53,
    "status": "PASSED"
   },
   "wic.CLITests.test_help_list": {
    "duration": 3.543,
    "status": "PASSED"
   },
   "wic.CLITests.test_help_overview": {
    "duration": 3.547,
    "status": "PASSED"
   },
   "wic.CLITests.test_help_plugins": {
    "duration": 3.666,
    "status": "PASSED"
   },
   "wic.CLITests.test_list_images": {
    "duration": 6.48,
    "status": "PASSED"
   },
   "wic.CLITests.test_list_source_plugins": {
    "duration": 5.383,
    "status": "PASSED"
   },
   "wic.CLITests.test_listed_images_help": {
    "duration": 50.96,
    "status": "PASSED"
   },
   "wic.CLITests.test_listhelp": {
    "duration": 2.717,
    "status": "PASSED"
   },
   "wic.CLITests.test_no_command": {
    "duration": 3.748,
    "status": "PASSED"
   },
   "wic.CLITests.test_unsupported_subcommand": {
    "duration": 3.671,
    "status": "PASSED"
   },
   "wic.CLITests.test_version": {
    "duration": 3.666,
    "status": "PASSED"
   },
   "wic.ModifyTests.test_wic_cp": {
    "duration": 82.718,
    "status": "PASSED"
   },
   "wic.ModifyTests.test_wic_cp_ext": {
    "duration": 45.995,
    "status": "PASSED"
   },
   "wic.ModifyTests.test_wic_ls": {
    "duration": 29.781,
    "status": "PASSED"
   },
   "wic.ModifyTests.test_wic_ls_ext": {
    "duration": 27.741,
    "status": "PASSED"
   },
   "wic.ModifyTests.test_wic_rm": {
    "duration": 39.61,
    "status": "PASSED"
   },
   "wic.ModifyTests.test_wic_rm_ext": {
    "duration": 37.103,
    "status": "PASSED"
   },
   "wic.Wic.test_bootloader_config": {
    "duration": 128.302,
    "status": "PASSED"
   },
   "wic.Wic.test_build_artifacts": {
    "duration": 25.695,
    "status": "PASSED"
   },
   "wic.Wic.test_build_image_name": {
    "duration": 21.982,
    "status": "PASSED"
   },
   "wic.Wic.test_build_rootfs_long": {
    "duration": 49.588,
    "status": "PASSED"
   },
   "wic.Wic.test_build_rootfs_short": {
    "duration": 31.343,
    "status": "PASSED"
   },
   "wic.Wic.test_change_directory": {
    "duration": 21.57,
    "status": "PASSED"
   },
   "wic.Wic.test_change_directory_errors": {
    "duration": 35.853,
    "status": "PASSED"
   },
   "wic.Wic.test_compress_bzip2": {
    "duration": 24.1,
    "status": "PASSED"
   },
   "wic.Wic.test_compress_gzip": {
    "duration": 22.383,
    "status": "PASSED"
   },
   "wic.Wic.test_compress_xz": {
    "duration": 30.404,
    "status": "PASSED"
   },
   "wic.Wic.test_debug_long": {
    "duration": 23.137,
    "status": "PASSED"
   },
   "wic.Wic.test_debug_short": {
    "duration": 23.347,
    "status": "PASSED"
   },
   "wic.Wic.test_default_output_dir": {
    "duration": 58.138,
    "status": "PASSED"
   },
   "wic.Wic.test_efi_bootpart": {
    "duration": 49.95,
    "status": "PASSED"
   },
   "wic.Wic.test_exclude_path": {
    "duration": 30.757,
    "status": "PASSED"
   },
   "wic.Wic.test_exclude_path_errors": {
    "duration": 39.328,
    "status": "PASSED"
   },
   "wic.Wic.test_exclude_path_with_extra_space": {
    "duration": 73.198,
    "status": "PASSED"
   },
   "wic.Wic.test_extra_space": {
    "duration": 22.19,
    "status": "PASSED"
   },
   "wic.Wic.test_gpt_image": {
    "duration": 27.019,
    "status": "PASSED"
   },
   "wic.Wic.test_grub_install_pcbios": {
    "duration": 77.472,
    "status": "PASSED"
   },
   "wic.Wic.test_include_path": {
    "duration": 25.641,
    "status": "PASSED"
   },
   "wic.Wic.test_include_path_embeded": {
    "duration": 28.07,
    "status": "PASSED"
   },
   "wic.Wic.test_include_path_errors": {
    "duration": 64.778,
    "status": "PASSED"
   },
   "wic.Wic.test_iso_image": {
    "duration": 81.067,
    "status": "PASSED"
   },
   "wic.Wic.test_kernel_install": {
    "duration": 31.51,
    "status": "PASSED"
   },
   "wic.Wic.test_mkefidisk": {
    "duration": 23.529,
    "status": "PASSED"
   },
   "wic.Wic.test_no_fstab_update": {
    "duration": 36.771,
    "status": "PASSED"
   },
   "wic.Wic.test_no_fstab_update_errors": {
    "duration": 43.396,
    "status": "PASSED"
   },
   "wic.Wic.test_no_table": {
    "duration": 23.158,
    "status": "PASSED"
   },
   "wic.Wic.test_partition_hidden_attributes": {
    "duration": 29.131,
    "status": "PASSED"
   },
   "wic.Wic.test_permissions": {
    "duration": 217.603,
    "status": "PASSED"
   },
   "wic.Wic.test_qemux86_directdisk": {
    "duration": 20.743,
    "status": "PASSED"
   },
   "wic.Wic.test_rootfs_artifacts": {
    "duration": 46.63,
    "status": "PASSED"
   },
   "wic.Wic.test_rootfs_indirect_recipes": {
    "duration": 21.375,
    "status": "PASSED"
   },
   "wic.Wic.test_sdimage_bootpart": {
    "duration": 41.129,
    "status": "PASSED"
   },
   "wic.Wic.test_skip_build_check_long": {
    "duration": 21.463,
    "status": "PASSED"
   },
   "wic.Wic.test_skip_build_check_short": {
    "duration": 23.026,
    "status": "PASSED"
   },
   "wic.Wic.test_skip_kernel_install": {
    "duration": 31.624,
    "status": "PASSED"
   },
   "wic.Wic.test_systemd_bootdisk": {
    "duration": 71.338,
    "status": "PASSED"
   },
   "wic.Wic.test_wic_sector_size_cli": {
    "duration": 58.338,
    "status": "PASSED"
   },
   "wic.Wic.test_wic_sector_size_env": {
    "duration": 58.129,
    "status": "PASSED"
   },
   "wic.Wic.test_wrong_compressor": {
    "duration": 3.984,
    "status": "PASSED"
   },
   "wic.Wic2.test_biosplusefi_plugin": {
    "duration": 149.074,
    "status": "PASSED"
   },
   "wic.Wic2.test_biosplusefi_plugin_qemu": {
    "duration": 35.456,
    "oetags": [
     "runqemu"
    ],
    "status": "PASSED"
   },
   "wic.Wic2.test_bmap_long": {
    "duration": 22.344,
    "status": "PASSED"
   },
   "wic.Wic2.test_bmap_short": {
    "duration": 22.647,
    "status": "PASSED"
   },
   "wic.Wic2.test_diskid_on_gpt_partition": {
    "duration": 26.385,
    "status": "PASSED"
   },
   "wic.Wic2.test_diskid_on_msdos_partition": {
    "duration": 25.138,
    "status": "PASSED"
   },
   "wic.Wic2.test_efi_plugin_plain_systemd_boot_qemu_aarch64": {
    "duration": 0.0007164,
    "log": "Test skipped on x86_64\n",
    "oetags": [
     "runqemu"
    ],
    "status": "SKIPPED"
   },
   "wic.Wic2.test_efi_plugin_plain_systemd_boot_qemu_x86": {
    "duration": 122.371,
    "oetags": [
     "runqemu"
    ],
    "status": "PASSED"
   },
   "wic.Wic2.test_efi_plugin_unified_kernel_image_qemu": {
    "duration": 111.207,
    "oetags": [
     "runqemu"
    ],
    "status": "PASSED"
   },
   "wic.Wic2.test_empty_plugin": {
    "duration": 63.937,
    "status": "PASSED"
   },
   "wic.Wic2.test_empty_zeroize_plugin": {
    "duration": 37.318,
    "status": "PASSED"
   },
   "wic.Wic2.test_expand_mbr_image": {
    "duration": 67.15,
    "oetags": [
     "runqemu"
    ],
    "status": "PASSED"
   },
   "wic.Wic2.test_extra_filesystem_space": {
    "duration": 25.954,
    "status": "PASSED"
   },
   "wic.Wic2.test_extra_partition_plugin": {
    "duration": 62.349,
    "status": "PASSED"
   },
   "wic.Wic2.test_extra_partition_space": {
    "duration": 27.21,
    "status": "PASSED"
   },
   "wic.Wic2.test_fixed_size": {
    "duration": 23.41,
    "status": "PASSED"
   },
   "wic.Wic2.test_fixed_size_error": {
    "duration": 22.335,
    "status": "PASSED"
   },
   "wic.Wic2.test_fs_types": {
    "duration": 21.674,
    "status": "PASSED"
   },
   "wic.Wic2.test_gpt_partition_name": {
    "duration": 62.713,
    "status": "PASSED"
   },
   "wic.Wic2.test_image_bootpart_globbed": {
    "duration": 41.008,
    "status": "PASSED"
   },
   "wic.Wic2.test_image_env": {
    "duration": 39.904,
    "status": "PASSED"
   },
   "wic.Wic2.test_image_vars_dir_long": {
    "duration": 6.961,
    "status": "PASSED"
   },
   "wic.Wic2.test_image_vars_dir_short": {
    "duration": 8.367,
    "status": "PASSED"
   },
   "wic.Wic2.test_kickstart_parser": {
    "duration": 22.566,
    "status": "PASSED"
   },
   "wic.Wic2.test_mkfs_extraopts": {
    "duration": 22.411,
    "status": "PASSED"
   },
   "wic.Wic2.test_offset": {
    "duration": 129.469,
    "status": "PASSED"
   },
   "wic.Wic2.test_qemu": {
    "duration": 91.903,
    "oetags": [
     "runqemu"
    ],
    "status": "PASSED"
   },
   "wic.Wic2.test_qemu_efi": {
    "duration": 81.234,
    "oetags": [
     "runqemu"
    ],
    "status": "PASSED"
   },
   "wic.Wic2.test_rawcopy_plugin": {
    "duration": 72.064,
    "status": "PASSED"
   },
   "wic.Wic2.test_rawcopy_plugin_qemu": {
    "duration": 87.558,
    "oetags": [
     "runqemu"
    ],
    "status": "PASSED"
   },
   "wic.Wic2.test_rawcopy_plugin_unpack": {
    "duration": 72.962,
    "status": "PASSED"
   },
   "wic.Wic2.test_uefi_kernel": {
    "duration": 70.913,
    "status": "PASSED"
   },
   "wic.Wic2.test_wic_image_type": {
    "duration": 28.209,
    "status": "PASSED"
   },
   "wrapper.WrapperTests.test_shebang_wrapper": {
    "duration": 27.771,
    "status": "PASSED"
   },
   "yoctotestresultsquerytests.TestResultsQueryTests.test_create_workdir": {
    "duration": 2.893,
    "status": "PASSED"
   },
   "yoctotestresultsquerytests.TestResultsQueryTests.test_get_sha1": {
    "duration": 0.04443,
    "status": "PASSED"
   }
  }
 },
 "oeselftest_rocky-8.10_qemux86-64_20260914011803": {
  "configuration": {
   "HOST_DISTRO": "rocky-8.10",
   "HOST_NAME": "rocky8-vk-1",
   "LAYERS": {
    "meta": {
     "branch": "master",
     "commit": "f94ae3d6ba49aef86f497998c0e0232a5039510a",
     "commit_count": 68785,
     "commit_time": 1789288366
    },
    "meta-poky": {
     "branch": "master",
     "commit": "7e41504cd63b099b214f10d92cfdaf358ab98c5f",
     "commit_count": 1821,
     "commit_time": 1788885316
    },
    "meta-selftest": {
     "branch": "master",
     "commit": "f94ae3d6ba49aef86f497998c0e0232a5039510a",
     "commit_count": 68785,
     "commit_time": 1789288366
    },
    "meta-yocto-bsp": {
     "branch": "master",
     "commit": "7e41504cd63b099b214f10d92cfdaf358ab98c5f",
     "commit_count": 1821,
     "commit_time": 1788885316
    }
   },
   "MACHINE": "qemux86-64",
   "OESELFTEST_METADATA": {
    "exclude_tags": [
     "yocto-mirrors",
     "machine",
     "toolchain-user",
     "toolchain-system"
    ],
    "run_all_tests": true,
    "run_tests": null,
    "select_tags": null,
    "skips": [
     "distrodata.Distrodata.test_checkpkg",
     "reproducible"
    ]
   },
   "STARTTIME": "20260914011803",
   "TESTSERIES": "oeqa",
   "TEST_TYPE": "oeselftest"
  },
  "result": {
   "archiver.Archiver.test_archiver_allows_to_filter_on_recipe_name": {
    "duration": 38.07,
    "status": "PASSED"
   },
   "archiver.Archiver.test_archiver_cleanup": {
    "duration": 65.586,
    "status": "PASSED"
   },
   "archiver.Archiver.test_archiver_filters_by_type": {
    "duration": 28.016,
    "status": "PASSED"
   },
   "archiver.Archiver.test_archiver_filters_by_type_and_name": {
    "duration": 29.426,
    "status": "PASSED"
   },
   "archiver.Archiver.test_archiver_mode_configured": {
    "duration": 25.252,
    "status": "PASSED"
   },
   "archiver.Archiver.test_archiver_mode_diff": {
    "duration": 28.173,
    "status": "PASSED"
   },
   "archiver.Archiver.test_archiver_mode_dumpdata": {
    "duration": 10.398,
    "status": "PASSED"
   },
   "archiver.Archiver.test_archiver_mode_mirror": {
    "duration": 28.46,
    "status": "PASSED"
   },
   "archiver.Archiver.test_archiver_mode_mirror_combined": {
    "duration": 30.658,
    "status": "PASSED"
   },
   "archiver.Archiver.test_archiver_mode_mirror_excludes": {
    "duration": 25.368,
    "status": "PASSED"
   },
   "archiver.Archiver.test_archiver_mode_mirror_gitsm": {
    "duration": 13.783,
    "status": "PASSED"
   },
   "archiver.Archiver.test_archiver_mode_mirror_gitsm_shallow": {
    "duration": 39.533,
    "status": "PASSED"
   },
   "archiver.Archiver.test_archiver_mode_original": {
    "duration": 28.069,
    "status": "PASSED"
   },
   "archiver.Archiver.test_archiver_mode_patched": {
    "duration": 13.739,
    "status": "PASSED"
   },
   "archiver.Archiver.test_archiver_mode_recipe": {
    "duration": 27.993,
    "status": "PASSED"
   },
   "archiver.Archiver.test_archiver_multiconfig_shared_unpack_and_patch": {
    "duration": 117.822,
    "status": "PASSED"
   },
   "barebox.BareboxTest.test_boot_barebox": {
    "duration": 0.003217,
    "log": "Test skipped on x86_64\n",
    "oetags": [
     "runqemu"
    ],
    "status": "SKIPPED"
   },
   "baremetal.BaremetalTest.test_baremetal": {
    "duration": 60.845,
    "status": "PASSED"
   },
   "bbclasses.Systemd.test_systemd_in_distro": {
    "duration": 71.838,
    "status": "PASSED"
   },
   "bbclasses.Systemd.test_sysvinit_in_distro": {
    "duration": 31.25,
    "status": "PASSED"
   },
   "bblayers.BitbakeConfigBuild.test_enable_disable_builtin_fragments": {
    "duration": 23.335,
    "status": "PASSED"
   },
   "bblayers.BitbakeConfigBuild.test_enable_disable_fragments": {
    "duration": 17.581,
    "status": "PASSED"
   },
   "bblayers.BitbakeConfigBuild.test_show_fragment": {
    "duration": 2.293,
    "status": "PASSED"
   },
   "bblayers.BitbakeLayers.test_bitbakelayers_add_remove": {
    "duration": 9.993,
    "status": "PASSED"
   },
   "bblayers.BitbakeLayers.test_bitbakelayers_createlayer": {
    "duration": 6.747,
    "status": "PASSED"
   },
   "bblayers.BitbakeLayers.test_bitbakelayers_flatten": {
    "duration": 46.749,
    "status": "PASSED"
   },
   "bblayers.BitbakeLayers.test_bitbakelayers_layerindexshowdepends": {
    "duration": 1.533,
    "status": "PASSED"
   },
   "bblayers.BitbakeLayers.test_bitbakelayers_setup": {
    "duration": 26.992,
    "status": "PASSED"
   },
   "bblayers.BitbakeLayers.test_bitbakelayers_showappends": {
    "duration": 7.648,
    "status": "PASSED"
   },
   "bblayers.BitbakeLayers.test_bitbakelayers_showcrossdepends": {
    "duration": 24.69,
    "status": "PASSED"
   },
   "bblayers.BitbakeLayers.test_bitbakelayers_showlayers": {
    "duration": 0.6266,
    "status": "PASSED"
   },
   "bblayers.BitbakeLayers.test_bitbakelayers_showoverlayed": {
    "duration": 3.505,
    "status": "PASSED"
   },
   "bblayers.BitbakeLayers.test_bitbakelayers_showrecipes": {
    "duration": 24.712,
    "status": "PASSED"
   },
   "bblayers.BitbakeLayers.test_bitbakelayers_updatelayer": {
    "duration": 8.259,
    "status": "PASSED"
   },
   "bblayers.BitbakeLayers.test_validate_bitbake_setup_default_registry": {
    "duration": 1.747,
    "status": "PASSED"
   },
   "bblayers.BitbakeLayers.test_validate_examplelayersjson": {
    "duration": 0.2153,
    "status": "PASSED"
   },
   "bblock.BBLock.test_lock_architecture_specific": {
    "duration": 89.858,
    "status": "PASSED"
   },
   "bblock.BBLock.test_lock_multiple_recipe_single_task": {
    "duration": 234.835,
    "status": "PASSED"
   },
   "bblock.BBLock.test_lock_single_recipe_all_tasks": {
    "duration": 137.833,
    "status": "PASSED"
   },
   "bblock.BBLock.test_lock_single_recipe_multiple_tasks": {
    "duration": 119.942,
    "status": "PASSED"
   },
   "bblock.BBLock.test_lock_single_recipe_single_task": {
    "duration": 109.864,
    "status": "PASSED"
   },
   "bblogging.BitBakeLogging.test_python_exec_func_python_loggingA": {
    "duration": 40.702,
    "status": "PASSED"
   },
   "bblogging.BitBakeLogging.test_python_exec_func_python_loggingB": {
    "duration": 29.637,
    "status": "PASSED"
   },
   "bblogging.BitBakeLogging.test_python_exec_func_python_loggingC": {
    "duration": 29.239,
    "status": "PASSED"
   },
   "bblogging.BitBakeLogging.test_python_exec_func_python_loggingD": {
    "duration": 10.866,
    "status": "PASSED"
   },
   "bblogging.BitBakeLogging.test_python_exec_func_shell_loggingA": {
    "duration": 14.172,
    "status": "PASSED"
   },
   "bblogging.BitBakeLogging.test_python_exec_func_shell_loggingB": {
    "duration": 14.497,
    "status": "PASSED"
   },
   "bblogging.BitBakeLogging.test_python_exec_func_shell_loggingC": {
    "duration": 13.642,
    "status": "PASSED"
   },
   "bblogging.BitBakeLogging.test_python_exec_func_shell_loggingD": {
    "duration": 13.84,
    "status": "PASSED"
   },
   "bblogging.BitBakeLogging.test_python_exit_loggingA": {
    "duration": 11.964,
    "status": "PASSED"
   },
   "bblogging.BitBakeLogging.test_python_exit_loggingB": {
    "duration": 13.422,
    "status": "PASSED"
   },
   "bblogging.BitBakeLogging.test_python_exit_loggingC": {
    "duration": 13.52,
    "status": "PASSED"
   },
   "bblogging.BitBakeLogging.test_python_exit_loggingD": {
    "duration": 11.717,
    "status": "PASSED"
   },
   "bblogging.BitBakeLogging.test_python_fatal_loggingA": {
    "duration": 12.683,
    "status": "PASSED"
   },
   "bblogging.BitBakeLogging.test_python_fatal_loggingB": {
    "duration": 15.793,
    "status": "PASSED"
   },
   "bblogging.BitBakeLogging.test_python_fatal_loggingC": {
    "duration": 11.848,
    "status": "PASSED"
   },
   "bblogging.BitBakeLogging.test_python_fatal_loggingD": {
    "duration": 13.487,
    "status": "PASSED"
   },
   "bblogging.BitBakeLogging.test_shell_loggingA": {
    "duration": 11.968,
    "status": "PASSED"
   },
   "bblogging.BitBakeLogging.test_shell_loggingB": {
    "duration": 12.163,
    "status": "PASSED"
   },
   "bblogging.BitBakeLogging.test_shell_loggingC": {
    "duration": 13.35,
    "status": "PASSED"
   },
   "bblogging.BitBakeLogging.test_shell_loggingD": {
    "duration": 11.785,
    "status": "PASSED"
   },
   "bbtests.BitbakeTests.test_bb_env_bb_getvar_equality": {
    "duration": 3.344,
    "status": "PASSED"
   },
   "bbtests.BitbakeTests.test_bbappend_order": {
    "duration": 34.308,
    "status": "PASSED"
   },
   "bbtests.BitbakeTests.test_bitbake_g": {
    "duration": 5.713,
    "status": "PASSED"
   },
   "bbtests.BitbakeTests.test_bitbake_invalid_recipe": {
    "duration": 1.099,
    "status": "PASSED"
   },
   "bbtests.BitbakeTests.test_bitbake_invalid_target": {
    "duration": 7.228,
    "status": "PASSED"
   },
   "bbtests.BitbakeTests.test_checkuri": {
    "duration": 9.366,
    "status": "PASSED"
   },
   "bbtests.BitbakeTests.test_continue": {
    "duration": 38.848,
    "status": "PASSED"
   },
   "bbtests.BitbakeTests.test_dry_run": {
    "duration": 6.971,
    "status": "PASSED"
   },
   "bbtests.BitbakeTests.test_environment": {
    "duration": 3.372,
    "status": "PASSED"
   },
   "bbtests.BitbakeTests.test_event_handler": {
    "duration": 26.77,
    "status": "PASSED"
   },
   "bbtests.BitbakeTests.test_force_task_1": {
    "duration": 64.097,
    "status": "PASSED"
   },
   "bbtests.BitbakeTests.test_force_task_2": {
    "duration": 35.091,
    "status": "PASSED"
   },
   "bbtests.BitbakeTests.test_git_patchtool": {
    "duration": 22.768,
    "status": "PASSED"
   },
   "bbtests.BitbakeTests.test_git_patchtool2": {
    "duration": 22.08,
    "status": "PASSED"
   },
   "bbtests.BitbakeTests.test_git_unpack_nonetwork": {
    "duration": 33.091,
    "status": "PASSED"
   },
   "bbtests.BitbakeTests.test_git_unpack_nonetwork_fail": {
    "duration": 12.608,
    "status": "PASSED"
   },
   "bbtests.BitbakeTests.test_image_manifest": {
    "duration": 93.102,
    "status": "PASSED"
   },
   "bbtests.BitbakeTests.test_invalid_patch": {
    "duration": 34.449,
    "status": "PASSED"
   },
   "bbtests.BitbakeTests.test_invalid_recipe_src_uri": {
    "duration": 5.466,
    "status": "PASSED"
   },
   "bbtests.BitbakeTests.test_just_parse": {
    "duration": 2.994,
    "status": "PASSED"
   },
   "bbtests.BitbakeTests.test_local_sstate": {
    "duration": 25.297,
    "status": "PASSED"
   },
   "bbtests.BitbakeTests.test_non_gplv3": {
    "duration": 30.297,
    "status": "PASSED"
   },
   "bbtests.BitbakeTests.test_postfile": {
    "duration": 3.325,
    "status": "PASSED"
   },
   "bbtests.BitbakeTests.test_prefile": {
    "duration": 5.01,
    "status": "PASSED"
   },
   "bbtests.BitbakeTests.test_rename_downloaded_file": {
    "duration": 23.766,
    "status": "PASSED"
   },
   "bbtests.BitbakeTests.test_run_bitbake_from_dir_1": {
    "duration": 2.876,
    "status": "PASSED"
   },
   "bbtests.BitbakeTests.test_run_bitbake_from_dir_2": {
    "duration": 2.734,
    "status": "PASSED"
   },
   "bbtests.BitbakeTests.test_run_bitbake_from_dir_3": {
    "duration": 3.072,
    "status": "PASSED"
   },
   "bbtests.BitbakeTests.test_setscene_only": {
    "duration": 21.711,
    "status": "PASSED"
   },
   "bbtests.BitbakeTests.test_skip_setscene": {
    "duration": 43.482,
    "status": "PASSED"
   },
   "bbtests.BitbakeTests.test_unexpanded_variable_in_path": {
    "duration": 23.742,
    "status": "PASSED"
   },
   "bbtests.BitbakeTests.test_version": {
    "duration": 5.485,
    "status": "PASSED"
   },
   "bbtests.BitbakeTests.test_warnings_errors": {
    "duration": 0.9842,
    "status": "PASSED"
   },
   "buildhistory.BuildhistoryTests.test_buildhistory_basic": {
    "duration": 59.99,
    "status": "PASSED"
   },
   "buildhistory.BuildhistoryTests.test_buildhistory_buildtime_pr_backwards": {
    "duration": 69.703,
    "status": "PASSED"
   },
   "buildhistory.BuildhistoryTests.test_buildhistory_diff": {
    "duration": 71.355,
    "status": "PASSED"
   },
   "buildhistory.BuildhistoryTests.test_fileinfo": {
    "duration": 17.916,
    "status": "PASSED"
   },
   "buildoptions.ArchiverTest.test_arch_work_dir_and_export_source": {
    "duration": 42.298,
    "status": "PASSED"
   },
   "buildoptions.DiskMonTest.test_stoptask_behavior": {
    "duration": 94.988,
    "status": "PASSED"
   },
   "buildoptions.ImageOptionsTests.test_ccache_tool": {
    "duration": 124.113,
    "status": "PASSED"
   },
   "buildoptions.ImageOptionsTests.test_incremental_image_generation": {
    "duration": 182.251,
    "status": "PASSED"
   },
   "buildoptions.ImageOptionsTests.test_read_only_image": {
    "duration": 232.593,
    "status": "PASSED"
   },
   "buildoptions.Poisoning.test_poisoning": {
    "duration": 36.901,
    "status": "PASSED"
   },
   "buildoptions.SanityOptionsTest.test_layer_without_git_dir": {
    "duration": 27.767,
    "status": "PASSED"
   },
   "buildoptions.SanityOptionsTest.test_options_warnqa_errorqa_switch": {
    "duration": 80.761,
    "status": "PASSED"
   },
   "buildoptions.ToolchainOptions.test_toolchain_fortran": {
    "duration": 33.821,
    "status": "PASSED"
   },
   "c_cpp.CMakeTests.test_cmake_qemu": {
    "duration": 54.234,
    "status": "PASSED"
   },
   "c_cpp.CMakeTests.test_cmake_qemu_failing": {
    "duration": 55.122,
    "status": "PASSED"
   },
   "c_cpp.MesonTests.test_meson_qemu": {
    "duration": 59.617,
    "status": "PASSED"
   },
   "c_cpp.MesonTests.test_meson_qemu_failing": {
    "duration": 44.698,
    "status": "PASSED"
   },
   "containerimage.ContainerImageTests.test_expected_files": {
    "duration": 64.846,
    "status": "PASSED"
   },
   "cve_check.CVECheck.test_convert_cve_version": {
    "duration": 0.0112,
    "status": "PASSED"
   },
   "cve_check.CVECheck.test_parse_cve_from_patch_contents": {
    "duration": 0.009949,
    "status": "PASSED"
   },
   "cve_check.CVECheck.test_parse_cve_from_patch_filename": {
    "duration": 0.008374,
    "status": "PASSED"
   },
   "cve_check.CVECheck.test_product_match": {
    "duration": 0.008206,
    "status": "PASSED"
   },
   "cve_check.CVECheck.test_version_compare": {
    "duration": 0.01134,
    "status": "PASSED"
   },
   "debuginfod.Debuginfod.test_debuginfod_native": {
    "duration": 47.605,
    "status": "PASSED"
   },
   "debuginfod.Debuginfod.test_debuginfod_qemu": {
    "duration": 143.58,
    "oetags": [
     "runqemu"
    ],
    "status": "PASSED"
   },
   "devtool.DevtoolAddTests.test_devtool_add": {
    "duration": 71.955,
    "status": "PASSED"
   },
   "devtool.DevtoolAddTests.test_devtool_add_binary": {
    "duration": 62.66,
    "status": "PASSED"
   },
   "devtool.DevtoolAddTests.test_devtool_add_build_finish": {
    "duration": 91.126,
    "status": "PASSED"
   },
   "devtool.DevtoolAddTests.test_devtool_add_build_finish_force": {
    "duration": 86.559,
    "status": "PASSED"
   },
   "devtool.DevtoolAddTests.test_devtool_add_fetch": {
    "duration": 71.773,
    "status": "PASSED"
   },
   "devtool.DevtoolAddTests.test_devtool_add_fetch_git": {
    "duration": 66.765,
    "status": "PASSED"
   },
   "devtool.DevtoolAddTests.test_devtool_add_fetch_simple": {
    "duration": 31.738,
    "status": "PASSED"
   },
   "devtool.DevtoolAddTests.test_devtool_add_git_local": {
    "duration": 35.228,
    "status": "PASSED"
   },
   "devtool.DevtoolAddTests.test_devtool_add_git_style1": {
    "duration": 34.86,
    "status": "PASSED"
   },
   "devtool.DevtoolAddTests.test_devtool_add_git_style2": {
    "duration": 34.756,
    "status": "PASSED"
   },
   "devtool.DevtoolAddTests.test_devtool_add_library": {
    "duration": 53.717,
    "status": "PASSED"
   },
   "devtool.DevtoolAddTests.test_devtool_add_npm": {
    "duration": 0.9478,
    "log": "Test needs meta-oe for nodejs\n",
    "status": "SKIPPED"
   },
   "devtool.DevtoolAddTests.test_devtool_add_python_egg_requires": {
    "duration": 25.308,
    "status": "PASSED"
   },
   "devtool.DevtoolBuildImageTests.test_devtool_build_image": {
    "duration": 264.773,
    "status": "PASSED"
   },
   "devtool.DevtoolDeployTargetTests.test_devtool_deploy_target": {
    "duration": 415.912,
    "oetags": [
     "runqemu"
    ],
    "status": "PASSED"
   },
   "devtool.DevtoolDeployTargetTests.test_devtool_deploy_target_path": {
    "duration": 262.17,
    "oetags": [
     "runqemu"
    ],
    "status": "PASSED"
   },
   "devtool.DevtoolExtractTests.test_devtool_extract": {
    "duration": 46.531,
    "status": "PASSED"
   },
   "devtool.DevtoolExtractTests.test_devtool_extract_virtual": {
    "duration": 33.116,
    "status": "PASSED"
   },
   "devtool.DevtoolIdeSdkClangTests.test_devtool_ide_sdk_code_cmake": {
    "duration": 452.467,
    "oetags": [
     "runqemu"
    ],
    "status": "PASSED"
   },
   "devtool.DevtoolIdeSdkClangTests.test_devtool_ide_sdk_code_meson": {
    "duration": 342.374,
    "oetags": [
     "runqemu"
    ],
    "status": "PASSED"
   },
   "devtool.DevtoolIdeSdkClangTests.test_devtool_ide_sdk_none_cmake": {
    "duration": 286.277,
    "oetags": [
     "runqemu"
    ],
    "status": "PASSED"
   },
   "devtool.DevtoolIdeSdkClangTests.test_devtool_ide_sdk_none_meson": {
    "duration": 276.216,
    "oetags": [
     "runqemu"
    ],
    "status": "PASSED"
   },
   "devtool.DevtoolIdeSdkGccTests.test_devtool_ide_sdk_code_cmake": {
    "duration": 357.161,
    "oetags": [
     "runqemu"
    ],
    "status": "PASSED"
   },
   "devtool.DevtoolIdeSdkGccTests.test_devtool_ide_sdk_code_meson": {
    "duration": 259.596,
    "oetags": [
     "runqemu"
    ],
    "status": "PASSED"
   },
   "devtool.DevtoolIdeSdkGccTests.test_devtool_ide_sdk_code_nfs_debug_rootfs": {
    "duration": 197.924,
    "status": "PASSED"
   },
   "devtool.DevtoolIdeSdkGccTests.test_devtool_ide_sdk_none_nfs_qemu": {
    "duration": 255.107,
    "oetags": [
     "runqemu"
    ],
    "status": "PASSED"
   },
   "devtool.DevtoolIdeSdkGccTests.test_devtool_ide_sdk_none_nfs_qemu_slirp": {
    "duration": 250.817,
    "oetags": [
     "runqemu"
    ],
    "status": "PASSED"
   },
   "devtool.DevtoolIdeSdkGccTests.test_devtool_ide_sdk_none_qemu": {
    "duration": 387.42,
    "oetags": [
     "runqemu"
    ],
    "status": "PASSED"
   },
   "devtool.DevtoolIdeSdkGccTests.test_devtool_ide_sdk_none_qemu_slirp": {
    "duration": 180.466,
    "oetags": [
     "runqemu"
    ],
    "status": "PASSED"
   },
   "devtool.DevtoolIdeSdkKernelTests.test_devtool_ide_sdk_code_kernel_module": {
    "duration": 597.537,
    "oetags": [
     "runqemu"
    ],
    "status": "PASSED"
   },
   "devtool.DevtoolIdeSdkMiscTests.test_devtool_ide_sdk_plugins": {
    "duration": 94.013,
    "status": "PASSED"
   },
   "devtool.DevtoolIdeSdkSharedTests.test_devtool_ide_sdk_shared_sysroots": {
    "duration": 121.63,
    "status": "PASSED"
   },
   "devtool.DevtoolModifyTests.test_devtool_buildclean": {
    "duration": 265.252,
    "status": "PASSED"
   },
   "devtool.DevtoolModifyTests.test_devtool_modify": {
    "duration": 145.272,
    "status": "PASSED"
   },
   "devtool.DevtoolModifyTests.test_devtool_modify_git": {
    "duration": 76.599,
    "status": "PASSED"
   },
   "devtool.DevtoolModifyTests.test_devtool_modify_git_crates_subpath": {
    "duration": 85.078,
    "status": "PASSED"
   },
   "devtool.DevtoolModifyTests.test_devtool_modify_git_no_extract": {
    "duration": 32.469,
    "status": "PASSED"
   },
   "devtool.DevtoolModifyTests.test_devtool_modify_go": {
    "duration": 42.807,
    "status": "PASSED"
   },
   "devtool.DevtoolModifyTests.test_devtool_modify_invalid": {
    "duration": 133.444,
    "status": "PASSED"
   },
   "devtool.DevtoolModifyTests.test_devtool_modify_kernel_cfg_subdirs": {
    "duration": 443.485,
    "status": "PASSED"
   },
   "devtool.DevtoolModifyTests.test_devtool_modify_localfiles": {
    "duration": 82.77,
    "status": "PASSED"
   },
   "devtool.DevtoolModifyTests.test_devtool_modify_localfiles_only": {
    "duration": 67.35,
    "status": "PASSED"
   },
   "devtool.DevtoolModifyTests.test_devtool_modify_multiple_sources": {
    "duration": 709.528,
    "status": "PASSED"
   },
   "devtool.DevtoolModifyTests.test_devtool_modify_native": {
    "duration": 396.623,
    "status": "PASSED"
   },
   "devtool.DevtoolModifyTests.test_devtool_modify_nested_gitsm": {
    "duration": 38.318,
    "status": "PASSED"
   },
   "devtool.DevtoolModifyTests.test_devtool_modify_overrides": {
    "duration": 29.855,
    "status": "PASSED"
   },
   "devtool.DevtoolModifyTests.test_devtool_modify_virtual": {
    "duration": 32.355,
    "status": "PASSED"
   },
   "devtool.DevtoolResetTests.test_devtool_reset_all": {
    "duration": 185.783,
    "status": "PASSED"
   },
   "devtool.DevtoolResetTests.test_devtool_reset_re_plus_plus": {
    "duration": 34.598,
    "status": "PASSED"
   },
   "devtool.DevtoolTests.test_create_workspace": {
    "duration": 8.185,
    "status": "PASSED"
   },
   "devtool.DevtoolUpdateTests.test_devtool_finish_modify_git_subdir": {
    "duration": 113.947,
    "status": "PASSED"
   },
   "devtool.DevtoolUpdateTests.test_devtool_git_submodules": {
    "duration": 158.41,
    "status": "PASSED"
   },
   "devtool.DevtoolUpdateTests.test_devtool_update_recipe": {
    "duration": 61.354,
    "status": "PASSED"
   },
   "devtool.DevtoolUpdateTests.test_devtool_update_recipe_append": {
    "duration": 98.23,
    "status": "PASSED"
   },
   "devtool.DevtoolUpdateTests.test_devtool_update_recipe_append_git": {
    "duration": 98.196,
    "status": "PASSED"
   },
   "devtool.DevtoolUpdateTests.test_devtool_update_recipe_git": {
    "duration": 44.897,
    "status": "PASSED"
   },
   "devtool.DevtoolUpdateTests.test_devtool_update_recipe_gitsm": {
    "duration": 45.796,
    "status": "PASSED"
   },
   "devtool.DevtoolUpdateTests.test_devtool_update_recipe_local_files": {
    "duration": 110.08,
    "status": "PASSED"
   },
   "devtool.DevtoolUpdateTests.test_devtool_update_recipe_local_files_3": {
    "duration": 41.393,
    "status": "PASSED"
   },
   "devtool.DevtoolUpdateTests.test_devtool_update_recipe_local_files_subdir": {
    "duration": 38.144,
    "status": "PASSED"
   },
   "devtool.DevtoolUpdateTests.test_devtool_update_recipe_local_patch_gz": {
    "duration": 38.613,
    "status": "PASSED"
   },
   "devtool.DevtoolUpdateTests.test_devtool_update_recipe_long_filename": {
    "duration": 45.659,
    "status": "PASSED"
   },
   "devtool.DevtoolUpdateTests.test_devtool_update_recipe_with_gitignore": {
    "duration": 43.142,
    "status": "PASSED"
   },
   "devtool.DevtoolUpgradeTests.test_devtool_finish_modify_origlayer": {
    "duration": 99.635,
    "status": "PASSED"
   },
   "devtool.DevtoolUpgradeTests.test_devtool_finish_modify_otherlayer": {
    "duration": 57.12,
    "status": "PASSED"
   },
   "devtool.DevtoolUpgradeTests.test_devtool_finish_update_patch": {
    "duration": 60.71,
    "status": "PASSED"
   },
   "devtool.DevtoolUpgradeTests.test_devtool_finish_upgrade_origlayer": {
    "duration": 72.276,
    "status": "PASSED"
   },
   "devtool.DevtoolUpgradeTests.test_devtool_finish_upgrade_otherlayer": {
    "duration": 80.519,
    "status": "PASSED"
   },
   "devtool.DevtoolUpgradeTests.test_devtool_layer_plugins": {
    "duration": 3.173,
    "status": "PASSED"
   },
   "devtool.DevtoolUpgradeTests.test_devtool_load_plugin": {
    "duration": 12.699,
    "status": "PASSED"
   },
   "devtool.DevtoolUpgradeTests.test_devtool_rename": {
    "duration": 102.951,
    "status": "PASSED"
   },
   "devtool.DevtoolUpgradeTests.test_devtool_upgrade": {
    "duration": 62.294,
    "status": "PASSED"
   },
   "devtool.DevtoolUpgradeTests.test_devtool_upgrade_all_checksums": {
    "duration": 60.132,
    "status": "PASSED"
   },
   "devtool.DevtoolUpgradeTests.test_devtool_upgrade_drop_md5sum": {
    "duration": 52.583,
    "status": "PASSED"
   },
   "devtool.DevtoolUpgradeTests.test_devtool_upgrade_git": {
    "duration": 37.616,
    "status": "PASSED"
   },
   "devtool.DevtoolUpgradeTests.test_devtool_upgrade_gitsm": {
    "duration": 46.927,
    "status": "PASSED"
   },
   "devtool.DevtoolUpgradeTests.test_devtool_upgrade_recipe_upgrade_extra_tasks": {
    "duration": 68.927,
    "status": "PASSED"
   },
   "devtool.DevtoolUpgradeTests.test_devtool_virtual_kernel_modify": {
    "duration": 970.941,
    "status": "PASSED"
   },
   "distrodata.Distrodata.test_checkpkg": {
    "duration": 0.0005305,
    "log": "Skip by the command line argument \"distrodata.Distrodata.test_checkpkg\"\n",
    "status": "SKIPPED"
   },
   "distrodata.Distrodata.test_common_include_recipes": {
    "duration": 61.35,
    "status": "PASSED"
   },
   "distrodata.Distrodata.test_maintainers": {
    "duration": 76.576,
    "status": "PASSED"
   },
   "efibootpartition.GenericEFITest.test_boot_efi": {
    "duration": 137.981,
    "status": "PASSED"
   },
   "esdk.oeSDKExtSelfTest.test_image_generation_binary_feeds": {
    "duration": 87.455,
    "status": "PASSED"
   },
   "esdk.oeSDKExtSelfTest.test_install_libraries_headers": {
    "duration": 34.152,
    "status": "PASSED"
   },
   "externalsrc.ExternalSrc.test_externalsrc_srctree_hash_files": {
    "duration": 25.523,
    "status": "PASSED"
   },
   "fetch.Dependencies.test_dependencies": {
    "duration": 21.676,
    "status": "PASSED"
   },
   "fetch.Fetch.test_git_mirrors": {
    "duration": 77.877,
    "status": "PASSED"
   },
   "fitimage.FitImagePyTests.test_fitimage_py_conf_extra_mappings_unused_error": {
    "duration": 0.006593,
    "status": "PASSED"
   },
   "fitimage.FitImagePyTests.test_fitimage_py_conf_loadables": {
    "duration": 0.005421,
    "status": "PASSED"
   },
   "fitimage.FitImagePyTests.test_fitimage_py_conf_mappings": {
    "duration": 0.00577,
    "status": "PASSED"
   },
   "fitimage.FitImagePyTests.test_fitimage_py_conf_mappings_unused_error": {
    "duration": 0.004868,
    "status": "PASSED"
   },
   "fitimage.FitImagePyTests.test_fitimage_py_conf_mappings_with_alias": {
    "duration": 0.005308,
    "status": "PASSED"
   },
   "fitimage.FitImagePyTests.test_fitimage_py_conf_os": {
    "duration": 0.005062,
    "status": "PASSED"
   },
   "fitimage.FitImagePyTests.test_fitimage_py_default": {
    "duration": 0.004953,
    "status": "PASSED"
   },
   "fitimage.FitImagePyTests.test_fitimage_py_default_dtb": {
    "duration": 0.005287,
    "status": "PASSED"
   },
   "fitimage.KernelFitImageRecipeTests.test_fit_image": {
    "duration": 71.912,
    "status": "PASSED"
   },
   "fitimage.KernelFitImageRecipeTests.test_fit_image_ext_dtb_dtbo": {
    "duration": 36.371,
    "status": "PASSED"
   },
   "fitimage.KernelFitImageRecipeTests.test_fit_image_sign_initramfs": {
    "duration": 80.189,
    "status": "PASSED"
   },
   "fitimage.KernelFitImageRecipeTests.test_fit_image_sign_initramfs_bundle": {
    "duration": 186.005,
    "status": "PASSED"
   },
   "fitimage.KernelFitImageRecipeTests.test_get_compatible_from_dtb": {
    "duration": 26.854,
    "status": "PASSED"
   },
   "fitimage.KernelFitImageRecipeTests.test_sign_fit_image_configurations": {
    "duration": 51.98,
    "status": "PASSED"
   },
   "fitimage.KernelFitImageRecipeTests.test_sign_fit_image_individual": {
    "duration": 53.648,
    "status": "PASSED"
   },
   "fitimage.KernelFitImageRecipeTests.test_vendored_dtb_with_kernel_dtbvendored": {
    "duration": 42.54,
    "status": "PASSED"
   },
   "fitimage.KernelFitImageRecipeTests.test_vendored_dtb_without_kernel_dtbvendored": {
    "duration": 38.025,
    "status": "PASSED"
   },
   "fitimage.UBootFitImageTests.test_sign_cascaded_uboot_fit_image": {
    "duration": 0.9082,
    "log": "MACHINE=qemux86-64 does not provide capability _cap_spl_dtb\n",
    "status": "SKIPPED"
   },
   "fitimage.UBootFitImageTests.test_sign_standalone_uboot_atf_tee_fit_image": {
    "duration": 0.7432,
    "log": "MACHINE=qemux86-64 does not provide capability _cap_spl_dtb\n",
    "status": "SKIPPED"
   },
   "fitimage.UBootFitImageTests.test_sign_standalone_uboot_fit_image": {
    "duration": 0.7857,
    "log": "MACHINE=qemux86-64 does not provide capability _cap_spl_dtb\n",
    "status": "SKIPPED"
   },
   "fitimage.UBootFitImageTests.test_sign_uboot_fit_image_without_spl": {
    "duration": 78.137,
    "status": "PASSED"
   },
   "fitimage.UBootFitImageTests.test_sign_uboot_kernel_individual": {
    "duration": 69.058,
    "status": "PASSED"
   },
   "fitimage.UBootFitImageTests.test_uboot_atf_tee_fit_image": {
    "duration": 0.7353,
    "log": "MACHINE=qemux86-64 does not provide capability _cap_atf_tee\n",
    "status": "SKIPPED"
   },
   "fitimage.UBootFitImageTests.test_uboot_fit_image": {
    "duration": 41.659,
    "status": "PASSED"
   },
   "gdbserver.GdbServerTest.test_gdb_server": {
    "duration": 150.747,
    "status": "PASSED"
   },
   "gitarchivetests.GitArchiveTests.test_create_first_test_tag": {
    "duration": 0.6213,
    "status": "PASSED"
   },
   "gitarchivetests.GitArchiveTests.test_create_second_test_tag": {
    "duration": 0.7145,
    "status": "PASSED"
   },
   "gitarchivetests.GitArchiveTests.test_get_revs_on_branch": {
    "duration": 0.4392,
    "status": "PASSED"
   },
   "gitarchivetests.GitArchiveTests.test_get_tags_with_only_local_tag": {
    "duration": 0.4457,
    "status": "PASSED"
   },
   "gitarchivetests.GitArchiveTests.test_get_tags_without_valid_remote": {
    "duration": 0.3113,
    "status": "PASSED"
   },
   "gitarchivetests.GitArchiveTests.test_get_tags_without_valid_remote_and_wrong_url": {
    "duration": 0.3564,
    "status": "PASSED"
   },
   "gotoolchain.oeGoToolchainSelfTest.test_go_dep_build": {
    "duration": 2.234,
    "status": "PASSED"
   },
   "govendor.GoVendorSrcUriTests.test_basic": {
    "duration": 0.00756,
    "status": "PASSED"
   },
   "govendor.GoVendorSrcUriTests.test_non_git_vcs": {
    "duration": 0.007035,
    "status": "PASSED"
   },
   "govendor.GoVendorSrcUriTests.test_path_override": {
    "duration": 0.006754,
    "status": "PASSED"
   },
   "govendor.GoVendorSrcUriTests.test_pathmajor": {
    "duration": 0.006705,
    "status": "PASSED"
   },
   "govendor.GoVendorSrcUriTests.test_replaces": {
    "duration": 0.006803,
    "status": "PASSED"
   },
   "govendor.GoVendorSrcUriTests.test_subdir": {
    "duration": 0.006694,
    "status": "PASSED"
   },
   "govendor.GoVendorTaskTests.test_do_compile_succeeds": {
    "duration": 14.063,
    "status": "PASSED"
   },
   "govendor.GoVendorTaskTests.test_external_dep_copied_to_vendor": {
    "duration": 0.005811,
    "status": "PASSED"
   },
   "govendor.GoVendorTaskTests.test_go_import_vendor_symlink": {
    "duration": 0.005157,
    "status": "PASSED"
   },
   "govendor.GoVendorTaskTests.test_local_replacement_symlink": {
    "duration": 0.005189,
    "status": "PASSED"
   },
   "govendor.GoVendorTaskTests.test_modules_txt_in_vendor": {
    "duration": 0.00496,
    "status": "PASSED"
   },
   "govendor.GoVendorTaskTests.test_pathmajor_falls_back_to_root": {
    "duration": 0.004875,
    "status": "PASSED"
   },
   "govendor.GoVendorTaskTests.test_test_files_excluded_from_vendor": {
    "duration": 0.004779,
    "status": "PASSED"
   },
   "image_typedep.ImageTypeDepTests.test_conversion_typedep_added": {
    "duration": 26.778,
    "status": "PASSED"
   },
   "imagefeatures.ImageFeatures.test_all_users_can_connect_via_ssh_without_password": {
    "duration": 223.113,
    "oetags": [
     "runqemu"
    ],
    "status": "PASSED"
   },
   "imagefeatures.ImageFeatures.test_bmap": {
    "duration": 63.234,
    "status": "PASSED"
   },
   "imagefeatures.ImageFeatures.test_empty_image": {
    "duration": 26.23,
    "status": "PASSED"
   },
   "imagefeatures.ImageFeatures.test_hypervisor_fmts": {
    "duration": 68.991,
    "status": "PASSED"
   },
   "imagefeatures.ImageFeatures.test_image_fstypes": {
    "duration": 104.01,
    "status": "PASSED"
   },
   "imagefeatures.ImageFeatures.test_image_gen_debugfs": {
    "duration": 59.78,
    "status": "PASSED"
   },
   "imagefeatures.ImageFeatures.test_long_chain_conversion": {
    "duration": 51.21,
    "status": "PASSED"
   },
   "imagefeatures.ImageFeatures.test_mandb": {
    "duration": 88.802,
    "status": "PASSED"
   },
   "imagefeatures.ImageFeatures.test_no_busybox_base_utils": {
    "duration": 23.34,
    "status": "PASSED"
   },
   "imagefeatures.ImageFeatures.test_non_root_user_can_connect_via_ssh_without_password": {
    "duration": 66.804,
    "oetags": [
     "runqemu"
    ],
    "status": "PASSED"
   },
   "imagefeatures.ImageFeatures.test_useradd_static": {
    "duration": 77.143,
    "status": "PASSED"
   },
   "imagefeatures.ImageFeatures.test_wayland_support_in_image": {
    "duration": 131.673,
    "status": "PASSED"
   },
   "incompatible_lic.IncompatibleLicensePerImageTests.test_bash_and_license": {
    "duration": 46.963,
    "status": "PASSED"
   },
   "incompatible_lic.IncompatibleLicensePerImageTests.test_bash_default": {
    "duration": 43.51,
    "status": "PASSED"
   },
   "incompatible_lic.IncompatibleLicensePerImageTests.test_bash_license_exceptions": {
    "duration": 53.646,
    "status": "PASSED"
   },
   "incompatible_lic.IncompatibleLicensePerImageTests.test_bash_or_license": {
    "duration": 44.359,
    "status": "PASSED"
   },
   "incompatible_lic.IncompatibleLicensePerImageTests.test_spdx_exception": {
    "duration": 94.444,
    "status": "PASSED"
   },
   "incompatible_lic.IncompatibleLicenseTestObsolete.test_incompatible_alias_spdx_license": {
    "duration": 6.868,
    "status": "PASSED"
   },
   "incompatible_lic.IncompatibleLicenseTestObsolete.test_incompatible_alias_spdx_license_alias": {
    "duration": 6.829,
    "status": "PASSED"
   },
   "incompatible_lic.IncompatibleLicenseTestObsolete.test_incompatible_alias_spdx_license_alias_wildcard": {
    "duration": 6.645,
    "status": "PASSED"
   },
   "incompatible_lic.IncompatibleLicenseTestObsolete.test_incompatible_alias_spdx_license_wildcard": {
    "duration": 6.475,
    "status": "PASSED"
   },
   "incompatible_lic.IncompatibleLicenseTestObsolete.test_incompatible_all_licenses_wildcard": {
    "duration": 6.442,
    "status": "PASSED"
   },
   "incompatible_lic.IncompatibleLicenseTestObsolete.test_incompatible_spdx_license_alias_wildcard": {
    "duration": 6.297,
    "status": "PASSED"
   },
   "incompatible_lic.IncompatibleLicenseTestObsolete.test_incompatible_spdx_licenses_wildcard": {
    "duration": 6.381,
    "status": "PASSED"
   },
   "incompatible_lic.IncompatibleLicenseTests.test_incompatible_nonspdx_license": {
    "duration": 17.232,
    "status": "PASSED"
   },
   "incompatible_lic.IncompatibleLicenseTests.test_incompatible_spdx_license": {
    "duration": 17.683,
    "status": "PASSED"
   },
   "incompatible_lic.IncompatibleLicenseTests.test_incompatible_spdx_license_alias": {
    "duration": 5.185,
    "status": "PASSED"
   },
   "incompatible_lic.IncompatibleLicenseTests.test_incompatible_spdx_license_wildcard": {
    "duration": 23.403,
    "status": "PASSED"
   },
   "incompatible_lic.IncompatibleLicenseTests.test_incompatible_spdx_licenses": {
    "duration": 23.246,
    "status": "PASSED"
   },
   "incompatible_lic.NoGPL3InImagesTests.test_core_image_full_cmdline_weston": {
    "duration": 252.506,
    "log": "testtools.testresult.real._StringException: Traceback (most recent call last):\n  File \"/srv/pokybuild/yocto-worker/oe-selftest-fedora/build/layers/openembedded-core/meta/lib/oeqa/core/decorator/__init__.py\", line 35, in wrapped_f\n    return func(*args, **kwargs)\n  File \"/srv/pokybuild/yocto-worker/oe-selftest-fedora/build/layers/openembedded-core/meta/lib/oeqa/selftest/cases/incompatible_lic.py\", line 181, in test_core_image_full_cmdline_weston\n    bitbake('-c testimage core-image-full-cmdline core-image-weston')\n    ~~~~~~~^^^^^^^^^^^^^^^^^^^^^^^^^^^^^^^^^^^^^^^^^^^^^^^^^^^^^^^^^^\n  File \"/srv/pokybuild/yocto-worker/oe-selftest-fedora/build/layers/openembedded-core/meta/lib/oeqa/utils/commands.py\", line 236, in bitbake\n    return runCmd(cmd, ignore_status, timeout, output_log=output_log, **options)\n  File \"/srv/pokybuild/yocto-worker/oe-selftest-fedora/build/layers/openembedded-core/meta/lib/oeqa/utils/commands.py\", line 214, in runCmd\n    raise AssertionError(\"Command '%s' returned non-zero exit status %d:\\n%s\" % (command, result.status, exc_output))\nAssertionError: Command 'bitbake  -c testimage core-image-full-cmdline core-image-weston' returned non-zero exit status 1:\nNOTE: Reconnecting to bitbake server...\nLoading cache...done.\nLoaded 2093 entries from dependency cache.\nNOTE: Resolving any missing task queue dependencies\n\nBuild Configuration:\nBB_VERSION           = \"2.19.1\"\nBUILD_SYS            = \"x86_64-linux\"\nNATIVELSBSTRING      = \"universal\"\nTARGET_SYS           = \"x86_64-poky-linux\"\nMACHINE              = \"qemux86-64\"\nSDKMACHINE           = \"x86_64\"\nDISTRO               = \"poky\"\nDISTRO_VERSION       = \"6.0.99+snapshot-f94ae3d6ba49aef86f497998c0e0232a5039510a\"\nTUNE_FEATURES        = \"m64 x86-64-v3\"\nmeta                 = \"master:f94ae3d6ba49aef86f497998c0e0232a5039510a\"\nmeta-yocto-bsp       \nmeta-poky            = \"master:7e41504cd63b099b214f10d92cfdaf358ab98c5f\"\nmeta-selftest        = \"master:ac461d3e2ad38f6770ab86e65b65ea7555544a1a\"\n\nInitialising tasks...NOTE: The /proc/pressure files can't be read. Continuing build without monitoring pressure\nSstate summary: Wanted 174 Local 174 Mirrors 0 Missed 0 Current 271 (100% match, 100% complete)\ndone.\nNOTE: Executing Tasks\nNOTE: Setscene tasks completed\nNOTE: Running task 1527 of 1528 (/srv/pokybuild/yocto-worker/oe-selftest-fedora/build/layers/openembedded-core/meta/recipes-graphics/images/core-image-weston.bb:do_testimage)\nNOTE: Running task 1528 of 1528 (/srv/pokybuild/yocto-worker/oe-selftest-fedora/build/layers/openembedded-core/meta/recipes-extended/images/core-image-full-cmdline.bb:do_testimage)\nNOTE: recipe core-image-weston-1.0-r0: task do_testimage: Started\nNOTE: recipe core-image-full-cmdline-1.0-r0: task do_testimage: Started\nQMP Available for connection at /srv/pokybuild/yocto-worker/oe-selftest-fedora/build/build-st-3994809/tmp/.uuwrjrdt\nQMP Available for connection at /srv/pokybuild/yocto-worker/oe-selftest-fedora/build/build-st-3994809/tmp/.d1uw2d5c\nQMP connected to QEMU at 09/14/26 01:27:03 and took 0.55 seconds\nQMP released QEMU at 09/14/26 01:27:03 and took 0.11 seconds from connect\nQMP connected to QEMU at 09/14/26 01:27:04 and took 1.54 seconds\nQMP released QEMU at 09/14/26 01:27:04 and took 0.12 seconds from connect\nTest requires apt to be installed\nTest requires autoconf to be installed\nTest requires gtk+3 to be installed\nTest requires autoconf to be installed\nTest requires connman to be installed\nTest case connman.ConnmanTest.test_connmand_running depends on connman.ConnmanTest.test_connmand_help but it didn't pass/run.\nTest requires dnf to be installed\nTest case dnf.DnfBasicTest.test_dnf_history depends on dnf.DnfBasicTest.test_dnf_help but it didn't pass/run.\nTest case dnf.DnfBasicTest.test_dnf_info depends on dnf.DnfBasicTest.test_dnf_help but it didn't pass/run.\nTest case dnf.DnfBasicTest.test_dnf_search depends on dnf.DnfBasicTest.test_dnf_help but it didn't pass/run.\nTest case dnf.DnfBasicTest.test_dnf_version depends on dnf.DnfBasicTest.test_dnf_help but it didn't pass/run.\nTest case dnf.DnfRepoTest.test_dnf_makecache depends on dnf.DnfBasicTest.test_dnf_help but it didn't pass/run.\nTest case dnf.DnfRepoTest.test_dnf_exclude depends on dnf.DnfRepoTest.test_dnf_makecache but it didn't pass/run.\nTest case dnf.DnfRepoTest.test_dnf_install depends on dnf.DnfRepoTest.test_dnf_makecache but it didn't pass/run.\nTest case dnf.DnfRepoTest.test_dnf_install_dependency depends on dnf.DnfRepoTest.test_dnf_install but it didn't pass/run.\nTest case dnf.DnfRepoTest.test_dnf_install_from_disk depends on dnf.DnfRepoTest.test_dnf_install_dependency but it didn't pass/run.\nTest case dnf.DnfRepoTest.test_dnf_install_from_http depends on dnf.DnfRepoTest.test_dnf_install_from_disk but it didn't pass/run.\nTest case dnf.DnfRepoTest.test_dnf_installroot depends on dnf.DnfRepoTest.test_dnf_makecache but it didn't pass/run.\nTest run when enable usrmerge\nTest case dnf.DnfRepoTest.test_dnf_reinstall depends on dnf.DnfRepoTest.test_dnf_install but it didn't pass/run.\nTest case dnf.DnfRepoTest.test_dnf_repoinfo depends on dnf.DnfRepoTest.test_dnf_makecache but it didn't pass/run.\nTest requires gcc to be installed\nTest requires g++ to be installed\nTest requires g++ to be installed\nTest requires make to be installed\nTest requires python3-pygobject to be installed\nTest requires cgo-helloworld to be installed\nTest requires go-runtime-dev to be installed\nTest requires go-runtime-dev to be installed\nTest requires go-helloworld to be installed\nTest requires gcc to be installed\nTest requires ldd to be installed\nTest requires logrotate to be installed\nTest case logrotate.LogrotateTest.test_logrotate_newlog depends on logrotate.LogrotateTest.test_logrotate_wtmp but it didn't pass/run.\nTest requires apt to be installed\nTest requires autoconf to be installed\nTest requires gtk+3 to be installed\nTest requires autoconf to be installed\nTest requires connman to be installed\nTest case connman.ConnmanTest.test_connmand_running depends on connman.ConnmanTest.test_connmand_help but it didn't pass/run.\nTest requires dnf to be installed\nTest case dnf.DnfBasicTest.test_dnf_history depends on dnf.DnfBasicTest.test_dnf_help but it didn't pass/run.\nTest case dnf.DnfBasicTest.test_dnf_info depends on dnf.DnfBasicTest.test_dnf_help but it didn't pass/run.\nTest case dnf.DnfBasicTest.test_dnf_search depends on dnf.DnfBasicTest.test_dnf_help but it didn't pass/run.\nTest case dnf.DnfBasicTest.test_dnf_version depends on dnf.DnfBasicTest.test_dnf_help but it didn't pass/run.\nTest case dnf.DnfRepoTest.test_dnf_makecache depends on dnf.DnfBasicTest.test_dnf_help but it didn't pass/run.\nTest case dnf.DnfRepoTest.test_dnf_exclude depends on dnf.DnfRepoTest.test_dnf_makecache but it didn't pass/run.\nTest case dnf.DnfRepoTest.test_dnf_install depends on dnf.DnfRepoTest.test_dnf_makecache but it didn't pass/run.\nTest case dnf.DnfRepoTest.test_dnf_install_dependency depends on dnf.DnfRepoTest.test_dnf_install but it didn't pass/run.\nTest case dnf.DnfRepoTest.test_dnf_install_from_disk depends on dnf.DnfRepoTest.test_dnf_install_dependency but it didn't pass/run.\nTest case dnf.DnfRepoTest.test_dnf_install_from_http depends on dnf.DnfRepoTest.test_dnf_install_from_disk but it didn't pass/run.\nTest case dnf.DnfRepoTest.test_dnf_installroot depends on dnf.DnfRepoTest.test_dnf_makecache but it didn't pass/run.\nTest run when enable usrmerge\nTest case dnf.DnfRepoTest.test_dnf_reinstall depends on dnf.DnfRepoTest.test_dnf_install but it didn't pass/run.\nTest case dnf.DnfRepoTest.test_dnf_repoinfo depends on dnf.DnfRepoTest.test_dnf_makecache but it didn't pass/run.\nTest requires gcc to be installed\nTest requires g++ to be installed\nTest requires g++ to be installed\nTest requires make to be installed\nTest requires python3-pygobject to be installed\nTest requires cgo-helloworld to be installed\nTest requires go-runtime-dev to be installed\nTest requires go-runtime-dev to be installed\nTest requires go-helloworld to be installed\nTest requires gcc to be installed\nTest requires ldd to be installed\nNo syslog found to restart, ignoring\nTest requires busybox-syslog to be installed\nTest requires opkg to be installed\nTest requires pam to be in DISTRO_FEATURES\nTraceback (most recent call last):\n  File \"/srv/pokybuild/yocto-worker/oe-selftest-fedora/build/layers/openembedded-core/meta/lib/oeqa/core/decorator/__init__.py\", line 35, in wrapped_f\n    return func(*args, **kwargs)\n  File \"/srv/pokybuild/yocto-worker/oe-selftest-fedora/build/layers/openembedded-core/meta/lib/oeqa/runtime/cases/parselogs.py\", line 185, in test_parselogs\n    self.assertEqual(errcount, 0, msg=self.msg)\n    ~~~~~~~~~~~~~~~~^^^^^^^^^^^^^^^^^^^^^^^^^^^\nAssertionError: 2 != 0 : Log: /srv/pokybuild/yocto-worker/oe-selftest-fedora/build/build-st-3994809/tmp/work/qemux86_64-poky-linux/core-image-full-cmdline/1.0/target_logs/kern.log\n-----------------------\nCentral error: Sep 14 01:27:06 qemux86-64 kernel: ------------[ cut here ]------------\n***********************\nSep 14 01:27:03 qemux86-64 kernel:     /sbin/init\nSep 14 01:27:03 qemux86-64 kernel:   with environment:\nSep 14 01:27:03 qemux86-64 kernel:     HOME=/\nSep 14 01:27:03 qemux86-64 kernel:     TERM=linux\nSep 14 01:27:03 qemux86-64 kernel: input: QEMU QEMU USB Tablet as /devices/pci0000:00/0000:00:1d.7/usb2/2-1/2-1:1.0/0003:0627:0001.0001/input/input1\nSep 14 01:27:03 qemux86-64 kernel: hid-generic 0003:0627:0001.0001: input: USB HID v0.01 Mouse [QEMU QEMU USB Tablet] on usb-0000:00:1d.7-1/input0\nSep 14 01:27:03 qemux86-64 kernel: usb 2-2: new high-speed USB device number 3 using ehci-pci\nSep 14 01:27:03 qemux86-64 kernel: input: QEMU QEMU USB Keyboard as /devices/pci0000:00/0000:00:1d.7/usb2/2-2/2-2:1.0/0003:0627:0001.0002/input/input2\nSep 14 01:27:03 qemux86-64 kernel: hid-generic 0003:0627:0001.0002: input: USB HID v1.11 Keyboard [QEMU QEMU USB Keyboard] on usb-0000:00:1d.7-2/input0\nSep 14 01:27:03 qemux86-64 kernel: EXT4-fs (vda): re-mounted 7caf013a-2170-4c54-b481-9de65941d426.\nSep 14 01:27:06 qemux86-64 kernel: ------------[ cut here ]------------\nSep 14 01:27:06 qemux86-64 kernel: bochs-drm 0000:00:01.0: [drm] vblank wait timed out on crtc 0\nSep 14 01:27:06 qemux86-64 kernel: WARNING: /usr/src/kernel/drivers/gpu/drm/drm_vblank.c:1329 at drm_crtc_wait_one_vblank+0x1a5/0x230, CPU#1: kworker/1:1/50\nSep 14 01:27:06 qemux86-64 kernel: Modules linked in:\nSep 14 01:27:06 qemux86-64 kernel: CPU: 1 UID: 0 PID: 50 Comm: kworker/1:1 Not tainted 7.2.4-yocto-standard #1 PREEMPT(full) \nSep 14 01:27:06 qemux86-64 kernel: Hardware name: QEMU Standard PC (Q35 + ICH9, 2009), BIOS rel-1.17.0-0-gb52ca86e094d-prebuilt.qemu.org 04/01/2014\nSep 14 01:27:06 qemux86-64 kernel: Workqueue: events drm_fb_helper_damage_work\nSep 14 01:27:06 qemux86-64 kernel: RIP: 0010:drm_crtc_wait_one_vblank+0x1ae/0x230\nSep 14 01:27:06 qemux86-64 kernel: Code: e8 37 1e 07 00 48 8b 7b 08 4c 8b 67 50 4d 85 e4 75 03 4c 8b 27 e8 22 1e 07 00 48 8d 3d 1b 95 2c 01 44 89 e9 4c 89 e2 48 89 c6 <67> 48 0f b9 3a 44 89 ee 48 89 df 41 be 92 ff ff ff e8 7c fc ff ff\nSep 14 01:27:06 qemux86-64 kernel: RSP: 0018:ffffa17a401bfd08 EFLAGS: 00010286\nSep 14 01:27:06 qemux86-64 kernel: RAX: ffffffffac995de4 RBX: ffff9030c1912000 RCX: 0000000000000000\n\n***********************\nLog: /srv/pokybuild/yocto-worker/oe-selftest-fedora/build/build-st-3994809/tmp/work/qemux86_64-poky-linux/core-image-full-cmdline/1.0/target_logs/dmesg_output.log\n-----------------------\nCentral error: [    4.618062] ------------[ cut here ]------------\n***********************\n[    1.407225]     HOME=/\n[    1.407225]     TERM=linux\n[    1.415284] input: QEMU QEMU USB Tablet as /devices/pci0000:00/0000:00:1d.7/usb2/2-1/2-1:1.0/0003:0627:0001.0001/input/input1\n[    1.418579] hid-generic 0003:0627:0001.0001: input: USB HID v0.01 Mouse [QEMU QEMU USB Tablet] on usb-0000:00:1d.7-1/input0\n[    1.485543] udevd[153]: starting version 3.2.14\n[    1.489071] udevd[154]: starting eudev-3.2.14\n[    1.530061] usb 2-2: new high-speed USB device number 3 using ehci-pci\n[    1.662641] input: QEMU QEMU USB Keyboard as /devices/pci0000:00/0000:00:1d.7/usb2/2-2/2-2:1.0/0003:0627:0001.0002/input/input2\n[    1.716295] hid-generic 0003:0627:0001.0002: input: USB HID v1.11 Keyboard [QEMU QEMU USB Keyboard] on usb-0000:00:1d.7-2/input0\n[    1.780067] EXT4-fs (vda): re-mounted 7caf013a-2170-4c54-b481-9de65941d426.\n[    4.618062] ------------[ cut here ]------------\n[    4.619573] bochs-drm 0000:00:01.0: [drm] vblank wait timed out on crtc 0\n[    4.621579] WARNING: /usr/src/kernel/drivers/gpu/drm/drm_vblank.c:1329 at drm_crtc_wait_one_vblank+0x1a5/0x230, CPU#1: kworker/1:1/50\n[    4.624975] Modules linked in:\n[    4.625922] CPU: 1 UID: 0 PID: 50 Comm: kworker/1:1 Not tainted 7.2.4-yocto-standard #1 PREEMPT(full) \n[    4.628645] Hardware name: QEMU Standard PC (Q35 + ICH9, 2009), BIOS rel-1.17.0-0-gb52ca86e094d-prebuilt.qemu.org 04/01/2014\n[    4.631940] Workqueue: events drm_fb_helper_damage_work\n[    4.633494] RIP: 0010:drm_crtc_wait_one_vblank+0x1ae/0x230\n[    4.635122] Code: e8 37 1e 07 00 48 8b 7b 08 4c 8b 67 50 4d 85 e4 75 03 4c 8b 27 e8 22 1e 07 00 48 8d 3d 1b 95 2c 01 44 89 e9 4c 89 e2 48 89 c6 <67> 48 0f b9 3a 44 89 ee 48 89 df 41 be 92 ff ff ff e8 7c fc ff ff\n[    4.640535] RSP: 0018:ffffa17a401bfd08 EFLAGS: 00010286\n[    4.642099] RAX: ffffffffac995de4 RBX: ffff9030c1912000 RCX: 0000000000000000\n\n***********************\n2 errors found in logs.\n\nTest requires perl to be installed\nTest requires ptest-runner to be installed\nTest requires ptest-runner to be installed\nTest requires python3-core to be installed\nTest requires opkg to be installed\nTest requires pam to be in DISTRO_FEATURES\nTest requires perl to be installed\nTest requires ptest-runner to be installed\nTest requires ptest-runner to be installed\nTest requires python3-core to be installed\nNo /var/lib/rpm on target\nTest case rpm.RpmBasicTest.test_rpm_query_nonroot depends on rpm.RpmBasicTest.test_rpm_query but it didn't pass/run.\nTest case rpm.RpmInstallRemoveTest.test_rpm_install depends on rpm.RpmBasicTest.test_rpm_query but it didn't pass/run.\nTest case rpm.RpmInstallRemoveTest.test_rpm_remove depends on rpm.RpmInstallRemoveTest.test_rpm_install but it didn't pass/run.\nTest case rpm.RpmInstallRemoveTest.test_check_rpm_install_removal_log_file_size depends on rpm.RpmInstallRemoveTest.test_rpm_remove but it didn't pass/run.\nTest requires rust-c-lib-example-bin to be installed\nTest requires cargo to be installed\nTest requires rust to be installed\nNo /var/lib/rpm on target\nTest case rpm.RpmBasicTest.test_rpm_query_nonroot depends on rpm.RpmBasicTest.test_rpm_query but it didn't pass/run.\nTest case rpm.RpmInstallRemoveTest.test_rpm_install depends on rpm.RpmBasicTest.test_rpm_query but it didn't pass/run.\nTest case rpm.RpmInstallRemoveTest.test_rpm_remove depends on rpm.RpmInstallRemoveTest.test_rpm_install but it didn't pass/run.\nTest case rpm.RpmInstallRemoveTest.test_check_rpm_install_removal_log_file_size depends on rpm.RpmInstallRemoveTest.test_rpm_remove but it didn't pass/run.\nTest requires rust-c-lib-example-bin to be installed\nTest requires openssh-scp to be installed\nTest requires openssh-scp to be installed\nTest requires kernel-devsrc to be installed\nsystemd is not the init manager for this image\nTest case systemd.SystemdBasicTests.test_systemd_failed depends on systemd.SystemdBasicTests.test_systemd_basic but it didn't pass/run.\nTest case systemd.SystemdBasicTests.test_systemd_list depends on systemd.SystemdBasicTests.test_systemd_basic but it didn't pass/run.\nTest case systemd.SystemdJournalTests.test_systemd_boot_time depends on systemd.SystemdBasicTests.test_systemd_basic but it didn't pass/run.\nTest case systemd.SystemdJournalTests.test_systemd_journal depends on systemd.SystemdBasicTests.test_systemd_basic but it didn't pass/run.\nTest requires minidebuginfo to be in DISTRO_FEATURES\nTest case systemd.SystemdServiceTests.test_systemd_status depends on systemd.SystemdBasicTests.test_systemd_basic but it didn't pass/run.\nTest case systemd.SystemdServiceTests.test_systemd_disable_enable depends on systemd.SystemdServiceTests.test_systemd_status but it didn't pass/run.\nTest is only meant to run with read-only-rootfs in IMAGE_FEATURES\nTest case systemd.SystemdServiceTests.test_systemd_stop_start depends on systemd.SystemdServiceTests.test_systemd_status but it didn't pass/run.\nTest requires wayland-utils to be installed\nTest requires weston to be installed\nTest requires weston to be installed\nTest requires weston to be installed\nTest requires xserver-nodm-init to be installed\nTest requires kernel-devsrc to be installed\nsystemd is not the init manager for this image\nTest case systemd.SystemdBasicTests.test_systemd_failed depends on systemd.SystemdBasicTests.test_systemd_basic but it didn't pass/run.\nTest case systemd.SystemdBasicTests.test_systemd_list depends on systemd.SystemdBasicTests.test_systemd_basic but it didn't pass/run.\nTest case systemd.SystemdJournalTests.test_systemd_boot_time depends on systemd.SystemdBasicTests.test_systemd_basic but it didn't pass/run.\nTest case systemd.SystemdJournalTests.test_systemd_journal depends on systemd.SystemdBasicTests.test_systemd_basic but it didn't pass/run.\nTest requires minidebuginfo to be in DISTRO_FEATURES\nTest case systemd.SystemdServiceTests.test_systemd_status depends on systemd.SystemdBasicTests.test_systemd_basic but it didn't pass/run.\nTest case systemd.SystemdServiceTests.test_systemd_disable_enable depends on systemd.SystemdServiceTests.test_systemd_status but it didn't pass/run.\nTest is only meant to run with read-only-rootfs in IMAGE_FEATURES\nTest case systemd.SystemdServiceTests.test_systemd_stop_start depends on systemd.SystemdServiceTests.test_systemd_status but it didn't pass/run.\nWARNING: core-image-full-cmdline-1.0-r0 do_testimage: Can not retrieve artifacts from test target: Error while fetching compressed artifacts\nOutput from runqemu:\nrunqemu - INFO - Received signal: 15\nrunqemu - INFO - Cleaning up\nrunqemu - INFO - Host uptime: 546052.78\n\nrunqemu - INFO - Removing /srv/pokybuild/yocto-worker/oe-selftest-fedora/build/build-st-3994809/tmp/deploy/images/qemux86-64/core-image-full-cmdline-qemux86-64.rootfs-20260914012404.ext4\nrunqemu - INFO - Removing /home/pokybuild/tmp/core-image-full-cmdline-qemux86-64.rootfs-20260914012404.ext4.700265\ntput: No value for $TERM and no -T specified\n\nRESULTS:\nRESULTS - date.DateTest.test_date: PASSED (1.99s)\nRESULTS - df.DfTest.test_df: PASSED (0.50s)\nRESULTS - logrotate.LogrotateTest.test_logrotate_newlog: PASSED (3.45s)\nRESULTS - logrotate.LogrotateTest.test_logrotate_wtmp: PASSED (2.23s)\nRESULTS - oe_syslog.SyslogTest.test_syslog_running: PASSED (0.51s)\nRESULTS - oe_syslog.SyslogTestConfig.test_syslog_logger: PASSED (1.82s)\nRESULTS - oe_syslog.SyslogTestConfig.test_syslog_restart: PASSED (1.46s)\nRESULTS - parselogs.ParseLogsTest.test_get_context: PASSED (0.00s)\nRESULTS - ping.PingTest.test_ping: PASSED (0.02s)\nRESULTS - rpm.RpmBasicTest.test_rpm_help: PASSED (2.77s)\nRESULTS - scp.ScpTest.test_scp_file: PASSED (1.10s)\nRESULTS - ssh.SSHTest.test_ssh: PASSED (2.16s)\nRESULTS - apt.AptRepoTest.test_apt_install_from_repo: SKIPPED (0.00s)\nRESULTS - buildcpio.BuildCpioTest.test_cpio: SKIPPED (0.00s)\nRESULTS - buildgalculator.GalculatorTest.test_galculator: SKIPPED (0.00s)\nRESULTS - buildlzip.BuildLzipTest.test_lzip: SKIPPED (0.00s)\nRESULTS - connman.ConnmanTest.test_connmand_help: SKIPPED (0.00s)\nRESULTS - connman.ConnmanTest.test_connmand_running: SKIPPED (0.00s)\nRESULTS - dnf.DnfBasicTest.test_dnf_help: SKIPPED (0.00s)\nRESULTS - dnf.DnfBasicTest.test_dnf_history: SKIPPED (0.00s)\nRESULTS - dnf.DnfBasicTest.test_dnf_info: SKIPPED (0.00s)\nRESULTS - dnf.DnfBasicTest.test_dnf_search: SKIPPED (0.00s)\nRESULTS - dnf.DnfBasicTest.test_dnf_version: SKIPPED (0.00s)\nRESULTS - dnf.DnfRepoTest.test_dnf_exclude: SKIPPED (0.00s)\nRESULTS - dnf.DnfRepoTest.test_dnf_install: SKIPPED (0.00s)\nRESULTS - dnf.DnfRepoTest.test_dnf_install_dependency: SKIPPED (0.00s)\nRESULTS - dnf.DnfRepoTest.test_dnf_install_from_disk: SKIPPED (0.00s)\nRESULTS - dnf.DnfRepoTest.test_dnf_install_from_http: SKIPPED (0.00s)\nRESULTS - dnf.DnfRepoTest.test_dnf_installroot: SKIPPED (0.00s)\nRESULTS - dnf.DnfRepoTest.test_dnf_installroot_usrmerge: SKIPPED (0.00s)\nRESULTS - dnf.DnfRepoTest.test_dnf_makecache: SKIPPED (0.00s)\nRESULTS - dnf.DnfRepoTest.test_dnf_reinstall: SKIPPED (0.00s)\nRESULTS - dnf.DnfRepoTest.test_dnf_repoinfo: SKIPPED (0.00s)\nRESULTS - gcc.GccCompileTest.test_gcc_compile: SKIPPED (0.00s)\nRESULTS - gcc.GccCompileTest.test_gpp2_compile: SKIPPED (0.00s)\nRESULTS - gcc.GccCompileTest.test_gpp_compile: SKIPPED (0.00s)\nRESULTS - gcc.GccCompileTest.test_make: SKIPPED (0.00s)\nRESULTS - gi.GObjectIntrospectionTest.test_python: SKIPPED (0.00s)\nRESULTS - go.CgoHelloworldTest.test_cgohelloworld: SKIPPED (0.00s)\nRESULTS - go.GoCompileTest.test_go_compile: SKIPPED (0.00s)\nRESULTS - go.GoCompileTest.test_go_module: SKIPPED (0.00s)\nRESULTS - go.GoHelloworldTest.test_gohelloworld: SKIPPED (0.00s)\nRESULTS - kernelmodule.KernelModuleTest.test_kernel_module: SKIPPED (0.00s)\nRESULTS - ldd.LddTest.test_ldd: SKIPPED (0.00s)\nRESULTS - oe_syslog.SyslogTestConfig.test_syslog_startup_config: SKIPPED (0.00s)\nRESULTS - opkg.OpkgRepoTest.test_opkg_install_from_repo: SKIPPED (0.00s)\nRESULTS - pam.PamBasicTest.test_pam: SKIPPED (0.00s)\nRESULTS - perl.PerlTest.test_perl_works: SKIPPED (0.00s)\nRESULTS - ptest.PtestRunnerTest.test_ptestrunner_expectfail: SKIPPED (0.00s)\nRESULTS - ptest.PtestRunnerTest.test_ptestrunner_expectsuccess: SKIPPED (0.00s)\nRESULTS - python.PythonTest.test_python3: SKIPPED (0.00s)\nRESULTS - rpm.RpmBasicTest.test_rpm_query: SKIPPED (0.50s)\nRESULTS - rpm.RpmBasicTest.test_rpm_query_nonroot: SKIPPED (0.00s)\nRESULTS - rpm.RpmInstallRemoveTest.test_check_rpm_install_removal_log_file_size: SKIPPED (0.00s)\nRESULTS - rpm.RpmInstallRemoveTest.test_rpm_install: SKIPPED (0.00s)\nRESULTS - rpm.RpmInstallRemoveTest.test_rpm_remove: SKIPPED (0.00s)\nRESULTS - rust.RustCLibExampleTest.test_rust_c_lib_example: SKIPPED (0.00s)\nRESULTS - rust.RustCompileTest.test_cargo_compile: SKIPPED (0.00s)\nRESULTS - rust.RustCompileTest.test_rust_compile: SKIPPED (0.00s)\nRESULTS - stap.StapTest.test_stap: SKIPPED (0.00s)\nRESULTS - systemd.SystemdBasicTests.test_systemd_basic: SKIPPED (0.00s)\nRESULTS - systemd.SystemdBasicTests.test_systemd_failed: SKIPPED (0.00s)\nRESULTS - systemd.SystemdBasicTests.test_systemd_list: SKIPPED (0.00s)\nRESULTS - systemd.SystemdJournalTests.test_systemd_boot_time: SKIPPED (0.00s)\nRESULTS - systemd.SystemdJournalTests.test_systemd_journal: SKIPPED (0.00s)\nRESULTS - systemd.SystemdServiceTests.test_systemd_coredump_minidebuginfo: SKIPPED (0.00s)\nRESULTS - systemd.SystemdServiceTests.test_systemd_disable_enable: SKIPPED (0.00s)\nRESULTS - systemd.SystemdServiceTests.test_systemd_disable_enable_ro: SKIPPED (0.00s)\nRESULTS - systemd.SystemdServiceTests.test_systemd_status: SKIPPED (0.00s)\nRESULTS - systemd.SystemdServiceTests.test_systemd_stop_start: SKIPPED (0.00s)\nRESULTS - weston.WestonTest.test_wayland_info: SKIPPED (0.00s)\nRESULTS - weston.WestonTest.test_weston_can_initialize_new_wayland_compositor: SKIPPED (0.00s)\nRESULTS - weston.WestonTest.test_weston_running: SKIPPED (0.00s)\nRESULTS - weston.WestonTest.test_weston_supports_xwayland: SKIPPED (0.00s)\nRESULTS - xorg.XorgTest.test_xorg_running: SKIPPED (0.00s)\nRESULTS - parselogs.ParseLogsTest.test_parselogs: FAILED (2.60s)\nSUMMARY:\ncore-image-full-cmdline () - Ran 76 tests in 21.166s\ncore-image-full-cmdline - FAIL - Required tests failed (successes=12, skipped=63, failures=1, errors=0)\ncore-image-full-cmdline - FAILED - Last lines of QEMU boot logs:\n--- qemu_boot_log.20260914012655 ---\nstarting nfsd: rpc.nfsd: Unable to request RDMA services: Protocol not supported\n\n[    6.274075] NFSD: Unable to initialize client recovery tracking! (-110)\n[    6.275890] NFSD: Is nfsdcld running? If not, enable CONFIG_NFSD_LEGACY_CLIENT_TRACKING.\n[    6.277897] NFSD: starting 90-second grace period (net effffff9)\ndone\n\nstarting mountd: done\n\nStarting system log daemon...0\n\nStarting crond: OK\n\n\n\nPoky (Yocto Project Reference Distro) 6.0.99+snapshot-f94ae3d6ba49aef86f497998c0e0232a5039510a qemux86-64 ttyS0\n\nType 'root' to login with superuser privileges (no password will be asked).\n\nqemux86-64 login: \n--- qemu_boot_log.20260914012655.2 ---\n\nStarting atd: OK\n\nstarting nfsd: rpc.nfsd: Unable to request RDMA services: Protocol not supported\n\ndone\n\nstarting mountd: done\n\nStarting system log daemon...0\n\nStarting crond: OK\n\n\n\nPoky (Yocto Project Reference Distro) 6.0.99+snapshot-f94ae3d6ba49aef86f497998c0e0232a5039510a qemux86-64 ttyS1\n\nType 'root' to login with superuser privileges (no password will be asked).\n\nqemux86-64 login: \nERROR: core-image-full-cmdline-1.0-r0 do_testimage: core-image-full-cmdline - FAILED - also check the logs in /srv/pokybuild/yocto-worker/oe-selftest-fedora/build/build-st-3994809/tmp/log\nNOTE: recipe core-image-full-cmdline-1.0-r0: task do_testimage: Succeeded\nTest requires xserver-nodm-init to be installed\nOutput from runqemu:\nrunqemu - INFO - Received signal: 15\nrunqemu - INFO - Cleaning up\nrunqemu - INFO - Host uptime: 546059.41\n\nrunqemu - INFO - Removing /srv/pokybuild/yocto-worker/oe-selftest-fedora/build/build-st-3994809/tmp/deploy/images/qemux86-64/core-image-weston-qemux86-64.rootfs-20260914012404.ext4\nrunqemu - INFO - Removing /home/pokybuild/tmp/core-image-weston-qemux86-64.rootfs-20260914012404.ext4.700263\ntput: No value for $TERM and no -T specified\n\nRESULTS:\nRESULTS - date.DateTest.test_date: PASSED (1.99s)\nRESULTS - df.DfTest.test_df: PASSED (0.50s)\nRESULTS - oe_syslog.SyslogTest.test_syslog_running: PASSED (0.50s)\nRESULTS - oe_syslog.SyslogTestConfig.test_syslog_logger: PASSED (1.79s)\nRESULTS - oe_syslog.SyslogTestConfig.test_syslog_restart: PASSED (4.10s)\nRESULTS - oe_syslog.SyslogTestConfig.test_syslog_startup_config: PASSED (11.06s)\nRESULTS - parselogs.ParseLogsTest.test_get_context: PASSED (0.00s)\nRESULTS - parselogs.ParseLogsTest.test_parselogs: PASSED (2.03s)\nRESULTS - ping.PingTest.test_ping: PASSED (0.02s)\nRESULTS - rpm.RpmBasicTest.test_rpm_help: PASSED (0.51s)\nRESULTS - scp.ScpTest.test_scp_file: PASSED (1.08s)\nRESULTS - ssh.SSHTest.test_ssh: PASSED (0.50s)\nRESULTS - weston.WestonTest.test_wayland_info: PASSED (0.50s)\nRESULTS - weston.WestonTest.test_weston_can_initialize_new_wayland_compositor: PASSED (8.19s)\nRESULTS - weston.WestonTest.test_weston_running: PASSED (1.01s)\nRESULTS - weston.WestonTest.test_weston_supports_xwayland: PASSED (0.82s)\nRESULTS - apt.AptRepoTest.test_apt_install_from_repo: SKIPPED (0.00s)\nRESULTS - buildcpio.BuildCpioTest.test_cpio: SKIPPED (0.00s)\nRESULTS - buildgalculator.GalculatorTest.test_galculator: SKIPPED (0.00s)\nRESULTS - buildlzip.BuildLzipTest.test_lzip: SKIPPED (0.00s)\nRESULTS - connman.ConnmanTest.test_connmand_help: SKIPPED (0.00s)\nRESULTS - connman.ConnmanTest.test_connmand_running: SKIPPED (0.00s)\nRESULTS - dnf.DnfBasicTest.test_dnf_help: SKIPPED (0.00s)\nRESULTS - dnf.DnfBasicTest.test_dnf_history: SKIPPED (0.00s)\nRESULTS - dnf.DnfBasicTest.test_dnf_info: SKIPPED (0.00s)\nRESULTS - dnf.DnfBasicTest.test_dnf_search: SKIPPED (0.00s)\nRESULTS - dnf.DnfBasicTest.test_dnf_version: SKIPPED (0.00s)\nRESULTS - dnf.DnfRepoTest.test_dnf_exclude: SKIPPED (0.00s)\nRESULTS - dnf.DnfRepoTest.test_dnf_install: SKIPPED (0.00s)\nRESULTS - dnf.DnfRepoTest.test_dnf_install_dependency: SKIPPED (0.00s)\nRESULTS - dnf.DnfRepoTest.test_dnf_install_from_disk: SKIPPED (0.00s)\nRESULTS - dnf.DnfRepoTest.test_dnf_install_from_http: SKIPPED (0.00s)\nRESULTS - dnf.DnfRepoTest.test_dnf_installroot: SKIPPED (0.00s)\nRESULTS - dnf.DnfRepoTest.test_dnf_installroot_usrmerge: SKIPPED (0.00s)\nRESULTS - dnf.DnfRepoTest.test_dnf_makecache: SKIPPED (0.00s)\nRESULTS - dnf.DnfRepoTest.test_dnf_reinstall: SKIPPED (0.00s)\nRESULTS - dnf.DnfRepoTest.test_dnf_repoinfo: SKIPPED (0.00s)\nRESULTS - gcc.GccCompileTest.test_gcc_compile: SKIPPED (0.00s)\nRESULTS - gcc.GccCompileTest.test_gpp2_compile: SKIPPED (0.00s)\nRESULTS - gcc.GccCompileTest.test_gpp_compile: SKIPPED (0.00s)\nRESULTS - gcc.GccCompileTest.test_make: SKIPPED (0.00s)\nRESULTS - gi.GObjectIntrospectionTest.test_python: SKIPPED (0.00s)\nRESULTS - go.CgoHelloworldTest.test_cgohelloworld: SKIPPED (0.00s)\nRESULTS - go.GoCompileTest.test_go_compile: SKIPPED (0.00s)\nRESULTS - go.GoCompileTest.test_go_module: SKIPPED (0.00s)\nRESULTS - go.GoHelloworldTest.test_gohelloworld: SKIPPED (0.00s)\nRESULTS - kernelmodule.KernelModuleTest.test_kernel_module: SKIPPED (0.00s)\nRESULTS - ldd.LddTest.test_ldd: SKIPPED (0.00s)\nRESULTS - logrotate.LogrotateTest.test_logrotate_newlog: SKIPPED (0.00s)\nRESULTS - logrotate.LogrotateTest.test_logrotate_wtmp: SKIPPED (0.00s)\nRESULTS - opkg.OpkgRepoTest.test_opkg_install_from_repo: SKIPPED (0.00s)\nRESULTS - pam.PamBasicTest.test_pam: SKIPPED (0.00s)\nRESULTS - perl.PerlTest.test_perl_works: SKIPPED (0.00s)\nRESULTS - ptest.PtestRunnerTest.test_ptestrunner_expectfail: SKIPPED (0.00s)\nRESULTS - ptest.PtestRunnerTest.test_ptestrunner_expectsuccess: SKIPPED (0.00s)\nRESULTS - python.PythonTest.test_python3: SKIPPED (0.00s)\nRESULTS - rpm.RpmBasicTest.test_rpm_query: SKIPPED (0.50s)\nRESULTS - rpm.RpmBasicTest.test_rpm_query_nonroot: SKIPPED (0.00s)\nRESULTS - rpm.RpmInstallRemoveTest.test_check_rpm_install_removal_log_file_size: SKIPPED (0.00s)\nRESULTS - rpm.RpmInstallRemoveTest.test_rpm_install: SKIPPED (0.00s)\nRESULTS - rpm.RpmInstallRemoveTest.test_rpm_remove: SKIPPED (0.00s)\nRESULTS - rust.RustCLibExampleTest.test_rust_c_lib_example: SKIPPED (0.00s)\nRESULTS - rust.RustCompileTest.test_cargo_compile: SKIPPED (0.00s)\nRESULTS - rust.RustCompileTest.test_rust_compile: SKIPPED (0.00s)\nRESULTS - stap.StapTest.test_stap: SKIPPED (0.00s)\nRESULTS - systemd.SystemdBasicTests.test_systemd_basic: SKIPPED (0.00s)\nRESULTS - systemd.SystemdBasicTests.test_systemd_failed: SKIPPED (0.00s)\nRESULTS - systemd.SystemdBasicTests.test_systemd_list: SKIPPED (0.00s)\nRESULTS - systemd.SystemdJournalTests.test_systemd_boot_time: SKIPPED (0.00s)\nRESULTS - systemd.SystemdJournalTests.test_systemd_journal: SKIPPED (0.00s)\nRESULTS - systemd.SystemdServiceTests.test_systemd_coredump_minidebuginfo: SKIPPED (0.00s)\nRESULTS - systemd.SystemdServiceTests.test_systemd_disable_enable: SKIPPED (0.00s)\nRESULTS - systemd.SystemdServiceTests.test_systemd_disable_enable_ro: SKIPPED (0.00s)\nRESULTS - systemd.SystemdServiceTests.test_systemd_status: SKIPPED (0.00s)\nRESULTS - systemd.SystemdServiceTests.test_systemd_stop_start: SKIPPED (0.00s)\nRESULTS - xorg.XorgTest.test_xorg_running: SKIPPED (0.00s)\nSUMMARY:\ncore-image-weston () - Ran 76 tests in 35.149s\ncore-image-weston - OK - All required tests passed (successes=16, skipped=60, failures=0, errors=0)\nNOTE: recipe core-image-weston-1.0-r0: task do_testimage: Succeeded\nNOTE: Tasks Summary: Attempted 1528 tasks of which 1526 didn't need to be rerun and all succeeded.\n\nSummary: There was 1 WARNING message.\nSummary: There was 1 ERROR message, returning a non-zero exit code.\n\n\nStderr:\n2026-09-14 01:18:06,360 - oe-selftest - INFO - Adding: \"include selftest.inc\" in /srv/pokybuild/yocto-worker/oe-selftest-fedora/build/build-st-3994809/conf/local.conf\n2026-09-14 01:18:06,361 - oe-selftest - INFO - Adding: \"include bblayers.inc\" in bblayers.conf\n/srv/pokybuild/yocto-worker/oe-selftest-fedora/build/buildtools/sysroots/x86_64-pokysdk-linux/usr/lib/python3.13/unittest/case.py:597: RuntimeWarning: TestResult has no addDuration method\n  warnings.warn(\"TestResult has no addDuration method\",\n\n/srv/pokybuild/yocto-worker/oe-selftest-fedora/build/buildtools/sysroots/x86_64-pokysdk-linux/usr/lib/python3.13/unittest/case.py:597: RuntimeWarning: TestResult has no addDuration method\n  warnings.warn(\"TestResult has no addDuration method\",\n\n/srv/pokybuild/yocto-worker/oe-selftest-fedora/build/buildtools/sysroots/x86_64-pokysdk-linux/usr/lib/python3.13/unittest/case.py:597: RuntimeWarning: TestResult has no addDuration method\n  warnings.warn(\"TestResult has no addDuration method\",\n\n/srv/pokybuild/yocto-worker/oe-selftest-fedora/build/buildtools/sysroots/x86_64-pokysdk-linux/usr/lib/python3.13/unittest/case.py:597: RuntimeWarning: TestResult has no addDuration method\n  warnings.warn(\"TestResult has no addDuration method\",\n\n/srv/pokybuild/yocto-worker/oe-selftest-fedora/build/buildtools/sysroots/x86_64-pokysdk-linux/usr/lib/python3.13/unittest/case.py:597: RuntimeWarning: TestResult has no addDuration method\n  warnings.warn(\"TestResult has no addDuration method\",\n\n/srv/pokybuild/yocto-worker/oe-selftest-fedora/build/buildtools/sysroots/x86_64-pokysdk-linux/usr/lib/python3.13/unittest/case.py:597: RuntimeWarning: TestResult has no addDuration method\n  warnings.warn(\"TestResult has no addDuration method\",\n\nWARNING: test: LICENSE is using \"CLOSED\", which is deprecated. Convert to using a license ref pointing to an actual license file, e.g.\nLICENSE = \"LicenseRef-test-CLOSED\"\nWARNING: test: LICENSE is using \"CLOSED\", which is deprecated. Convert to using a license ref pointing to an actual license file, e.g.\nLICENSE = \"LicenseRef-test-CLOSED\"\nERROR: When reparsing /tmp/selftest-fetchr066bc14/test.bb:do_checkuri, the basehash value changed from cf5cbdc6dee19eec8e0ab7c147e79435436ca4f98353b070a206b72d66c2c748 to 5fc2e5d8a9cfbc8790ff18a3130b8a06335977184d22e2ff79a8f6c41b61a6b0. The metadata is not deterministic and this needs to be fixed.\nERROR: The following commands may help:\nERROR: $ bitbake test -cdo_checkuri -Snone\nERROR: Then:\nERROR: $ bitbake test -cdo_checkuri -Sprintdiff\n\nERROR: When reparsing /tmp/selftest-fetchr066bc14/test.bb:do_fetch, the basehash value changed from ff215cb1adc0a61a280c7a0a3ba5905510882f32d3fac56636234b90a88be118 to 32812182a8721ed3d8a5496e40aafb5936f3d965686e9677863926d520f0bdfc. The metadata is not deterministic and this needs to be fixed.\nERROR: The following commands may help:\nERROR: $ bitbake test -cdo_fetch -Snone\nERROR: Then:\nERROR: $ bitbake test -cdo_fetch -Sprintdiff\n\nERROR: When reparsing /tmp/selftest-fetchr066bc14/test.bb:do_unpack, the basehash value changed from b608ba599130a8bb1efb8d62d4aeeb78c9b688783051e99b8d0c0ce3a7c88916 to 8dfeb4a4688fb92ee953c89ea1db9917036ab0b3a2613ff8de764e33fafc9db5. The metadata is not deterministic and this needs to be fixed.\nERROR: The following commands may help:\nERROR: $ bitbake test -cdo_unpack -Snone\nERROR: Then:\nERROR: $ bitbake test -cdo_unpack -Sprintdiff\n\nERROR: When reparsing /tmp/selftest-fetchr066bc14/test.bb:do_cleanall, the basehash value changed from 01396410d89629f31345dd0c090b4705fd8ff9602b89a06299f867c2eb42abb5 to 7ccd4ffa6bc0d08dc152aa634becb06c88614ebec4660837b92527a8b5cc6e5c. The metadata is not deterministic and this needs to be fixed.\nERROR: The following commands may help:\nERROR: $ bitbake test -cdo_cleanall -Snone\nERROR: Then:\nERROR: $ bitbake test -cdo_cleanall -Sprintdiff\n\nERROR: When reparsing /tmp/selftest-fetchr066bc14/test.bb:do_recipe_qa, the basehash value changed from d40b0c13163b5e96ec4c4843f00692257c21a0b9190ebe4e1a7e3a82e94ea485 to 8f805b46b6656531f8255789bf5819de754cfc74c9b9bbf3d9ebe25169b2cadb. The metadata is not deterministic and this needs to be fixed.\nERROR: The following commands may help:\nERROR: $ bitbake test -cdo_recipe_qa -Snone\nERROR: Then:\nERROR: $ bitbake test -cdo_recipe_qa -Sprintdiff\n\nERROR: When reparsing /tmp/selftest-fetchr066bc14/test.bb:do_populate_lic, the basehash value changed from 3c20358af85dc0f4da44a0adb9585e4e7e535586c95ef6888d75ba8ed16af9a2 to f7fafa0af9cb923c987871db0984bac6513bd7709eec72374af06b15c62ba098. The metadata is not deterministic and this needs to be fixed.\nERROR: The following commands may help:\nERROR: $ bitbake test -cdo_populate_lic -Snone\nERROR: Then:\nERROR: $ bitbake test -cdo_populate_lic -Sprintdiff\n\nERROR: When reparsing /tmp/selftest-fetchr066bc14/test.bb:do_create_spdx, the basehash value changed from 7a7d19266dfe89043b8fd09682dea33e981185d75f9028ecc0ea936e575b7f5b to 7be93a228d3648d382e9e88743715f3f37021345adbfbc549b406a9b4a097e35. The metadata is not deterministic and this needs to be fixed.\nERROR: The following commands may help:\nERROR: $ bitbake test -cdo_create_spdx -Snone\nERROR: Then:\nERROR: $ bitbake test -cdo_create_spdx -Sprintdiff\n\nWARNING: test: LICENSE is using \"CLOSED\", which is deprecated. Convert to using a license ref pointing to an actual license file, e.g.\nLICENSE = \"LicenseRef-test-CLOSED\"\nERROR: When reparsing /tmp/selftest-fetchr066bc14/test.bb:do_checkuri, the basehash value changed from 5fc2e5d8a9cfbc8790ff18a3130b8a06335977184d22e2ff79a8f6c41b61a6b0 to e72dac1bf99cbba0f6b792a038f71d7c07e3cc27dc2043baae03ec487f0ebdaa. The metadata is not deterministic and this needs to be fixed.\nERROR: The following commands may help:\nERROR: $ bitbake test -cdo_checkuri -Snone\nERROR: Then:\nERROR: $ bitbake test -cdo_checkuri -Sprintdiff\n\nERROR: When reparsing /tmp/selftest-fetchr066bc14/test.bb:do_fetch, the basehash value changed from 32812182a8721ed3d8a5496e40aafb5936f3d965686e9677863926d520f0bdfc to 9653a6f3415263e3c8a21ae071c51dd73592f80029c041b83aabcaae6359abf4. The metadata is not deterministic and this needs to be fixed.\nERROR: The following commands may help:\nERROR: $ bitbake test -cdo_fetch -Snone\nERROR: Then:\nERROR: $ bitbake test -cdo_fetch -Sprintdiff\n\nERROR: When reparsing /tmp/selftest-fetchr066bc14/test.bb:do_unpack, the basehash value changed from 8dfeb4a4688fb92ee953c89ea1db9917036ab0b3a2613ff8de764e33fafc9db5 to c1e9f46825023ff23c4fc466eccc386e01a74661b5a4472241d38d769f9a9c59. The metadata is not deterministic and this needs to be fixed.\nERROR: The following commands may help:\nERROR: $ bitbake test -cdo_unpack -Snone\nERROR: Then:\nERROR: $ bitbake test -cdo_unpack -Sprintdiff\n\nERROR: When reparsing /tmp/selftest-fetchr066bc14/test.bb:do_cleanall, the basehash value changed from 7ccd4ffa6bc0d08dc152aa634becb06c88614ebec4660837b92527a8b5cc6e5c to bce0ec8c074ed3641063dc215d193b50dfc1b957c022fbbbd876c012f08fc165. The metadata is not deterministic and this needs to be fixed.\nERROR: The following commands may help:\nERROR: $ bitbake test -cdo_cleanall -Snone\nERROR: Then:\nERROR: $ bitbake test -cdo_cleanall -Sprintdiff\n\nERROR: When reparsing /tmp/selftest-fetchr066bc14/test.bb:do_recipe_qa, the basehash value changed from 8f805b46b6656531f8255789bf5819de754cfc74c9b9bbf3d9ebe25169b2cadb to 91ee055ab12a24e28f18a3185c280fb2287a3d9942a675ea7ea934997ce7925a. The metadata is not deterministic and this needs to be fixed.\nERROR: The following commands may help:\nERROR: $ bitbake test -cdo_recipe_qa -Snone\nERROR: Then:\nERROR: $ bitbake test -cdo_recipe_qa -Sprintdiff\n\nERROR: When reparsing /tmp/selftest-fetchr066bc14/test.bb:do_populate_lic, the basehash value changed from f7fafa0af9cb923c987871db0984bac6513bd7709eec72374af06b15c62ba098 to 3cb62c7d6cac6e975aa9ce11d8abcb1cb6e1739d7ebed0398c8bb16f153dd866. The metadata is not deterministic and this needs to be fixed.\nERROR: The following commands may help:\nERROR: $ bitbake test -cdo_populate_lic -Snone\nERROR: Then:\nERROR: $ bitbake test -cdo_populate_lic -Sprintdiff\n\nERROR: When reparsing /tmp/selftest-fetchr066bc14/test.bb:do_create_spdx, the basehash value changed from 7be93a228d3648d382e9e88743715f3f37021345adbfbc549b406a9b4a097e35 to 824ca2d0ff874e60de27af3e3e41f55e77644d8b9be9aa893ee6a5b3b8461b7c. The metadata is not deterministic and this needs to be fixed.\nERROR: The following commands may help:\nERROR: $ bitbake test -cdo_create_spdx -Snone\nERROR: Then:\nERROR: $ bitbake test -cdo_create_spdx -Sprintdiff\n\nWARNING: test: LICENSE is using \"CLOSED\", which is deprecated. Convert to using a license ref pointing to an actual license file, e.g.\nLICENSE = \"LicenseRef-test-CLOSED\"\nERROR: When reparsing /tmp/selftest-fetchr066bc14/test.bb:do_checkuri, the basehash value changed from e72dac1bf99cbba0f6b792a038f71d7c07e3cc27dc2043baae03ec487f0ebdaa to 261db4eebbd1d6d909256dfbd186d4d697f44f92401c3621d2ac3f18c4206df5. The metadata is not deterministic and this needs to be fixed.\nERROR: The following commands may help:\nERROR: $ bitbake test -cdo_checkuri -Snone\nERROR: Then:\nERROR: $ bitbake test -cdo_checkuri -Sprintdiff\n\nERROR: When reparsing /tmp/selftest-fetchr066bc14/test.bb:do_fetch, the basehash value changed from 9653a6f3415263e3c8a21ae071c51dd73592f80029c041b83aabcaae6359abf4 to 61a0644ebeeeb417de89b733a902a3b3d034ff6e44257ace9e5c62395eb1d012. The metadata is not deterministic and this needs to be fixed.\nERROR: The following commands may help:\nERROR: $ bitbake test -cdo_fetch -Snone\nERROR: Then:\nERROR: $ bitbake test -cdo_fetch -Sprintdiff\n\nERROR: When reparsing /tmp/selftest-fetchr066bc14/test.bb:do_unpack, the basehash value changed from c1e9f46825023ff23c4fc466eccc386e01a74661b5a4472241d38d769f9a9c59 to 3608b030c8c95a7784f40b86ee3d612a172fbe37ac79c5819e5522a625397139. The metadata is not deterministic and this needs to be fixed.\nERROR: The following commands may help:\nERROR: $ bitbake test -cdo_unpack -Snone\nERROR: Then:\nERROR: $ bitbake test -cdo_unpack -Sprintdiff\n\nERROR: When reparsing /tmp/selftest-fetchr066bc14/test.bb:do_cleanall, the basehash value changed from bce0ec8c074ed3641063dc215d193b50dfc1b957c022fbbbd876c012f08fc165 to dcecc6c2b1eb25d072c325b51e33b4a7d2a0d23c0df74522a6c8a6c31363b8df. The metadata is not deterministic and this needs to be fixed.\nERROR: The following commands may help:\nERROR: $ bitbake test -cdo_cleanall -Snone\nERROR: Then:\nERROR: $ bitbake test -cdo_cleanall -Sprintdiff\n\nERROR: When reparsing /tmp/selftest-fetchr066bc14/test.bb:do_recipe_qa, the basehash value changed from 91ee055ab12a24e28f18a3185c280fb2287a3d9942a675ea7ea934997ce7925a to d3d95b0cde89e42596a1ecbda004f2d114d700952a3f81ba20e0c17c09ebce8f. The metadata is not deterministic and this needs to be fixed.\nERROR: The following commands may help:\nERROR: $ bitbake test -cdo_recipe_qa -Snone\nERROR: Then:\nERROR: $ bitbake test -cdo_recipe_qa -Sprintdiff\n\nERROR: When reparsing /tmp/selftest-fetchr066bc14/test.bb:do_populate_lic, the basehash value changed from 3cb62c7d6cac6e975aa9ce11d8abcb1cb6e1739d7ebed0398c8bb16f153dd866 to 3e253d664bcd7ef54ecf8ec8dee99b95ab4ec7c9dd1536b9d954f639c7b9e960. The metadata is not deterministic and this needs to be fixed.\nERROR: The following commands may help:\nERROR: $ bitbake test -cdo_populate_lic -Snone\nERROR: Then:\nERROR: $ bitbake test -cdo_populate_lic -Sprintdiff\n\nERROR: When reparsing /tmp/selftest-fetchr066bc14/test.bb:do_create_spdx, the basehash value changed from 824ca2d0ff874e60de27af3e3e41f55e77644d8b9be9aa893ee6a5b3b8461b7c to c5d8b41d75ff0d22e11e93ee4b4dd0542545ab6e57562f8094ae864e470f2492. The metadata is not deterministic and this needs to be fixed.\nERROR: The following commands may help:\nERROR: $ bitbake test -cdo_create_spdx -Snone\nERROR: Then:\nERROR: $ bitbake test -cdo_create_spdx -Sprintdiff\n\n",
    "status": "FAILED"
   },
   "incompatible_lic.NoGPL3InImagesTests.test_core_image_minimal": {
    "duration": 62.558,
    "status": "PASSED"
   },
   "install.InstallTests.test_gstreamer_plugins": {
    "duration": 112.693,
    "status": "PASSED"
   },
   "install.InstallTests.test_linux_firmware": {
    "duration": 139.54,
    "status": "PASSED"
   },
   "install.InstallTests.test_linux_modules": {
    "duration": 63.826,
    "status": "PASSED"
   },
   "install.InstallTests.test_perl": {
    "duration": 66.151,
    "status": "PASSED"
   },
   "install.InstallTests.test_python": {
    "duration": 56.333,
    "status": "PASSED"
   },
   "intercept.GitCheck.test_git_intercept": {
    "duration": 31.414,
    "status": "PASSED"
   },
   "kerneldevelopment.KernelDev.test_apply_patches": {
    "duration": 107.566,
    "status": "PASSED"
   },
   "kernelmodulesplit.KernelModuleSplit.test_cross_recipe_module_dependency": {
    "duration": 31.99,
    "status": "PASSED"
   },
   "layerappend.LayerAppendTests.test_layer_appends": {
    "duration": 55.621,
    "status": "PASSED"
   },
   "liboe.CopyTreeTests.test_copy_hardlink_tree_count": {
    "duration": 0.01515,
    "status": "PASSED"
   },
   "liboe.CopyTreeTests.test_copy_tree_special": {
    "duration": 0.01085,
    "status": "PASSED"
   },
   "liboe.CopyTreeTests.test_copy_tree_xattr": {
    "duration": 30.728,
    "status": "PASSED"
   },
   "liboe.PathTests.test_canonicalize_empty_string_returns_empty_string": {
    "duration": 0.006163,
    "status": "PASSED"
   },
   "liboe.PathTests.test_canonicalize_empty_token_between_paths_is_dropped": {
    "duration": 0.005443,
    "status": "PASSED"
   },
   "liboe.PathTests.test_canonicalize_multiple_variable_tokens_all_skipped": {
    "duration": 0.00547,
    "status": "PASSED"
   },
   "liboe.PathTests.test_canonicalize_none_returns_empty_string": {
    "duration": 0.005102,
    "status": "PASSED"
   },
   "liboe.PathTests.test_canonicalize_real_path_returned": {
    "duration": 0.005252,
    "status": "PASSED"
   },
   "liboe.PathTests.test_canonicalize_trailing_slash_preserved": {
    "duration": 0.005085,
    "status": "PASSED"
   },
   "liboe.PathTests.test_canonicalize_unexpanded_variable_is_skipped": {
    "duration": 0.00506,
    "status": "PASSED"
   },
   "liboe.PathTests.test_canonicalize_variable_and_trailing_slash_path": {
    "duration": 0.005584,
    "status": "PASSED"
   },
   "liboe.PathTests.test_canonicalize_variable_token_dropped_leaving_real_path": {
    "duration": 0.00491,
    "status": "PASSED"
   },
   "liboe.PathTests.test_is_path_parent_all_paths_must_be_below": {
    "duration": 0.004869,
    "status": "PASSED"
   },
   "liboe.PathTests.test_is_path_parent_child_is_not_parent_of_its_parent": {
    "duration": 0.005013,
    "status": "PASSED"
   },
   "liboe.PathTests.test_is_path_parent_direct_child": {
    "duration": 0.004977,
    "status": "PASSED"
   },
   "liboe.PathTests.test_is_path_parent_no_paths_returns_false": {
    "duration": 0.005136,
    "status": "PASSED"
   },
   "liboe.PathTests.test_is_path_parent_one_path_outside_fails": {
    "duration": 0.005045,
    "status": "PASSED"
   },
   "liboe.PathTests.test_is_path_parent_prefix_string_is_not_a_path_parent": {
    "duration": 0.004959,
    "status": "PASSED"
   },
   "liboe.PathTests.test_is_path_parent_unrelated_path": {
    "duration": 0.005054,
    "status": "PASSED"
   },
   "liboe.PathTests.test_join_absolute_rhs_is_not_special": {
    "duration": 0.005098,
    "status": "PASSED"
   },
   "liboe.PathTests.test_join_empty_leading_component_is_absolute": {
    "duration": 0.004987,
    "status": "PASSED"
   },
   "liboe.PathTests.test_join_pardir_normalised": {
    "duration": 0.00508,
    "status": "PASSED"
   },
   "liboe.PathTests.test_join_redundant_separators_normalised": {
    "duration": 0.004961,
    "status": "PASSED"
   },
   "liboe.PathTests.test_join_two_paths": {
    "duration": 0.005062,
    "status": "PASSED"
   },
   "liboe.PathTests.test_make_relative_symlink_absolute_becomes_relative_and_resolves": {
    "duration": 0.00518,
    "status": "PASSED"
   },
   "liboe.PathTests.test_make_relative_symlink_already_relative_unchanged": {
    "duration": 0.005159,
    "status": "PASSED"
   },
   "liboe.PathTests.test_make_relative_symlink_non_symlink_is_ignored": {
    "duration": 0.005192,
    "status": "PASSED"
   },
   "liboe.PathTests.test_make_relative_symlink_several_levels_deep_becomes_relative": {
    "duration": 0.005334,
    "status": "PASSED"
   },
   "liboe.PathTests.test_realpath_isdir_failure_falls_back_without_nameerror": {
    "duration": 0.005532,
    "status": "PASSED"
   },
   "liboe.PathTests.test_realpath_missing_component_raises_enoent_without_assume_dir": {
    "duration": 0.005083,
    "status": "PASSED"
   },
   "liboe.PathTests.test_realpath_missing_component_tolerated_with_assume_dir": {
    "duration": 0.005113,
    "status": "PASSED"
   },
   "liboe.PathTests.test_realpath_mutual_symlink_cycle_raises_eloop": {
    "duration": 0.005869,
    "status": "PASSED"
   },
   "liboe.PathTests.test_realpath_path_outside_root_raises": {
    "duration": 0.005118,
    "status": "PASSED"
   },
   "liboe.PathTests.test_realpath_plain_path_is_returned": {
    "duration": 0.005153,
    "status": "PASSED"
   },
   "liboe.PathTests.test_realpath_resolves_symlink_below_root": {
    "duration": 0.005094,
    "status": "PASSED"
   },
   "liboe.PathTests.test_realpath_resolves_symlink_several_components_deep": {
    "duration": 0.005305,
    "status": "PASSED"
   },
   "liboe.PathTests.test_realpath_self_referential_symlink_raises_eloop": {
    "duration": 0.005707,
    "status": "PASSED"
   },
   "liboe.PathTests.test_symlink_conflicting_existing_raises": {
    "duration": 0.004974,
    "status": "PASSED"
   },
   "liboe.PathTests.test_symlink_creates_dangling_symlink": {
    "duration": 0.004805,
    "status": "PASSED"
   },
   "liboe.PathTests.test_symlink_creates_symlink": {
    "duration": 0.004857,
    "status": "PASSED"
   },
   "liboe.PathTests.test_symlink_force_does_not_delete_glob_siblings": {
    "duration": 0.004893,
    "status": "PASSED"
   },
   "liboe.PathTests.test_symlink_force_overwrites_existing_symlink": {
    "duration": 0.005036,
    "status": "PASSED"
   },
   "liboe.PathTests.test_symlink_force_replaces_destination_with_glob_metacharacters": {
    "duration": 0.004896,
    "status": "PASSED"
   },
   "liboe.PathTests.test_symlink_force_replaces_existing_directory": {
    "duration": 0.005129,
    "status": "PASSED"
   },
   "liboe.PathTests.test_symlink_matching_existing_is_idempotent": {
    "duration": 0.004887,
    "status": "PASSED"
   },
   "liboe.PathTests.test_which_wild_explicit_search_path": {
    "duration": 0.005097,
    "status": "PASSED"
   },
   "liboe.PathTests.test_which_wild_first_match_per_name_wins": {
    "duration": 0.004992,
    "status": "PASSED"
   },
   "liboe.PathTests.test_which_wild_missing_tool_returns_empty": {
    "duration": 0.004943,
    "status": "PASSED"
   },
   "liboe.PathTests.test_which_wild_wildcard_pattern": {
    "duration": 0.005051,
    "status": "PASSED"
   },
   "liboe.SubprocessTests.test_subprocess_tweak": {
    "duration": 0.01128,
    "status": "PASSED"
   },
   "lic_checksum.LicenseTests.test_checksum_with_space": {
    "duration": 19.81,
    "status": "PASSED"
   },
   "lic_checksum.LicenseTests.test_nonmatching_checksum": {
    "duration": 17.893,
    "status": "PASSED"
   },
   "locales.LocalesTest.test_locales_off": {
    "duration": 72.681,
    "status": "PASSED"
   },
   "locales.LocalesTest.test_locales_on": {
    "duration": 50.929,
    "status": "PASSED"
   },
   "manifest.VerifyManifest.test_SDK_manifest_entries": {
    "duration": 339.4,
    "status": "PASSED"
   },
   "manifest.VerifyManifest.test_image_manifest_entries": {
    "duration": 11.405,
    "status": "PASSED"
   },
   "minidebuginfo.Minidebuginfo.test_minidebuginfo": {
    "duration": 72.603,
    "status": "PASSED"
   },
   "minidebuginfo.Minidebuginfo.test_minidebuginfo_qemu": {
    "duration": 110.823,
    "oetags": [
     "runqemu"
    ],
    "status": "PASSED"
   },
   "multiconfig.MultiConfig.test_multiconfig": {
    "duration": 247.571,
    "status": "PASSED"
   },
   "multiconfig.MultiConfig.test_multiconfig_inlayer": {
    "duration": 41.641,
    "status": "PASSED"
   },
   "multiconfig.MultiConfig.test_multiconfig_reparse": {
    "duration": 72.134,
    "status": "PASSED"
   },
   "newlib.NewlibTest.test_newlib": {
    "duration": 32.857,
    "status": "PASSED"
   },
   "oelib.buildhistory.TestBlobParsing.test_blob_to_dict": {
    "duration": 1.751,
    "status": "PASSED"
   },
   "oelib.buildhistory.TestBlobParsing.test_compare_dict_blobs": {
    "duration": 0.8183,
    "status": "PASSED"
   },
   "oelib.buildhistory.TestBlobParsing.test_compare_dict_blobs_default": {
    "duration": 0.7391,
    "status": "PASSED"
   },
   "oelib.buildhistory.TestFileListCompare.test_compare_file_lists": {
    "duration": 0.1325,
    "status": "PASSED"
   },
   "oelib.elf.TestElf.test_machine_name": {
    "duration": 0.0007682,
    "status": "PASSED"
   },
   "oelib.license.TestComplexCombinations.test_tests": {
    "duration": 0.00251,
    "status": "PASSED"
   },
   "oelib.license.TestIsIncluded.test_tests": {
    "duration": 0.005276,
    "status": "PASSED"
   },
   "oelib.license.TestSimpleCombinations.test_tests": {
    "duration": 0.001415,
    "status": "PASSED"
   },
   "oelib.license.TestSingleLicense.test_invalid_licenses": {
    "duration": 0.0005357,
    "status": "PASSED"
   },
   "oelib.license.TestSingleLicense.test_single_licenses": {
    "duration": 0.0006051,
    "status": "PASSED"
   },
   "oelib.license.TestSort.test_sort": {
    "duration": 0.004984,
    "status": "PASSED"
   },
   "oelib.package.TestCopyDebugSources.test_copydebugsources_copies_files_and_dereferences_links": {
    "duration": 0.00784,
    "status": "PASSED"
   },
   "oelib.package.TestCopyDebugSources.test_copydebugsources_ignores_copy_failure": {
    "duration": 0.00323,
    "status": "PASSED"
   },
   "oelib.package.TestCopyDebugSources.test_copydebugsources_ignores_empty_externalsrc_relocation": {
    "duration": 0.003913,
    "status": "PASSED"
   },
   "oelib.package.TestCopyDebugSources.test_copydebugsources_moves_externalsrc_relocation": {
    "duration": 0.005689,
    "status": "PASSED"
   },
   "oelib.patch.TestGitApplyTree.test_dirty_push_run_false_returns_argv": {
    "duration": 0.2759,
    "status": "PASSED"
   },
   "oelib.patch.TestGitApplyTree.test_fallback_preserves_original_patch_name": {
    "duration": 0.7097,
    "status": "PASSED"
   },
   "oelib.patch.TestGitApplyTree.test_git_am_preserves_original_patch_name": {
    "duration": 0.6998,
    "status": "PASSED"
   },
   "oelib.patch.TestGitApplyTree.test_push_run_false_returns_argv": {
    "duration": 0.4947,
    "status": "PASSED"
   },
   "oelib.patch.TestPatchTree.test_push_run_false_returns_argv": {
    "duration": 0.001036,
    "status": "PASSED"
   },
   "oelib.patch.TestRunCmd.test_runcmd_allows_explicit_shell": {
    "duration": 0.00221,
    "status": "PASSED"
   },
   "oelib.patch.TestRunCmd.test_runcmd_preserves_argv_elements": {
    "duration": 0.01775,
    "status": "PASSED"
   },
   "oelib.patch.TestRunCmd.test_runcmd_reports_exit_status": {
    "duration": 0.01763,
    "status": "PASSED"
   },
   "oelib.patch.TestRunCmd.test_runcmd_wraps_exec_failure": {
    "duration": 0.0009339,
    "status": "PASSED"
   },
   "oelib.path.TestRealPath.test_loop": {
    "duration": 0.00418,
    "status": "PASSED"
   },
   "oelib.path.TestRealPath.test_norm": {
    "duration": 0.003801,
    "status": "PASSED"
   },
   "oelib.path.TestRealPath.test_phys": {
    "duration": 0.002052,
    "status": "PASSED"
   },
   "oelib.types.TestBooleanType.test_bool_equality": {
    "duration": 0.0006645,
    "status": "PASSED"
   },
   "oelib.types.TestBooleanType.test_false": {
    "duration": 0.0008795,
    "status": "PASSED"
   },
   "oelib.types.TestBooleanType.test_invalid": {
    "duration": 0.001111,
    "status": "PASSED"
   },
   "oelib.types.TestBooleanType.test_true": {
    "duration": 0.001293,
    "status": "PASSED"
   },
   "oelib.types.TestList.test_list_nosep": {
    "duration": 0.0005493,
    "status": "PASSED"
   },
   "oelib.types.TestList.test_list_usersep": {
    "duration": 0.0006337,
    "status": "PASSED"
   },
   "oelib.utils.TestDefaultFeatures.test_filter_default_features": {
    "duration": 0.0006797,
    "status": "PASSED"
   },
   "oelib.utils.TestMultiprocessLaunch.test_multiprocesslaunch": {
    "duration": 0.02181,
    "status": "PASSED"
   },
   "oelib.utils.TestPackagesFilterOutSystem.test_filter": {
    "duration": 0.0009942,
    "status": "PASSED"
   },
   "oelib.utils.TestTrimVersion.test_num_exception": {
    "duration": 0.0008798,
    "status": "PASSED"
   },
   "oelib.utils.TestTrimVersion.test_valid": {
    "duration": 0.001153,
    "status": "PASSED"
   },
   "oelib.utils.TestTrimVersion.test_version_exception": {
    "duration": 0.001487,
    "status": "PASSED"
   },
   "oescripts.OEGitproxyTests.test_oegitproxy_help": {
    "duration": 0.07704,
    "status": "PASSED"
   },
   "oescripts.OEGitproxyTests.test_oegitproxy_proxy": {
    "duration": 0.1626,
    "status": "PASSED"
   },
   "oescripts.OEGitproxyTests.test_oegitproxy_proxy_dash": {
    "duration": 0.008925,
    "log": "No \"dash\" found on test system.\n",
    "status": "SKIPPED"
   },
   "oescripts.OEListPackageconfigTests.test_packageconfig_flags_default": {
    "duration": 239.939,
    "status": "PASSED"
   },
   "oescripts.OEListPackageconfigTests.test_packageconfig_flags_help": {
    "duration": 0.1998,
    "status": "PASSED"
   },
   "oescripts.OEListPackageconfigTests.test_packageconfig_flags_option_all": {
    "duration": 242.783,
    "status": "PASSED"
   },
   "oescripts.OEListPackageconfigTests.test_packageconfig_flags_option_flags": {
    "duration": 219.42,
    "status": "PASSED"
   },
   "oescripts.OEListPackageconfigTests.test_packageconfig_flags_options_preferred_only": {
    "duration": 239.541,
    "status": "PASSED"
   },
   "oescripts.OEPybootchartguyTests.test_pybootchartguy_help": {
    "duration": 0.0006461,
    "log": "Python cairo module is not present\n",
    "status": "SKIPPED"
   },
   "oescripts.OEPybootchartguyTests.test_pybootchartguy_to_generate_build_pdf_output": {
    "duration": 0.0008738,
    "log": "Python cairo module is not present\n",
    "status": "SKIPPED"
   },
   "oescripts.OEPybootchartguyTests.test_pybootchartguy_to_generate_build_png_output": {
    "duration": 0.001114,
    "log": "Python cairo module is not present\n",
    "status": "SKIPPED"
   },
   "oescripts.OEPybootchartguyTests.test_pybootchartguy_to_generate_build_svg_output": {
    "duration": 0.001353,
    "log": "Python cairo module is not present\n",
    "status": "SKIPPED"
   },
   "oescripts.OeRunNativeTest.test_oe_run_native": {
    "duration": 16.389,
    "status": "PASSED"
   },
   "overlayfs.OverlayFSEtcRunTimeTests.test_all_required_variables_set": {
    "duration": 242.374,
    "oetags": [
     "runqemu"
    ],
    "status": "PASSED"
   },
   "overlayfs.OverlayFSEtcRunTimeTests.test_image_feature_conflict": {
    "duration": 34.738,
    "oetags": [
     "runqemu"
    ],
    "status": "PASSED"
   },
   "overlayfs.OverlayFSEtcRunTimeTests.test_image_feature_is_missing": {
    "duration": 122.33,
    "oetags": [
     "runqemu"
    ],
    "status": "PASSED"
   },
   "overlayfs.OverlayFSEtcRunTimeTests.test_lower_layer_access": {
    "duration": 108.801,
    "oetags": [
     "runqemu"
    ],
    "status": "PASSED"
   },
   "overlayfs.OverlayFSEtcRunTimeTests.test_postinst_on_target_for_read_only_rootfs": {
    "duration": 95.247,
    "oetags": [
     "runqemu"
    ],
    "status": "PASSED"
   },
   "overlayfs.OverlayFSEtcRunTimeTests.test_sbin_init_original": {
    "duration": 133.93,
    "oetags": [
     "runqemu"
    ],
    "status": "PASSED"
   },
   "overlayfs.OverlayFSEtcRunTimeTests.test_sbin_init_preinit": {
    "duration": 115.388,
    "oetags": [
     "runqemu"
    ],
    "status": "PASSED"
   },
   "overlayfs.OverlayFSEtcRunTimeTests.test_sbin_init_read_only": {
    "duration": 104.748,
    "oetags": [
     "runqemu"
    ],
    "status": "PASSED"
   },
   "overlayfs.OverlayFSTests.test_correct_image_fstab": {
    "duration": 110.153,
    "oetags": [
     "runqemu"
    ],
    "status": "PASSED"
   },
   "overlayfs.OverlayFSTests.test_correct_image_unit": {
    "duration": 73.756,
    "oetags": [
     "runqemu"
    ],
    "status": "PASSED"
   },
   "overlayfs.OverlayFSTests.test_distro_features_missing": {
    "duration": 18.072,
    "status": "PASSED"
   },
   "overlayfs.OverlayFSTests.test_mount_unit_not_set": {
    "duration": 12.366,
    "status": "PASSED"
   },
   "overlayfs.OverlayFSTests.test_not_all_units_installed": {
    "duration": 66.345,
    "status": "PASSED"
   },
   "overlayfs.OverlayFSTests.test_not_all_units_installed_but_qa_skipped": {
    "duration": 76.304,
    "status": "PASSED"
   },
   "overlayfs.OverlayFSTests.test_wrong_mount_unit_set": {
    "duration": 13.403,
    "status": "PASSED"
   },
   "package.PackageTests.test_gdb_hardlink_debug": {
    "duration": 85.935,
    "status": "PASSED"
   },
   "package.PackageTests.test_package_name_conflict": {
    "duration": 18.052,
    "status": "PASSED"
   },
   "package.PackageTests.test_preserve_ownership": {
    "duration": 77.615,
    "status": "PASSED"
   },
   "package.PackageTests.test_preserve_sparse_hardlinks": {
    "duration": 40.168,
    "status": "PASSED"
   },
   "package.VersionOrdering.test_dpkg": {
    "duration": 0.02056,
    "status": "PASSED"
   },
   "package.VersionOrdering.test_opkg": {
    "duration": 0.02276,
    "status": "PASSED"
   },
   "package.VersionOrdering.test_rpm": {
    "duration": 0.1676,
    "status": "PASSED"
   },
   "picolibc.PicolibcTest.test_picolibc": {
    "duration": 0.63,
    "log": "This test only works with machines : qemuarm qemuarm64 qemuriscv32 qemuriscv64\n",
    "status": "SKIPPED"
   },
   "pkgdata.OePkgdataUtilTests.test_find_path": {
    "duration": 2.126,
    "status": "PASSED"
   },
   "pkgdata.OePkgdataUtilTests.test_glob": {
    "duration": 2.414,
    "status": "PASSED"
   },
   "pkgdata.OePkgdataUtilTests.test_list_pkg_files": {
    "duration": 7.663,
    "status": "PASSED"
   },
   "pkgdata.OePkgdataUtilTests.test_list_pkgs": {
    "duration": 8.079,
    "status": "PASSED"
   },
   "pkgdata.OePkgdataUtilTests.test_lookup_pkg": {
    "duration": 6.036,
    "status": "PASSED"
   },
   "pkgdata.OePkgdataUtilTests.test_lookup_recipe": {
    "duration": 2.889,
    "status": "PASSED"
   },
   "pkgdata.OePkgdataUtilTests.test_multilib_variables": {
    "duration": 45.549,
    "status": "PASSED"
   },
   "pkgdata.OePkgdataUtilTests.test_no_param": {
    "duration": 0.06659,
    "status": "PASSED"
   },
   "pkgdata.OePkgdataUtilTests.test_read_value": {
    "duration": 2.917,
    "status": "PASSED"
   },
   "pkgdata.OePkgdataUtilTests.test_specify_pkgdatadir": {
    "duration": 1.086,
    "status": "PASSED"
   },
   "pokybleeding.PokyBleeding.test_poky_bleeding_autorev": {
    "duration": 71.813,
    "status": "PASSED"
   },
   "prservice.BitbakePrTests.test_import_export_override_db": {
    "duration": 163.41,
    "status": "PASSED"
   },
   "prservice.BitbakePrTests.test_import_export_replace_db": {
    "duration": 91.339,
    "status": "PASSED"
   },
   "prservice.BitbakePrTests.test_pr_service_deb_arch_dep": {
    "duration": 62.85,
    "status": "PASSED"
   },
   "prservice.BitbakePrTests.test_pr_service_deb_arch_indep": {
    "duration": 32.533,
    "status": "PASSED"
   },
   "prservice.BitbakePrTests.test_pr_service_ipk_arch_dep": {
    "duration": 62.661,
    "status": "PASSED"
   },
   "prservice.BitbakePrTests.test_pr_service_ipk_arch_indep": {
    "duration": 28.936,
    "status": "PASSED"
   },
   "prservice.BitbakePrTests.test_pr_service_rpm_arch_dep": {
    "duration": 46.01,
    "status": "PASSED"
   },
   "prservice.BitbakePrTests.test_pr_service_rpm_arch_indep": {
    "duration": 27.175,
    "status": "PASSED"
   },
   "prservice.BitbakePrTests.test_stopping_prservice_message": {
    "duration": 0.3068,
    "status": "PASSED"
   },
   "pseudo.Pseudo.test_pseudo_pyc_creation": {
    "duration": 9.609,
    "status": "PASSED"
   },
   "recipetool.RecipetoolAppendTests.test_recipetool_appendfile_add": {
    "duration": 66.66,
    "status": "PASSED"
   },
   "recipetool.RecipetoolAppendTests.test_recipetool_appendfile_add_bindir": {
    "duration": 28.417,
    "status": "PASSED"
   },
   "recipetool.RecipetoolAppendTests.test_recipetool_appendfile_add_machine": {
    "duration": 27.791,
    "status": "PASSED"
   },
   "recipetool.RecipetoolAppendTests.test_recipetool_appendfile_alternatives": {
    "duration": 33.877,
    "status": "PASSED"
   },
   "recipetool.RecipetoolAppendTests.test_recipetool_appendfile_basic": {
    "duration": 30.044,
    "status": "PASSED"
   },
   "recipetool.RecipetoolAppendTests.test_recipetool_appendfile_binary": {
    "duration": 15.711,
    "status": "PASSED"
   },
   "recipetool.RecipetoolAppendTests.test_recipetool_appendfile_extlayer": {
    "duration": 7.867,
    "status": "PASSED"
   },
   "recipetool.RecipetoolAppendTests.test_recipetool_appendfile_inst_func": {
    "duration": 29.919,
    "status": "PASSED"
   },
   "recipetool.RecipetoolAppendTests.test_recipetool_appendfile_inst_glob": {
    "duration": 28.125,
    "status": "PASSED"
   },
   "recipetool.RecipetoolAppendTests.test_recipetool_appendfile_inst_todir_glob": {
    "duration": 28.068,
    "status": "PASSED"
   },
   "recipetool.RecipetoolAppendTests.test_recipetool_appendfile_invalid": {
    "duration": 29.347,
    "status": "PASSED"
   },
   "recipetool.RecipetoolAppendTests.test_recipetool_appendfile_orig": {
    "duration": 28.155,
    "status": "PASSED"
   },
   "recipetool.RecipetoolAppendTests.test_recipetool_appendfile_patch": {
    "duration": 25.39,
    "status": "PASSED"
   },
   "recipetool.RecipetoolAppendTests.test_recipetool_appendfile_postinstall": {
    "duration": 31.257,
    "status": "PASSED"
   },
   "recipetool.RecipetoolAppendTests.test_recipetool_appendfile_renamed": {
    "duration": 24.871,
    "status": "PASSED"
   },
   "recipetool.RecipetoolAppendTests.test_recipetool_appendfile_script": {
    "duration": 24.247,
    "status": "PASSED"
   },
   "recipetool.RecipetoolAppendTests.test_recipetool_appendfile_subdir": {
    "duration": 25.406,
    "status": "PASSED"
   },
   "recipetool.RecipetoolAppendTests.test_recipetool_appendfile_todir": {
    "duration": 24.45,
    "status": "PASSED"
   },
   "recipetool.RecipetoolAppendTests.test_recipetool_appendfile_wildcard": {
    "duration": 13.012,
    "status": "PASSED"
   },
   "recipetool.RecipetoolAppendsrcTests.test_recipetool_appendsrcfile_basic": {
    "duration": 59.519,
    "status": "PASSED"
   },
   "recipetool.RecipetoolAppendsrcTests.test_recipetool_appendsrcfile_basic_wildcard": {
    "duration": 38.526,
    "status": "PASSED"
   },
   "recipetool.RecipetoolAppendsrcTests.test_recipetool_appendsrcfile_existing_in_src_uri": {
    "duration": 20.673,
    "status": "PASSED"
   },
   "recipetool.RecipetoolAppendsrcTests.test_recipetool_appendsrcfile_existing_in_src_uri_diff_params": {
    "duration": 18.605,
    "status": "PASSED"
   },
   "recipetool.RecipetoolAppendsrcTests.test_recipetool_appendsrcfile_machine": {
    "duration": 48.627,
    "status": "PASSED"
   },
   "recipetool.RecipetoolAppendsrcTests.test_recipetool_appendsrcfile_replace_file_srcdir": {
    "duration": 31.033,
    "status": "PASSED"
   },
   "recipetool.RecipetoolAppendsrcTests.test_recipetool_appendsrcfile_srcdir_basic": {
    "duration": 19.498,
    "status": "PASSED"
   },
   "recipetool.RecipetoolAppendsrcTests.test_recipetool_appendsrcfile_subdir_basic": {
    "duration": 29.727,
    "status": "PASSED"
   },
   "recipetool.RecipetoolAppendsrcTests.test_recipetool_appendsrcfile_subdir_basic_dirdest": {
    "duration": 28.269,
    "status": "PASSED"
   },
   "recipetool.RecipetoolAppendsrcTests.test_recipetool_appendsrcfile_update_recipe_basic": {
    "duration": 9.366,
    "status": "PASSED"
   },
   "recipetool.RecipetoolAppendsrcTests.test_recipetool_appendsrcfiles_basic": {
    "duration": 34.666,
    "status": "PASSED"
   },
   "recipetool.RecipetoolAppendsrcTests.test_recipetool_appendsrcfiles_basic_subdir": {
    "duration": 33.71,
    "status": "PASSED"
   },
   "recipetool.RecipetoolCreateTests.test_recipetool_create": {
    "duration": 23.791,
    "status": "PASSED"
   },
   "recipetool.RecipetoolCreateTests.test_recipetool_create_autotools": {
    "duration": 52.883,
    "status": "PASSED"
   },
   "recipetool.RecipetoolCreateTests.test_recipetool_create_cmake": {
    "duration": 22.092,
    "status": "PASSED"
   },
   "recipetool.RecipetoolCreateTests.test_recipetool_create_git_http": {
    "duration": 21.469,
    "status": "PASSED"
   },
   "recipetool.RecipetoolCreateTests.test_recipetool_create_git_srcbranch": {
    "duration": 21.397,
    "status": "PASSED"
   },
   "recipetool.RecipetoolCreateTests.test_recipetool_create_git_srcuri_branch": {
    "duration": 23.373,
    "status": "PASSED"
   },
   "recipetool.RecipetoolCreateTests.test_recipetool_create_git_srcuri_master": {
    "duration": 25.65,
    "status": "PASSED"
   },
   "recipetool.RecipetoolCreateTests.test_recipetool_create_github": {
    "duration": 27.669,
    "status": "PASSED"
   },
   "recipetool.RecipetoolCreateTests.test_recipetool_create_github_tarball": {
    "duration": 28.976,
    "status": "PASSED"
   },
   "recipetool.RecipetoolCreateTests.test_recipetool_create_go": {
    "duration": 37.652,
    "status": "PASSED"
   },
   "recipetool.RecipetoolCreateTests.test_recipetool_create_npm": {
    "duration": 1.264,
    "log": "Test needs meta-oe for nodejs\n",
    "status": "SKIPPED"
   },
   "recipetool.RecipetoolCreateTests.test_recipetool_create_python3_pep517_flit_core_buildapi": {
    "duration": 29.051,
    "status": "PASSED"
   },
   "recipetool.RecipetoolCreateTests.test_recipetool_create_python3_pep517_hatchling": {
    "duration": 27.401,
    "status": "PASSED"
   },
   "recipetool.RecipetoolCreateTests.test_recipetool_create_python3_pep517_maturin": {
    "duration": 22.989,
    "status": "PASSED"
   },
   "recipetool.RecipetoolCreateTests.test_recipetool_create_python3_pep517_mesonpy": {
    "duration": 25.761,
    "status": "PASSED"
   },
   "recipetool.RecipetoolCreateTests.test_recipetool_create_python3_pep517_poetry_core_masonry_api": {
    "duration": 24.879,
    "status": "PASSED"
   },
   "recipetool.RecipetoolCreateTests.test_recipetool_create_python3_pep517_setuptools_build_meta": {
    "duration": 27.589,
    "status": "PASSED"
   },
   "recipetool.RecipetoolCreateTests.test_recipetool_create_python3_pep517_setuptools_build_meta_license_pep639": {
    "duration": 25.519,
    "status": "PASSED"
   },
   "recipetool.RecipetoolCreateTests.test_recipetool_create_python3_pep517_setuptools_build_meta_license_prepep639": {
    "duration": 22.989,
    "status": "PASSED"
   },
   "recipetool.RecipetoolCreateTests.test_recipetool_create_python3_setuptools": {
    "duration": 22.972,
    "status": "PASSED"
   },
   "recipetool.RecipetoolCreateTests.test_recipetool_create_python3_setuptools_pypi": {
    "duration": 44.279,
    "status": "PASSED"
   },
   "recipetool.RecipetoolCreateTests.test_recipetool_create_python3_setuptools_pypi_tarball": {
    "duration": 22.586,
    "status": "PASSED"
   },
   "recipetool.RecipetoolCreateTests.test_recipetool_create_simple": {
    "duration": 20.819,
    "status": "PASSED"
   },
   "recipetool.RecipetoolTests.test_recipetool_handle_license_vars": {
    "duration": 3.037,
    "status": "PASSED"
   },
   "recipetool.RecipetoolTests.test_recipetool_load_plugin": {
    "duration": 9.613,
    "status": "PASSED"
   },
   "recipetool.RecipetoolTests.test_recipetool_split_pkg_licenses": {
    "duration": 0.04097,
    "status": "PASSED"
   },
   "recipeutils.RecipeUtilsTests.test_patch_recipe_appends": {
    "duration": 0.07853,
    "status": "PASSED"
   },
   "recipeutils.RecipeUtilsTests.test_patch_recipe_singleappend": {
    "duration": 0.1052,
    "status": "PASSED"
   },
   "recipeutils.RecipeUtilsTests.test_patch_recipe_varflag": {
    "duration": 0.08767,
    "status": "PASSED"
   },
   "recipeutils.RecipeUtilsTests.test_split_var_value": {
    "duration": 0.006982,
    "status": "PASSED"
   },
   "recipeutils.RecipeUtilsTests.test_validate_pn": {
    "duration": 0.006945,
    "status": "PASSED"
   },
   "reproducible.DiffoscopeTests.test_diffoscope": {
    "log": "Skip by the command line argument \"reproducible\"\n",
    "status": "SKIPPED"
   },
   "reproducible.ReproducibleTests.test_reproducible_builds": {
    "log": "Skip by the command line argument \"reproducible\"\n",
    "status": "SKIPPED"
   },
   "resulttooltests.ResultToolTests.test_can_compare_ltp_tests": {
    "duration": 0.005171,
    "status": "PASSED"
   },
   "resulttooltests.ResultToolTests.test_can_match_non_static_ptest_names": {
    "duration": 0.004698,
    "status": "PASSED"
   },
   "resulttooltests.ResultToolTests.test_can_not_compare_non_ltp_tests": {
    "duration": 0.004602,
    "status": "PASSED"
   },
   "resulttooltests.ResultToolTests.test_junit_empty_testresults": {
    "duration": 0.004667,
    "status": "PASSED"
   },
   "resulttooltests.ResultToolTests.test_junit_log_attached": {
    "duration": 0.004841,
    "status": "PASSED"
   },
   "resulttooltests.ResultToolTests.test_junit_log_inline": {
    "duration": 0.004898,
    "status": "PASSED"
   },
   "resulttooltests.ResultToolTests.test_junit_missing_image_tests": {
    "duration": 0.004866,
    "status": "PASSED"
   },
   "resulttooltests.ResultToolTests.test_junit_missing_ptests": {
    "duration": 0.004843,
    "status": "PASSED"
   },
   "resulttooltests.ResultToolTests.test_machine_matches": {
    "duration": 0.004755,
    "status": "PASSED"
   },
   "resulttooltests.ResultToolTests.test_machine_mismatches": {
    "duration": 0.004744,
    "status": "PASSED"
   },
   "resulttooltests.ResultToolTests.test_merge_can_merged_results": {
    "duration": 0.00474,
    "status": "PASSED"
   },
   "resulttooltests.ResultToolTests.test_metadata_matching_is_only_checked_for_relevant_test_type": {
    "duration": 0.004583,
    "status": "PASSED"
   },
   "resulttooltests.ResultToolTests.test_regression_can_get_regression_base_target_pair": {
    "duration": 0.004669,
    "status": "PASSED"
   },
   "resulttooltests.ResultToolTests.test_regression_can_get_regression_result": {
    "duration": 0.004676,
    "status": "PASSED"
   },
   "resulttooltests.ResultToolTests.test_report_can_aggregate_test_result": {
    "duration": 0.004595,
    "status": "PASSED"
   },
   "resulttooltests.ResultToolTests.test_results_with_matching_metadata_can_be_compared": {
    "duration": 0.004543,
    "status": "PASSED"
   },
   "resulttooltests.ResultToolTests.test_results_with_mismatching_metadata_can_not_be_compared": {
    "duration": 0.004582,
    "status": "PASSED"
   },
   "resulttooltests.ResultToolTests.test_results_without_metadata_can_be_compared": {
    "duration": 0.004554,
    "status": "PASSED"
   },
   "resulttooltests.ResultToolTests.test_target_result_with_missing_metadata_can_not_be_compared": {
    "duration": 0.004695,
    "status": "PASSED"
   },
   "retain.Retain.test_retain_always": {
    "duration": 27.368,
    "status": "PASSED"
   },
   "retain.Retain.test_retain_failure": {
    "duration": 43.055,
    "status": "PASSED"
   },
   "retain.Retain.test_retain_global": {
    "duration": 61.062,
    "status": "PASSED"
   },
   "retain.Retain.test_retain_misc": {
    "duration": 64.841,
    "status": "PASSED"
   },
   "rootfspostcommandstests.ShadowUtilsTidyFiles.test_shadowutils_backup_files": {
    "duration": 21.053,
    "log": "Testcase skipped as 'tidy_shadowutils_files' rootfs post process command is not the set SORT_PASSWD_POSTPROCESS_COMMAND.\n",
    "status": "SKIPPED"
   },
   "rootfspostcommandstests.ShadowUtilsTidyFiles.test_shadowutils_sorted_files": {
    "duration": 6.132,
    "log": "Testcase skipped as 'tidy_shadowutils_files' rootfs post process command is not the set SORT_PASSWD_POSTPROCESS_COMMAND.\n",
    "status": "SKIPPED"
   },
   "rpmtests.BitbakeTests.test_rpm_filenames": {
    "duration": 6.286,
    "status": "PASSED"
   },
   "runcmd.RunCmdTests.test_list_not_found": {
    "duration": 0.006712,
    "status": "PASSED"
   },
   "runcmd.RunCmdTests.test_list_okay": {
    "duration": 0.03154,
    "status": "PASSED"
   },
   "runcmd.RunCmdTests.test_log": {
    "duration": 0.006915,
    "status": "PASSED"
   },
   "runcmd.RunCmdTests.test_log_split": {
    "duration": 0.006625,
    "status": "PASSED"
   },
   "runcmd.RunCmdTests.test_no_shell": {
    "duration": 0.00564,
    "status": "PASSED"
   },
   "runcmd.RunCmdTests.test_output": {
    "duration": 0.006382,
    "status": "PASSED"
   },
   "runcmd.RunCmdTests.test_output_split": {
    "duration": 0.006406,
    "status": "PASSED"
   },
   "runcmd.RunCmdTests.test_result_assertion": {
    "duration": 0.0125,
    "status": "PASSED"
   },
   "runcmd.RunCmdTests.test_result_exception": {
    "duration": 0.00997,
    "status": "PASSED"
   },
   "runcmd.RunCmdTests.test_result_false": {
    "duration": 0.01053,
    "status": "PASSED"
   },
   "runcmd.RunCmdTests.test_result_okay": {
    "duration": 0.009427,
    "status": "PASSED"
   },
   "runcmd.RunCmdTests.test_shell": {
    "duration": 0.01039,
    "status": "PASSED"
   },
   "runcmd.RunCmdTests.test_stdin": {
    "duration": 0.007111,
    "status": "PASSED"
   },
   "runcmd.RunCmdTests.test_stdin_timeout": {
    "duration": 10.006,
    "status": "PASSED"
   },
   "runcmd.RunCmdTests.test_timeout": {
    "duration": 10.007,
    "status": "PASSED"
   },
   "runcmd.RunCmdTests.test_timeout_split": {
    "duration": 10.009,
    "status": "PASSED"
   },
   "runqemu.RunqemuTests.test_boot_compressed_wic_by_path": {
    "duration": 104.127,
    "oetags": [
     "runqemu"
    ],
    "status": "PASSED"
   },
   "runqemu.RunqemuTests.test_boot_compressed_wic_by_recipe": {
    "duration": 30.438,
    "oetags": [
     "runqemu"
    ],
    "status": "PASSED"
   },
   "runqemu.RunqemuTests.test_boot_deploy": {
    "duration": 20.233,
    "oetags": [
     "runqemu"
    ],
    "status": "PASSED"
   },
   "runqemu.RunqemuTests.test_boot_deploy_hddimg": {
    "duration": 20.865,
    "oetags": [
     "runqemu"
    ],
    "status": "PASSED"
   },
   "runqemu.RunqemuTests.test_boot_machine": {
    "duration": 21.88,
    "oetags": [
     "runqemu"
    ],
    "status": "PASSED"
   },
   "runqemu.RunqemuTests.test_boot_machine_ext4": {
    "duration": 23.166,
    "oetags": [
     "runqemu"
    ],
    "status": "PASSED"
   },
   "runqemu.RunqemuTests.test_boot_machine_iso": {
    "duration": 32.007,
    "oetags": [
     "runqemu"
    ],
    "status": "PASSED"
   },
   "runqemu.RunqemuTests.test_boot_machine_slirp": {
    "duration": 22.802,
    "oetags": [
     "runqemu"
    ],
    "status": "PASSED"
   },
   "runqemu.RunqemuTests.test_boot_machine_slirp_qcow2": {
    "duration": 23.226,
    "oetags": [
     "runqemu"
    ],
    "status": "PASSED"
   },
   "runqemu.RunqemuTests.test_boot_qemu_boot": {
    "duration": 19.806,
    "oetags": [
     "runqemu"
    ],
    "status": "PASSED"
   },
   "runqemu.RunqemuTests.test_boot_recipe_image": {
    "duration": 25.273,
    "oetags": [
     "runqemu"
    ],
    "status": "PASSED"
   },
   "runqemu.RunqemuTests.test_boot_recipe_image_vdi": {
    "duration": 27.134,
    "oetags": [
     "runqemu"
    ],
    "status": "PASSED"
   },
   "runqemu.RunqemuTests.test_boot_recipe_image_vmdk": {
    "duration": 27.864,
    "oetags": [
     "runqemu"
    ],
    "status": "PASSED"
   },
   "runqemu.RunqemuTests.test_boot_rootfs": {
    "duration": 20.629,
    "oetags": [
     "runqemu"
    ],
    "status": "PASSED"
   },
   "runtime_test.Postinst.test_failing_postinst": {
    "duration": 185.192,
    "oetags": [
     "runqemu"
    ],
    "status": "PASSED"
   },
   "runtime_test.Postinst.test_postinst_rootfs_and_boot_systemd": {
    "duration": 314.585,
    "oetags": [
     "runqemu"
    ],
    "status": "PASSED"
   },
   "runtime_test.Postinst.test_postinst_rootfs_and_boot_sysvinit": {
    "duration": 233.211,
    "oetags": [
     "runqemu"
    ],
    "status": "PASSED"
   },
   "runtime_test.RustKernel.test_kernel_rust_sample": {
    "duration": 72.642,
    "oetags": [
     "runqemu"
    ],
    "status": "PASSED"
   },
   "runtime_test.SystemTap.test_crosstap_helloworld": {
    "duration": 136.401,
    "oetags": [
     "runqemu"
    ],
    "status": "PASSED"
   },
   "runtime_test.SystemTap.test_crosstap_pstree": {
    "duration": 66.938,
    "oetags": [
     "runqemu"
    ],
    "status": "PASSED"
   },
   "runtime_test.SystemTap.test_crosstap_syscalls_by_pid": {
    "duration": 42.779,
    "oetags": [
     "runqemu"
    ],
    "status": "PASSED"
   },
   "runtime_test.SystemTap.test_crosstap_syscalls_by_proc": {
    "duration": 39.84,
    "oetags": [
     "runqemu"
    ],
    "status": "PASSED"
   },
   "runtime_test.TestExport.test_testexport_basic": {
    "duration": 80.994,
    "oetags": [
     "runqemu"
    ],
    "status": "PASSED"
   },
   "runtime_test.TestExport.test_testexport_sdk": {
    "duration": 81.516,
    "status": "PASSED"
   },
   "runtime_test.TestImage.test_testimage_apt": {
    "duration": 157.106,
    "oetags": [
     "runqemu"
    ],
    "status": "PASSED"
   },
   "runtime_test.TestImage.test_testimage_dnf": {
    "duration": 143.896,
    "oetags": [
     "runqemu"
    ],
    "status": "PASSED"
   },
   "runtime_test.TestImage.test_testimage_install": {
    "duration": 129.406,
    "oetags": [
     "runqemu"
    ],
    "status": "PASSED"
   },
   "runtime_test.TestImage.test_testimage_slirp": {
    "duration": 88.458,
    "oetags": [
     "runqemu"
    ],
    "status": "PASSED"
   },
   "runtime_test.TestImage.test_testimage_virgl_gtk_sdl": {
    "duration": 177.551,
    "oetags": [
     "runqemu"
    ],
    "status": "PASSED"
   },
   "runtime_test.TestImage.test_testimage_virgl_headless": {
    "duration": 0.006916,
    "log": "virgl headless cannot be tested with rocky-8.10\n",
    "oetags": [
     "runqemu"
    ],
    "status": "SKIPPED"
   },
   "rust.RustStaticMuslTest.test_static_musl_linking": {
    "duration": 48.923,
    "status": "PASSED"
   },
   "sdk.SDKTests.test_sdk_manifests": {
    "duration": 368.454,
    "status": "PASSED"
   },
   "sdk.SDKTests.test_sdk_runqemu": {
    "duration": 417.446,
    "status": "PASSED"
   },
   "selftest.ExternalLayer.test_list_imported": {
    "duration": 0.007324,
    "status": "PASSED"
   },
   "signing.LockedSignatures.test_locked_signatures": {
    "duration": 99.867,
    "status": "PASSED"
   },
   "signing.Signing.test_signing_packages": {
    "duration": 121.23,
    "status": "PASSED"
   },
   "signing.Signing.test_signing_sstate_archive": {
    "duration": 137.843,
    "status": "PASSED"
   },
   "spdx.SPDX30Check.test_baremetal_helloworld": {
    "duration": 44.249,
    "status": "PASSED"
   },
   "spdx.SPDX30Check.test_base_files": {
    "duration": 38.45,
    "status": "PASSED"
   },
   "spdx.SPDX30Check.test_core_image_minimal": {
    "duration": 60.542,
    "status": "PASSED"
   },
   "spdx.SPDX30Check.test_core_image_minimal_sdk": {
    "duration": 352.098,
    "status": "PASSED"
   },
   "spdx.SPDX30Check.test_custom_annotation_vars": {
    "duration": 29.572,
    "status": "PASSED"
   },
   "spdx.SPDX30Check.test_download_location_defensive_handling": {
    "duration": 14.569,
    "status": "PASSED"
   },
   "spdx.SPDX30Check.test_extra_opts": {
    "duration": 115.559,
    "status": "PASSED"
   },
   "spdx.SPDX30Check.test_gcc_include_source": {
    "duration": 128.625,
    "status": "PASSED"
   },
   "spdx.SPDX30Check.test_kernel_config_spdx": {
    "duration": 114.502,
    "status": "PASSED"
   },
   "spdx.SPDX30Check.test_packageconfig_spdx": {
    "duration": 21.767,
    "status": "PASSED"
   },
   "spdx.SPDX30Check.test_version_extraction_patterns": {
    "duration": 10.745,
    "status": "PASSED"
   },
   "spdx.SPDX30Check.test_world_sbom": {
    "duration": 35.439,
    "status": "PASSED"
   },
   "sstatetests.SStateCacheManagement.test_sstate_cache_management_script_using_machine": {
    "duration": 128.66,
    "status": "PASSED"
   },
   "sstatetests.SStateCacheManagement.test_sstate_cache_management_script_using_pr_1": {
    "duration": 44.718,
    "status": "PASSED"
   },
   "sstatetests.SStateCacheManagement.test_sstate_cache_management_script_using_pr_2": {
    "duration": 66.652,
    "status": "PASSED"
   },
   "sstatetests.SStateCacheManagement.test_sstate_cache_management_script_using_pr_3": {
    "duration": 111.806,
    "status": "PASSED"
   },
   "sstatetests.SStateCleanup.test_cleansstate_task_distro_nonspecific": {
    "duration": 37.265,
    "status": "PASSED"
   },
   "sstatetests.SStateCleanup.test_cleansstate_task_distro_specific": {
    "duration": 42.359,
    "status": "PASSED"
   },
   "sstatetests.SStateCleanup.test_cleansstate_task_distro_specific_nonspecific": {
    "duration": 43.227,
    "status": "PASSED"
   },
   "sstatetests.SStateCreation.test_sstate_creation_distro_nonspecific": {
    "duration": 34.657,
    "status": "PASSED"
   },
   "sstatetests.SStateCreation.test_sstate_creation_distro_specific": {
    "duration": 36.812,
    "status": "PASSED"
   },
   "sstatetests.SStateDistroTests.test_rebuild_distro_specific_sstate_cross_native_targets": {
    "duration": 52.273,
    "status": "PASSED"
   },
   "sstatetests.SStateDistroTests.test_rebuild_distro_specific_sstate_cross_target": {
    "duration": 51.902,
    "status": "PASSED"
   },
   "sstatetests.SStateDistroTests.test_rebuild_distro_specific_sstate_native_target": {
    "duration": 52.995,
    "status": "PASSED"
   },
   "sstatetests.SStateFindSiginfo.test_sstate_compare_sigfiles_and_find_siginfo": {
    "duration": 1616.852,
    "status": "PASSED"
   },
   "sstatetests.SStateHashSameSigs.test_sstate_32_64_same_hash": {
    "duration": 77.568,
    "status": "PASSED"
   },
   "sstatetests.SStateHashSameSigs.test_sstate_nativelsbstring_same_hash": {
    "duration": 87.744,
    "status": "PASSED"
   },
   "sstatetests.SStateHashSameSigs.test_sstate_sdk_arch_same_hash": {
    "duration": 83.182,
    "status": "PASSED"
   },
   "sstatetests.SStateHashSameSigs2.test_sstate_allarch_samesigs": {
    "duration": 93.415,
    "status": "PASSED"
   },
   "sstatetests.SStateHashSameSigs2.test_sstate_nativesdk_samesigs_multilib": {
    "duration": 126.223,
    "status": "PASSED"
   },
   "sstatetests.SStateHashSameSigs3.test_sstate_multilib_or_not_native_samesigs": {
    "duration": 56.133,
    "status": "PASSED"
   },
   "sstatetests.SStateHashSameSigs3.test_sstate_sametune_samesigs": {
    "duration": 146.855,
    "status": "PASSED"
   },
   "sstatetests.SStateHashSameSigs4.test_sstate_movelayer_samesigs": {
    "duration": 50.811,
    "status": "PASSED"
   },
   "sstatetests.SStateHashSameSigs4.test_sstate_noop_samesigs": {
    "duration": 91.803,
    "status": "PASSED"
   },
   "sstatetests.SStatePrintdiff.test_gcc_runtime_vs_gcc_source": {
    "duration": 2399.524,
    "status": "PASSED"
   },
   "sstatetests.SStatePrintdiff.test_image_minimal_vs_base_do_configure": {
    "duration": 576.475,
    "status": "PASSED"
   },
   "sstatetests.SStatePrintdiff.test_image_minimal_vs_perlcross": {
    "duration": 236.396,
    "status": "PASSED"
   },
   "sstatetests.SStateTests.test_autorev_sstate_works": {
    "duration": 81.832,
    "status": "PASSED"
   },
   "sysroot.SysrootTests.test_sysroot_cleanup": {
    "duration": 54.836,
    "status": "PASSED"
   },
   "sysroot.SysrootTests.test_sysroot_la": {
    "duration": 29.096,
    "status": "PASSED"
   },
   "sysroot.SysrootTests.test_sysroot_max_shebang": {
    "duration": 13.042,
    "status": "PASSED"
   },
   "sysroot.SysrootTests.test_sysroot_pkgconfig": {
    "duration": 29.947,
    "status": "PASSED"
   },
   "systemd_boot.Systemdboot.test_efi_systemdboot_images_can_be_built": {
    "duration": 110.957,
    "status": "PASSED"
   },
   "tinfoil.TinfoilTests.test_datastore_operations": {
    "duration": 0.6297,
    "status": "PASSED"
   },
   "tinfoil.TinfoilTests.test_expand": {
    "duration": 0.5098,
    "status": "PASSED"
   },
   "tinfoil.TinfoilTests.test_getvar": {
    "duration": 1.015,
    "status": "PASSED"
   },
   "tinfoil.TinfoilTests.test_getvar_bb_origenv": {
    "duration": 1.01,
    "status": "PASSED"
   },
   "tinfoil.TinfoilTests.test_list_recipes": {
    "duration": 4.252,
    "status": "PASSED"
   },
   "tinfoil.TinfoilTests.test_parse_recipe": {
    "duration": 4.282,
    "status": "PASSED"
   },
   "tinfoil.TinfoilTests.test_parse_recipe_copy_expand": {
    "duration": 3.627,
    "status": "PASSED"
   },
   "tinfoil.TinfoilTests.test_parse_recipe_custom_data": {
    "duration": 3.869,
    "status": "PASSED"
   },
   "tinfoil.TinfoilTests.test_parse_virtual_recipe": {
    "duration": 5.252,
    "status": "PASSED"
   },
   "tinfoil.TinfoilTests.test_parse_virtual_recipe_custom_data": {
    "duration": 4.608,
    "status": "PASSED"
   },
   "tinfoil.TinfoilTests.test_run_prepared_task": {
    "duration": 47.239,
    "status": "PASSED"
   },
   "tinfoil.TinfoilTests.test_setvariable_clean": {
    "duration": 3.018,
    "status": "PASSED"
   },
   "tinfoil.TinfoilTests.test_variable_history": {
    "duration": 4.507,
    "status": "PASSED"
   },
   "tinfoil.TinfoilTests.test_wait_event": {
    "duration": 2.002,
    "status": "PASSED"
   },
   "toolchain.ToolchainTests.test_toolchain_switching": {
    "duration": 102.53,
    "status": "PASSED"
   },
   "uboot.UBootConfigTest.test_uboot_config_extract": {
    "duration": 17.935,
    "status": "PASSED"
   },
   "uboot.UBootConfigTest.test_uboot_config_extract_error_missing_config": {
    "duration": 16.072,
    "status": "PASSED"
   },
   "uboot.UBootConfigTest.test_uboot_config_extract_error_nothing_set": {
    "duration": 19.804,
    "status": "PASSED"
   },
   "uboot.UBootConfigTest.test_uboot_config_extract_error_set_both_config_and_machine": {
    "duration": 15.418,
    "status": "PASSED"
   },
   "uboot.UBootConfigTest.test_uboot_config_extract_error_set_uboot_config_binary": {
    "duration": 14.864,
    "status": "PASSED"
   },
   "uboot.UBootConfigTest.test_uboot_config_extract_error_set_uboot_config_fragments": {
    "duration": 15.397,
    "status": "PASSED"
   },
   "uboot.UBootConfigTest.test_uboot_config_extract_error_set_uboot_config_image_fstypes": {
    "duration": 14.794,
    "status": "PASSED"
   },
   "uboot.UBootConfigTest.test_uboot_config_extract_error_set_uboot_config_make_opts": {
    "duration": 15.436,
    "status": "PASSED"
   },
   "uboot.UBootConfigTest.test_uboot_config_extract_legacy": {
    "duration": 19.953,
    "status": "PASSED"
   },
   "uboot.UBootConfigTest.test_uboot_config_extract_single_config": {
    "duration": 19.963,
    "status": "PASSED"
   },
   "uboot.UBootTest.test_boot_uboot": {
    "duration": 0.0005248,
    "log": "Test skipped on x86_64\n",
    "oetags": [
     "runqemu"
    ],
    "status": "SKIPPED"
   },
   "uboot.UBootTest.test_boot_uboot_kvm_to_full_target": {
    "duration": 0.0007231,
    "log": "Test skipped on x86_64\n",
    "oetags": [
     "runqemu"
    ],
    "status": "SKIPPED"
   },
   "uboot.UBootTest.test_uboot_config_initial_env_binary": {
    "duration": 29.879,
    "status": "PASSED"
   },
   "uboot.UBootTest.test_uboot_initial_env_binary": {
    "duration": 25.06,
    "status": "PASSED"
   },
   "uki.UkiTest.test_uki_boot_systemd": {
    "duration": 144.413,
    "oetags": [
     "runqemu"
    ],
    "status": "PASSED"
   },
   "uki.UkiTest.test_uki_sysvinit": {
    "duration": 123.178,
    "oetags": [
     "runqemu"
    ],
    "status": "PASSED"
   },
   "usergrouptests.UserGroupTests.test_add_task_between_p_sysroot_and_package": {
    "duration": 16.571,
    "status": "PASSED"
   },
   "usergrouptests.UserGroupTests.test_group_from_dep_package": {
    "duration": 26.281,
    "status": "PASSED"
   },
   "usergrouptests.UserGroupTests.test_postinst_order": {
    "duration": 9.661,
    "status": "PASSED"
   },
   "usergrouptests.UserGroupTests.test_static_useradd_from_dynamic": {
    "duration": 117.281,
    "status": "PASSED"
   },
   "usergrouptests.UserGroupTests.test_useradd_depends_only": {
    "duration": 9.226,
    "status": "PASSED"
   },
   "wic.CLITests.test_createhelp": {
    "duration": 58.118,
    "status": "PASSED"
   },
   "wic.CLITests.test_help": {
    "duration": 4.008,
    "status": "PASSED"
   },
   "wic.CLITests.test_help_create": {
    "duration": 3.931,
    "status": "PASSED"
   },
   "wic.CLITests.test_help_kickstart": {
    "duration": 4.119,
    "status": "PASSED"
   },
   "wic.CLITests.test_help_list": {
    "duration": 4.76,
    "status": "PASSED"
   },
   "wic.CLITests.test_help_overview": {
    "duration": 4.986,
    "status": "PASSED"
   },
   "wic.CLITests.test_help_plugins": {
    "duration": 3.816,
    "status": "PASSED"
   },
   "wic.CLITests.test_list_images": {
    "duration": 7.459,
    "status": "PASSED"
   },
   "wic.CLITests.test_list_source_plugins": {
    "duration": 6.014,
    "status": "PASSED"
   },
   "wic.CLITests.test_listed_images_help": {
    "duration": 56.251,
    "status": "PASSED"
   },
   "wic.CLITests.test_listhelp": {
    "duration": 3.161,
    "status": "PASSED"
   },
   "wic.CLITests.test_no_command": {
    "duration": 4.01,
    "status": "PASSED"
   },
   "wic.CLITests.test_unsupported_subcommand": {
    "duration": 3.398,
    "status": "PASSED"
   },
   "wic.CLITests.test_version": {
    "duration": 3.984,
    "status": "PASSED"
   },
   "wic.ModifyTests.test_wic_cp": {
    "duration": 86.754,
    "status": "PASSED"
   },
   "wic.ModifyTests.test_wic_cp_ext": {
    "duration": 46.028,
    "status": "PASSED"
   },
   "wic.ModifyTests.test_wic_ls": {
    "duration": 29.977,
    "status": "PASSED"
   },
   "wic.ModifyTests.test_wic_ls_ext": {
    "duration": 27.615,
    "status": "PASSED"
   },
   "wic.ModifyTests.test_wic_rm": {
    "duration": 40.523,
    "status": "PASSED"
   },
   "wic.ModifyTests.test_wic_rm_ext": {
    "duration": 39.549,
    "status": "PASSED"
   },
   "wic.Wic.test_bootloader_config": {
    "duration": 137.04,
    "status": "PASSED"
   },
   "wic.Wic.test_build_artifacts": {
    "duration": 27.64,
    "status": "PASSED"
   },
   "wic.Wic.test_build_image_name": {
    "duration": 24.442,
    "status": "PASSED"
   },
   "wic.Wic.test_build_rootfs_long": {
    "duration": 61.607,
    "status": "PASSED"
   },
   "wic.Wic.test_build_rootfs_short": {
    "duration": 35.911,
    "status": "PASSED"
   },
   "wic.Wic.test_change_directory": {
    "duration": 22.448,
    "status": "PASSED"
   },
   "wic.Wic.test_change_directory_errors": {
    "duration": 40.024,
    "status": "PASSED"
   },
   "wic.Wic.test_compress_bzip2": {
    "duration": 24.639,
    "status": "PASSED"
   },
   "wic.Wic.test_compress_gzip": {
    "duration": 23.08,
    "status": "PASSED"
   },
   "wic.Wic.test_compress_xz": {
    "duration": 29.607,
    "status": "PASSED"
   },
   "wic.Wic.test_debug_long": {
    "duration": 27.067,
    "status": "PASSED"
   },
   "wic.Wic.test_debug_short": {
    "duration": 27.828,
    "status": "PASSED"
   },
   "wic.Wic.test_default_output_dir": {
    "duration": 71.642,
    "status": "PASSED"
   },
   "wic.Wic.test_efi_bootpart": {
    "duration": 49.577,
    "status": "PASSED"
   },
   "wic.Wic.test_exclude_path": {
    "duration": 34.291,
    "status": "PASSED"
   },
   "wic.Wic.test_exclude_path_errors": {
    "duration": 43.039,
    "status": "PASSED"
   },
   "wic.Wic.test_exclude_path_with_extra_space": {
    "duration": 79.353,
    "status": "PASSED"
   },
   "wic.Wic.test_extra_space": {
    "duration": 24.68,
    "status": "PASSED"
   },
   "wic.Wic.test_gpt_image": {
    "duration": 25.396,
    "status": "PASSED"
   },
   "wic.Wic.test_grub_install_pcbios": {
    "duration": 87.067,
    "status": "PASSED"
   },
   "wic.Wic.test_include_path": {
    "duration": 28.96,
    "status": "PASSED"
   },
   "wic.Wic.test_include_path_embeded": {
    "duration": 29.561,
    "status": "PASSED"
   },
   "wic.Wic.test_include_path_errors": {
    "duration": 68.421,
    "status": "PASSED"
   },
   "wic.Wic.test_iso_image": {
    "duration": 94.672,
    "status": "PASSED"
   },
   "wic.Wic.test_kernel_install": {
    "duration": 34.257,
    "status": "PASSED"
   },
   "wic.Wic.test_mkefidisk": {
    "duration": 27.98,
    "status": "PASSED"
   },
   "wic.Wic.test_no_fstab_update": {
    "duration": 41.965,
    "status": "PASSED"
   },
   "wic.Wic.test_no_fstab_update_errors": {
    "duration": 44.721,
    "status": "PASSED"
   },
   "wic.Wic.test_no_table": {
    "duration": 27.25,
    "status": "PASSED"
   },
   "wic.Wic.test_partition_hidden_attributes": {
    "duration": 31.924,
    "status": "PASSED"
   },
   "wic.Wic.test_permissions": {
    "duration": 239.942,
    "status": "PASSED"
   },
   "wic.Wic.test_qemux86_directdisk": {
    "duration": 22.855,
    "status": "PASSED"
   },
   "wic.Wic.test_rootfs_artifacts": {
    "duration": 53.689,
    "status": "PASSED"
   },
   "wic.Wic.test_rootfs_indirect_recipes": {
    "duration": 23.587,
    "status": "PASSED"
   },
   "wic.Wic.test_sdimage_bootpart": {
    "duration": 40.123,
    "status": "PASSED"
   },
   "wic.Wic.test_skip_build_check_long": {
    "duration": 22.974,
    "status": "PASSED"
   },
   "wic.Wic.test_skip_build_check_short": {
    "duration": 23.543,
    "status": "PASSED"
   },
   "wic.Wic.test_skip_kernel_install": {
    "duration": 33.861,
    "status": "PASSED"
   },
   "wic.Wic.test_systemd_bootdisk": {
    "duration": 77.458,
    "status": "PASSED"
   },
   "wic.Wic.test_wic_sector_size_cli": {
    "duration": 66.561,
    "status": "PASSED"
   },
   "wic.Wic.test_wic_sector_size_env": {
    "duration": 56.462,
    "status": "PASSED"
   },
   "wic.Wic.test_wrong_compressor": {
    "duration": 3.524,
    "status": "PASSED"
   },
   "wic.Wic2.test_biosplusefi_plugin": {
    "duration": 156.063,
    "status": "PASSED"
   },
   "wic.Wic2.test_biosplusefi_plugin_qemu": {
    "duration": 48.478,
    "oetags": [
     "runqemu"
    ],
    "status": "PASSED"
   },
   "wic.Wic2.test_bmap_long": {
    "duration": 24.268,
    "status": "PASSED"
   },
   "wic.Wic2.test_bmap_short": {
    "duration": 22.724,
    "status": "PASSED"
   },
   "wic.Wic2.test_diskid_on_gpt_partition": {
    "duration": 28.614,
    "status": "PASSED"
   },
   "wic.Wic2.test_diskid_on_msdos_partition": {
    "duration": 27.558,
    "status": "PASSED"
   },
   "wic.Wic2.test_efi_plugin_plain_systemd_boot_qemu_aarch64": {
    "duration": 0.0007703,
    "log": "Test skipped on x86_64\n",
    "oetags": [
     "runqemu"
    ],
    "status": "SKIPPED"
   },
   "wic.Wic2.test_efi_plugin_plain_systemd_boot_qemu_x86": {
    "duration": 135.872,
    "oetags": [
     "runqemu"
    ],
    "status": "PASSED"
   },
   "wic.Wic2.test_efi_plugin_unified_kernel_image_qemu": {
    "duration": 118.992,
    "oetags": [
     "runqemu"
    ],
    "status": "PASSED"
   },
   "wic.Wic2.test_empty_plugin": {
    "duration": 69.701,
    "status": "PASSED"
   },
   "wic.Wic2.test_empty_zeroize_plugin": {
    "duration": 40.977,
    "status": "PASSED"
   },
   "wic.Wic2.test_expand_mbr_image": {
    "duration": 78.931,
    "oetags": [
     "runqemu"
    ],
    "status": "PASSED"
   },
   "wic.Wic2.test_extra_filesystem_space": {
    "duration": 27.602,
    "status": "PASSED"
   },
   "wic.Wic2.test_extra_partition_plugin": {
    "duration": 65.451,
    "status": "PASSED"
   },
   "wic.Wic2.test_extra_partition_space": {
    "duration": 29.842,
    "status": "PASSED"
   },
   "wic.Wic2.test_fixed_size": {
    "duration": 25.893,
    "status": "PASSED"
   },
   "wic.Wic2.test_fixed_size_error": {
    "duration": 24.428,
    "status": "PASSED"
   },
   "wic.Wic2.test_fs_types": {
    "duration": 23.567,
    "status": "PASSED"
   },
   "wic.Wic2.test_gpt_partition_name": {
    "duration": 65.952,
    "status": "PASSED"
   },
   "wic.Wic2.test_image_bootpart_globbed": {
    "duration": 41.69,
    "status": "PASSED"
   },
   "wic.Wic2.test_image_env": {
    "duration": 43.129,
    "status": "PASSED"
   },
   "wic.Wic2.test_image_vars_dir_long": {
    "duration": 7.755,
    "status": "PASSED"
   },
   "wic.Wic2.test_image_vars_dir_short": {
    "duration": 9.221,
    "status": "PASSED"
   },
   "wic.Wic2.test_kickstart_parser": {
    "duration": 23.744,
    "status": "PASSED"
   },
   "wic.Wic2.test_mkfs_extraopts": {
    "duration": 25.285,
    "status": "PASSED"
   },
   "wic.Wic2.test_offset": {
    "duration": 141.016,
    "status": "PASSED"
   },
   "wic.Wic2.test_qemu": {
    "duration": 99.226,
    "oetags": [
     "runqemu"
    ],
    "status": "PASSED"
   },
   "wic.Wic2.test_qemu_efi": {
    "duration": 82.863,
    "oetags": [
     "runqemu"
    ],
    "status": "PASSED"
   },
   "wic.Wic2.test_rawcopy_plugin": {
    "duration": 77.723,
    "status": "PASSED"
   },
   "wic.Wic2.test_rawcopy_plugin_qemu": {
    "duration": 90.464,
    "oetags": [
     "runqemu"
    ],
    "status": "PASSED"
   },
   "wic.Wic2.test_rawcopy_plugin_unpack": {
    "duration": 74.654,
    "status": "PASSED"
   },
   "wic.Wic2.test_uefi_kernel": {
    "duration": 74.563,
    "status": "PASSED"
   },
   "wic.Wic2.test_wic_image_type": {
    "duration": 30.595,
    "status": "PASSED"
   },
   "wrapper.WrapperTests.test_shebang_wrapper": {
    "duration": 25.299,
    "status": "PASSED"
   },
   "yoctotestresultsquerytests.TestResultsQueryTests.test_create_workdir": {
    "duration": 2.97,
    "status": "PASSED"
   },
   "yoctotestresultsquerytests.TestResultsQueryTests.test_get_sha1": {
    "duration": 0.06946,
    "status": "PASSED"
   }
  }
 }
}